buildr-ci mailing list archives

Site index · List index
Message view « Date » · « Thread »
Top « Date » · « Thread »
From Apache Hudson Server <hud...@hudson.apache.org>
Subject Build failed in Hudson: buildr-ci-build-jruby #103
Date Sun, 03 Oct 2010 17:26:33 GMT
See <https://hudson.apache.org/hudson/job/buildr-ci-build-jruby/103/changes>

Changes:

[boisvert] Add comment re: ScalaTestAntTask

[boisvert] ScalaTestTask now deprecated in scalaTest 1.2;  use ScalaTestAntTask instead

[boisvert] Cosmetic fix

------------------------------------------
[...truncated 49 lines...]
Caused by: java.lang.ClassNotFoundException: org.example.NonExistentMain
	at java.net.URLClassLoader$1.run(URLClassLoader.java:202)
	at java.security.AccessController.doPrivileged(Native Method)
	at java.net.URLClassLoader.findClass(URLClassLoader.java:190)
	at java.lang.ClassLoader.loadClass(ClassLoader.java:307)
	at sun.misc.Launcher$AppClassLoader.loadClass(Launcher.java:301)
	at java.lang.ClassLoader.loadClass(ClassLoader.java:248)
Could not find the main class: org.example.NonExistentMain.  Program will exit.
...........................................................................................................................................................................................................................................................................................................
   [junit] Test FailingTest FAILED
    [junit] Test FailingTest FAILED
.....    [junit] Tests FAILED
............[Parser] Running:
  foo

PASSED: annotated

===============================================
    Command line test
    Tests run: 1, Failures: 0, Skips: 0
===============================================


===============================================
foo
Total tests run: 1, Failures: 0, Skips: 0
===============================================

[org.testng.internal.PoolService] Shutting down poolservice org.testng.internal.PoolService@39d85f79
terminated:false
[Parser] Running:
  foo


===============================================
    Command line test
    Tests run: 0, Failures: 0, Skips: 0
===============================================


===============================================
foo
Total tests run: 0, Failures: 0, Skips: 0
===============================================

[org.testng.internal.PoolService] Shutting down poolservice org.testng.internal.PoolService@eb64435
terminated:false
......[Parser] Running:
  foo

PASSED: testNothing

===============================================
    Command line test
    Tests run: 1, Failures: 0, Skips: 0
===============================================


===============================================
foo
Total tests run: 1, Failures: 0, Skips: 0
===============================================

[org.testng.internal.PoolService] Shutting down poolservice org.testng.internal.PoolService@68fe748f
terminated:false
[Parser] Running:
  foo

FAILED: testNothing
java.lang.AssertionError: 
	at FailingTest.testNothing(FailingTest.java:4)
... Removed 25 stack frames

===============================================
    Command line test
    Tests run: 1, Failures: 1, Skips: 0
===============================================


===============================================
foo
Total tests run: 1, Failures: 1, Skips: 0
===============================================

[org.testng.internal.PoolService] Shutting down poolservice org.testng.internal.PoolService@6b4da8f4
terminated:false
[Parser] Running:
  foo

..FAILED: testNothing
java.lang.AssertionError: 
	at FailingTest1.testNothing(FailingTest1.java:4)
... Removed 25 stack frames
FAILED: testNothing
java.lang.AssertionError: 
	at FailingTest2.testNothing(FailingTest2.java:4)
... Removed 25 stack frames

===============================================
    Command line test
    Tests run: 2, Failures: 2, Skips: 0
===============================================


===============================================
foo
Total tests run: 2, Failures: 2, Skips: 0
===============================================

[org.testng.internal.PoolService] Shutting down poolservice org.testng.internal.PoolService@7bc9a690
terminated:false
[Parser] Running:
  foo

FAILED: testNothing
java.lang.AssertionError: 
	at FailingTest.testNothing(FailingTest.java:4)
... Removed 25 stack frames

===============================================
    Command line test
    Tests run: 1, Failures: 1, Skips: 0
===============================================


===============================================
foo
Total tests run: 1, Failures: 1, Skips: 0
===============================================

[org.testng.internal.PoolService] Shutting down poolservice org.testng.internal.PoolService@19968e23
terminated:false
[Parser] Running:
  foo

PASSED: testNothing

===============================================
    Command line test
    Tests run: 1, Failures: 0, Skips: 0
===============================================


===============================================
foo
Total tests run: 1, Failures: 0, Skips: 0
===============================================

[org.testng.internal.PoolService] Shutting down poolservice org.testng.internal.PoolService@68fe748f
terminated:false
..................Expectations ..
Time: 0.0060s

Total: 1. Success!
.
Time: 0.0070s

Total: 1. Success!
...............................................................................All checks
passed.
..........mkdir -p <https://hudson.apache.org/hudson/job/buildr-ci-build-jruby/ws/tmp/home>
mkdir -p <https://hudson.apache.org/hudson/job/buildr-ci-build-jruby/ws/tmp/home/.buildr>
................................................................................<https://hudson.apache.org/hudson/job/buildr-ci-build-jruby/ws/tmp/failed.java>:1:
class, interface, or enum expected
not a class         
^
<https://hudson.apache.org/hudson/job/buildr-ci-build-jruby/ws/tmp/failed.java>:1: reached
end of file while parsing
not a class         
           ^
2 errors
................................javadoc: warning - No source files for package Test.java
javadoc: warning - No source files for package Test.java
javadoc: error - No public or protected classes found to document.
1 error
2 warnings
.................................................................................................................................*........................................................................................................................................................................................................................................mkdir
-p <https://hudson.apache.org/hudson/job/buildr-ci-build-jruby/ws/tmp/home>
mkdir -p <https://hudson.apache.org/hudson/job/buildr-ci-build-jruby/ws/tmp/home/.buildr>
mkdir -p <https://hudson.apache.org/hudson/job/buildr-ci-build-jruby/ws/tmp/home>
mkdir -p <https://hudson.apache.org/hudson/job/buildr-ci-build-jruby/ws/tmp/home/.buildr>
mkdir -p <https://hudson.apache.org/hudson/job/buildr-ci-build-jruby/ws/tmp/home>
mkdir -p <https://hudson.apache.org/hudson/job/buildr-ci-build-jruby/ws/tmp/home/.buildr>
.................................ERROR:  While executing gem ... (Gem::FilePermissionError)
    You don't have write permissions into the /home/toulmean/buildr-gems directory.
.......................................................................................................................................................................................rm
-rf <https://hudson.apache.org/hudson/job/buildr-ci-build-jruby/ws/tmp/reports/junit>
rm -rf <https://hudson.apache.org/hudson/job/buildr-ci-build-jruby/ws/tmp/target/junit-failed>
mkdir -p <https://hudson.apache.org/hudson/job/buildr-ci-build-jruby/ws/tmp/reports/junit>
touch <https://hudson.apache.org/hudson/job/buildr-ci-build-jruby/ws/tmp/reports/junit/last_successful_run>
.......rm -rf <https://hudson.apache.org/hudson/job/buildr-ci-build-jruby/ws/tmp/reports/junit>
rm -rf <https://hudson.apache.org/hudson/job/buildr-ci-build-jruby/ws/tmp/target/junit-failed>
mkdir -p <https://hudson.apache.org/hudson/job/buildr-ci-build-jruby/ws/tmp/target>
..........rm -rf <https://hudson.apache.org/hudson/job/buildr-ci-build-jruby/ws/tmp/reports/junit>
rm -rf <https://hudson.apache.org/hudson/job/buildr-ci-build-jruby/ws/tmp/target/junit-failed>
mkdir -p <https://hudson.apache.org/hudson/job/buildr-ci-build-jruby/ws/tmp/target>
...................................................................................................
   [junit] Test FailingTest FAILED
..    [junit] Test FailingTest FAILED
.....................................................................................................................................................................................................................................................................................................................................................................................................................................................................................................................................................................................................................................................................................................No
known dependencies. Compiling everything
.No known dependencies. Compiling everything
Run starting. Expected test count is: 1
Suite Starting - MySuite
Test Starting - MySuite: addition
Test Succeeded - MySuite: addition
Suite Completed - MySuite
Run completed in 18 seconds, 878 milliseconds.
Total number of tests run: 1
Suites: completed 1, aborted 0
Tests: succeeded 1, failed 0, ignored 0, pending 0
All tests passed.
.No known dependencies. Compiling everything
.No known dependencies. Compiling everything
Run starting. Expected test count is: 1
Suite Starting - InnerClassTest
Test Starting - InnerClassTest: addition
Test Succeeded - InnerClassTest: addition
Suite Completed - InnerClassTest
Run completed in 30 seconds, 75 milliseconds.
Total number of tests run: 1
Suites: completed 1, aborted 0
Tests: succeeded 1, failed 0, ignored 0, pending 0
All tests passed.
.No known dependencies. Compiling everything
Run starting. Expected test count is: 1
Suite Starting - PassingSuite
Test Starting - PassingSuite: addition
scala.actors.Actor$$anon$1@1af96c11: caught java.lang.OutOfMemoryError: Java heap space
java.lang.OutOfMemoryError: Java heap space
	at java.util.Hashtable.rehash(Hashtable.java:356)
	at java.util.Hashtable.put(Hashtable.java:412)
	at java.util.Properties.load0(Properties.java:376)
	at java.util.Properties.load(Properties.java:325)
	at java.util.PropertyResourceBundle.<init>(PropertyResourceBundle.java:111)
	at java.util.ResourceBundle$Control.newBundle(ResourceBundle.java:2334)
	at java.util.ResourceBundle.loadBundle(ResourceBundle.java:1364)
	at java.util.ResourceBundle.findBundle(ResourceBundle.java:1328)
	at java.util.ResourceBundle.findBundle(ResourceBundle.java:1282)
	at java.util.ResourceBundle.findBundle(ResourceBundle.java:1282)
	at java.util.ResourceBundle.getBundleImpl(ResourceBundle.java:1224)
	at java.util.ResourceBundle.getBundle(ResourceBundle.java:705)
	at org.scalatest.Resources$.apply(Resources.scala:28)
	at org.scalatest.Resources$.makeString(Resources.scala:31)
	at org.scalatest.Resources$.apply(Resources.scala:36)
	at org.scalatest.tools.PrintReporter.stringToPrintWhenNoError(PrintReporter.scala:291)
	at org.scalatest.tools.PrintReporter.apply(PrintReporter.scala:363)
	at org.scalatest.DispatchReporter$$anonfun$1$$anonfun$apply$1$$anonfun$apply$2.apply(DispatchReporter.scala:152)
	at org.scalatest.DispatchReporter$$anonfun$1$$anonfun$apply$1$$anonfun$apply$2.apply(DispatchReporter.scala:151)
	at scala.collection.LinearSeqOptimized$class.foreach(LinearSeqOptimized.scala:61)
	at scala.collection.immutable.List.foreach(List.scala:45)
	at org.scalatest.DispatchReporter$$anonfun$1$$anonfun$apply$1.apply(DispatchReporter.scala:151)
	at org.scalatest.DispatchReporter$$anonfun$1$$anonfun$apply$1.apply(DispatchReporter.scala:101)
	at scala.actors.Actor$class.receive(Actor.scala:524)
	at scala.actors.Actor$$anon$1.receive(Actor.scala:134)
	at scala.actors.Actor$.receive(Actor.scala:189)
	at org.scalatest.DispatchReporter$$anonfun$1.apply(DispatchReporter.scala:101)
	at org.scalatest.DispatchReporter$$anonfun$1.apply(DispatchReporter.scala:50)
	at scala.Function0$class.apply$mcV$sp(Function0.scala:39)
	at scala.runtime.AbstractFunction0.apply$mcV$sp(AbstractFunction0.scala:17)
	at scala.actors.Actor$$anon$1.act(Actor.scala:135)
	at scala.actors.Reactor$$anonfun$dostart$1.apply(Reactor.scala:222)
Build timed out. Aborting
Recording test results


Mime
View raw message