buildr-ci mailing list archives

Site index · List index
Message view « Date » · « Thread »
Top « Date » · « Thread »
From Apache Hudson Server <hud...@hudson.apache.org>
Subject Build failed in Hudson: Buildr-ci-build-jruby-win32 #61
Date Tue, 21 Sep 2010 19:46:48 GMT
See <https://hudson.apache.org/hudson/job/Buildr-ci-build-jruby-win32/61/changes>

Changes:

[boisvert] Upgrade to RJB 1.2.9

[toulmean] fix for highlight of doc

[boisvert] BUILDR-513 --trace fails with NoMethodError : undefined method `include?' for nil:NilClass

[boisvert] BUILDR-512 Buildr::Util.ruby invokes non existent method (Peter Donald)

------------------------------------------
[...truncated 73 lines...]
	from C:/hudson/hudson-slave/workspace/Buildr-ci-build-jruby-win32/tmp/target/spec/runner.rb:23
	from C:/hudson/hudson-slave/workspace/Buildr-ci-build-jruby-win32/tmp/target/spec/runner.rb:23:in
`each'
	from C:/hudson/hudson-slave/workspace/Buildr-ci-build-jruby-win32/tmp/target/spec/runner.rb:23
FC:/hudson/hudson-slave/workspace/Buildr-ci-build-jruby-win32/tmp/target/spec/runner.rb:9:in
`gem': Expected JRuby version 1.5.2 installed at C:\\hudson\\tools\\jruby-1.5.1 but got 1.5.1
(RuntimeError)
	from C:/hudson/hudson-slave/workspace/Buildr-ci-build-jruby-win32/tmp/target/spec/runner.rb:23
	from C:/hudson/hudson-slave/workspace/Buildr-ci-build-jruby-win32/tmp/target/spec/runner.rb:23:in
`each'
	from C:/hudson/hudson-slave/workspace/Buildr-ci-build-jruby-win32/tmp/target/spec/runner.rb:23
F...........Expectations ........
Time: 0.028s

Total: 1. Success!
.
Time: 0.025s

Total: 1. Success!
...................................All checks passed.
.Buildfile: C:\hudson\hudson-slave\workspace\Buildr-ci-build-jruby-win32\tmp\build.xml

dist:

BUILD SUCCESSFUL
Total time: 1 second
Buildfile: C:\hudson\hudson-slave\workspace\Buildr-ci-build-jruby-win32\tmp\build.xml

dist:

BUILD SUCCESSFUL
Total time: 0 seconds
.......Creating destination directory: "C:/hudson/hudson-slave/workspace/Buildr-ci-build-jruby-win32/tmp/doc\"
Creating destination directory: "C:/hudson/hudson-slave/workspace/Buildr-ci-build-jruby-win32/tmp/doc\"
.Creating destination directory: "C:/hudson/hudson-slave/workspace/Buildr-ci-build-jruby-win32/tmp/doc\"
............mkdir -p C:/hudson/hudson-slave/workspace/Buildr-ci-build-jruby-win32/tmp/home
mkdir -p C:/hudson/hudson-slave/workspace/Buildr-ci-build-jruby-win32/tmp/home/.buildr
...............................................javadoc: warning - No source files for package
Test.java
javadoc: warning - No source files for package Test.java
javadoc: error - No public or protected classes found to document.
1 error
2 warnings
.........incorrect classpath: src/dependency
.....incorrect classpath: src/test
...mkdir -p C:/hudson/hudson-slave/workspace/Buildr-ci-build-jruby-win32/tmp/home
mkdir -p C:/hudson/hudson-slave/workspace/Buildr-ci-build-jruby-win32/tmp/home/.buildr
...............................................javadoc: warning - No source files for package
Test.java
javadoc: warning - No source files for package Test.java
javadoc: error - No public or protected classes found to document.
1 error
2 warnings
....................................................mkdir -p C:/hudson/hudson-slave/workspace/Buildr-ci-build-jruby-win32/tmp/home
mkdir -p C:/hudson/hudson-slave/workspace/Buildr-ci-build-jruby-win32/tmp/home/.buildr
.................................javadoc: warning - No source files for package Test.java
javadoc: warning - No source files for package Test.java
javadoc: error - No public or protected classes found to document.
1 error
2 warnings
.....................................................................................................................................................................................................................................................................................................
   [junit] Test FailingTest FAILED
.    [junit] Test FailingTest FAILED
.....    [junit] Tests FAILED
.............[Parser] Running:
  foo

.PASSED: annotated

===============================================
    Command line test
    Tests run: 1, Failures: 0, Skips: 0
===============================================


===============================================
foo
Total tests run: 1, Failures: 0, Skips: 0
===============================================

[org.testng.internal.PoolService] Shutting down poolservice org.testng.internal.PoolService@68fe748f
terminated:false
..[Parser] Running:
  foo


===============================================
    Command line test
    Tests run: 0, Failures: 0, Skips: 0
===============================================


===============================================
foo
Total tests run: 0, Failures: 0, Skips: 0
===============================================

[org.testng.internal.PoolService] Shutting down poolservice org.testng.internal.PoolService@366025e7
terminated:false
.[Parser] Running:
  foo

PASSED: testNothing

===============================================
    Command line test
    Tests run: 1, Failures: 0, Skips: 0
===============================================


===============================================
foo
Total tests run: 1, Failures: 0, Skips: 0
===============================================

[org.testng.internal.PoolService] Shutting down poolservice org.testng.internal.PoolService@485329c5
terminated:false
.[Parser] Running:
  foo

FAILED: testNothing
java.lang.AssertionError: 
	at FailingTest.testNothing(FailingTest.java:4)
... Removed 25 stack frames

===============================================
    Command line test
    Tests run: 1, Failures: 1, Skips: 0
===============================================


===============================================
foo
Total tests run: 1, Failures: 1, Skips: 0
===============================================

[org.testng.internal.PoolService] Shutting down poolservice org.testng.internal.PoolService@31f26605
terminated:false
[Parser] Running:
  foo

.FAILED: testNothing
java.lang.AssertionError: 
	at FailingTest1.testNothing(FailingTest1.java:4)
... Removed 25 stack frames
FAILED: testNothing
java.lang.AssertionError: 
	at FailingTest2.testNothing(FailingTest2.java:4)
... Removed 25 stack frames

===============================================
    Command line test
    Tests run: 2, Failures: 2, Skips: 0
===============================================


===============================================
foo
Total tests run: 2, Failures: 2, Skips: 0
===============================================

[org.testng.internal.PoolService] Shutting down poolservice org.testng.internal.PoolService@57bcc0bc
terminated:false
[Parser] Running:
  foo

.FAILED: testNothing
java.lang.AssertionError: 
	at FailingTest.testNothing(FailingTest.java:4)
... Removed 25 stack frames

===============================================
    Command line test
    Tests run: 1, Failures: 1, Skips: 0
===============================================


===============================================
foo
Total tests run: 1, Failures: 1, Skips: 0
===============================================

[org.testng.internal.PoolService] Shutting down poolservice org.testng.internal.PoolService@31f26605
terminated:false
[Parser] Running:
  foo

PASSED: testNothing

===============================================
    Command line test
    Tests run: 1, Failures: 0, Skips: 0
===============================================


===============================================
foo
Total tests run: 1, Failures: 0, Skips: 0
===============================================

[org.testng.internal.PoolService] Shutting down poolservice org.testng.internal.PoolService@485329c5
terminated:false
..........................................................................................................................................................................................................................................................................................................................................................................................................................................................No
known dependencies. Compiling everything
Specification "MySpecs"
  it should
  + add

Total for specification "MySpecs":
Finished in 0 second, 689 ms
1 example, 1 expectation, 0 failure, 0 error

.No known dependencies. Compiling everything
Specification "MySpecs"
  it should
  + add

Total for specification "MySpecs":
Finished in 0 second, 777 ms
1 example, 1 expectation, 0 failure, 0 error

.No known dependencies. Compiling everything
Specification "PassingSpecs"
  it should
  + add

Total for specification "PassingSpecs":
Finished in 0 second, 630 ms
1 example, 1 expectation, 0 failure, 0 error

.No known dependencies. Compiling everything
Specification "StringSpecs"
  empty string should
  x have a zero length
    '0' is not equal to '1' (StringSpecs.scala:7)

Total for specification "StringSpecs":
Finished in 0 second, 515 ms
1 example, 1 expectation, 1 failure, 0 error

.......No known dependencies. Compiling everything
No known dependencies. Compiling everything
.No known dependencies. Compiling everything
.No known dependencies. Compiling everything
.........No known dependencies. Compiling everything
No known dependencies. Compiling everything
.No known dependencies. Compiling everything
.No known dependencies. Compiling everything
..mkdir -p C:/hudson/hudson-slave/workspace/Buildr-ci-build-jruby-win32/tmp/home
mkdir -p C:/hudson/hudson-slave/workspace/Buildr-ci-build-jruby-win32/tmp/home/.buildr
..............................No known dependencies. Compiling everything
.No known dependencies. Compiling everything
Run starting. Expected test count is: 1
Suite Starting - MySuite
Test Starting - MySuite: addition
Test Succeeded - MySuite: addition
Suite Completed - MySuite
Run completed in 522 milliseconds.
Total number of tests run: 1
Suites: completed 1, aborted 0
Tests: succeeded 1, failed 0, ignored 0, pending 0
All tests passed.
.Build timed out. Aborting
Recording test results


Mime
View raw message