buildr-ci mailing list archives

Site index · List index
Message view « Date » · « Thread »
Top « Date » · « Thread »
From Apache Hudson Server <hud...@hudson.apache.org>
Subject Build failed in Hudson: Buildr-ci-build-jruby-win32 #63
Date Thu, 30 Sep 2010 06:59:20 GMT
See <https://hudson.apache.org/hudson/job/Buildr-ci-build-jruby-win32/63/changes>

Changes:

[boisvert] BUILDR-518 Load _buildr.rb or .buildr.rb from same directory as Buildfile if they
exist (Peter Donald)

[boisvert] BUILDR-519 Load repositories.release_to from build settings (Peter Donald)

------------------------------------------
[...truncated 81 lines...]
Time: 0.036s

Total: 1. Success!
.......
Time: 0.021s

Total: 1. Success!
..................................All checks passed.
Buildfile: C:\hudson\hudson-slave\workspace\Buildr-ci-build-jruby-win32\tmp\build.xml

dist:

BUILD SUCCESSFUL
Total time: 0 seconds
Buildfile: C:\hudson\hudson-slave\workspace\Buildr-ci-build-jruby-win32\tmp\build.xml
.
dist:

BUILD SUCCESSFUL
Total time: 0 seconds
Creating destination directory: "C:/hudson/hudson-slave/workspace/Buildr-ci-build-jruby-win32/tmp/doc\"
Creating destination directory: "C:/hudson/hudson-slave/workspace/Buildr-ci-build-jruby-win32/tmp/doc\"
Creating destination directory: "C:/hudson/hudson-slave/workspace/Buildr-ci-build-jruby-win32/tmp/doc\"
..........mkdir -p C:/hudson/hudson-slave/workspace/Buildr-ci-build-jruby-win32/tmp/home
mkdir -p C:/hudson/hudson-slave/workspace/Buildr-ci-build-jruby-win32/tmp/home/.buildr
..................................................incorrect classpath: src/dependency
incorrect classpath: src/test
mkdir -p C:/hudson/hudson-slave/workspace/Buildr-ci-build-jruby-win32/tmp/home
mkdir -p C:/hudson/hudson-slave/workspace/Buildr-ci-build-jruby-win32/tmp/home/.buildr
...........................................................................mkdir -p C:/hudson/hudson-slave/workspace/Buildr-ci-build-jruby-win32/tmp/home
mkdir -p C:/hudson/hudson-slave/workspace/Buildr-ci-build-jruby-win32/tmp/home/.buildr
.................................................................................................................................................................................................................................................................................................................
   [junit] Test FailingTest FAILED
.    [junit] Test FailingTest FAILED
.....    [junit] Tests FAILED
...........[Parser] Running:
  foo

PASSED: annotated

===============================================
    Command line test
    Tests run: 1, Failures: 0, Skips: 0
===============================================


===============================================
foo
Total tests run: 1, Failures: 0, Skips: 0
===============================================

[org.testng.internal.PoolService] Shutting down poolservice org.testng.internal.PoolService@26544ec1
terminated:false
.....[Parser] Running:
  foo


===============================================
    Command line test
    Tests run: 0, Failures: 0, Skips: 0
===============================================


===============================================
foo
Total tests run: 0, Failures: 0, Skips: 0
===============================================

[org.testng.internal.PoolService] Shutting down poolservice org.testng.internal.PoolService@366025e7
terminated:false
[Parser] Running:
  foo

PASSED: testNothing

===============================================
    Command line test
    Tests run: 1, Failures: 0, Skips: 0
===============================================


===============================================
foo
Total tests run: 1, Failures: 0, Skips: 0
===============================================

[org.testng.internal.PoolService] Shutting down poolservice org.testng.internal.PoolService@485329c5
terminated:false
.[Parser] Running:
  foo

FAILED: testNothing
java.lang.AssertionError: 
	at FailingTest.testNothing(FailingTest.java:4)
... Removed 25 stack frames

===============================================
    Command line test
    Tests run: 1, Failures: 1, Skips: 0
===============================================


===============================================
foo
Total tests run: 1, Failures: 1, Skips: 0
===============================================

[org.testng.internal.PoolService] Shutting down poolservice org.testng.internal.PoolService@31f26605
terminated:false
..[Parser] Running:
  foo

FAILED: testNothing
java.lang.AssertionError: 
	at FailingTest1.testNothing(FailingTest1.java:4)
... Removed 25 stack frames
FAILED: testNothing
java.lang.AssertionError: 
	at FailingTest2.testNothing(FailingTest2.java:4)
... Removed 25 stack frames

===============================================
    Command line test
    Tests run: 2, Failures: 2, Skips: 0
===============================================


===============================================
foo
Total tests run: 2, Failures: 2, Skips: 0
===============================================

[org.testng.internal.PoolService] Shutting down poolservice org.testng.internal.PoolService@57bcc0bc
terminated:false
[Parser] Running:
  foo

.FAILED: testNothing
java.lang.AssertionError: 
	at FailingTest.testNothing(FailingTest.java:4)
... Removed 25 stack frames

===============================================
    Command line test
    Tests run: 1, Failures: 1, Skips: 0
===============================================


===============================================
foo
Total tests run: 1, Failures: 1, Skips: 0
===============================================

[org.testng.internal.PoolService] Shutting down poolservice org.testng.internal.PoolService@31f26605
terminated:false
..[Parser] Running:
  foo

PASSED: testNothing

===============================================
    Command line test
    Tests run: 1, Failures: 0, Skips: 0
===============================================


===============================================
foo
Total tests run: 1, Failures: 0, Skips: 0
===============================================

[org.testng.internal.PoolService] Shutting down poolservice org.testng.internal.PoolService@485329c5
terminated:false
.........................................................................................................................................................................................................................................................................................................................................................................................................................................................No
known dependencies. Compiling everything
Specification "MySpecs"
  it should
  + add

Total for specification "MySpecs":
Finished in 0 second, 106 ms
1 example, 1 expectation, 0 failure, 0 error

.No known dependencies. Compiling everything
Specification "MySpecs"
  it should
  + add

Total for specification "MySpecs":
Finished in 0 second, 119 ms
1 example, 1 expectation, 0 failure, 0 error

.No known dependencies. Compiling everything
Specification "PassingSpecs"
  it should
  + add

Total for specification "PassingSpecs":
Finished in 0 second, 98 ms
1 example, 1 expectation, 0 failure, 0 error

.No known dependencies. Compiling everything
Specification "StringSpecs"
  empty string should
  x have a zero length
    '0' is not equal to '1' (StringSpecs.scala:7)

Total for specification "StringSpecs":
Finished in 0 second, 96 ms
1 example, 1 expectation, 1 failure, 0 error

.......No known dependencies. Compiling everything
No known dependencies. Compiling everything
.No known dependencies. Compiling everything
.No known dependencies. Compiling everything
.........No known dependencies. Compiling everything
No known dependencies. Compiling everything
.No known dependencies. Compiling everything
.No known dependencies. Compiling everything
..mkdir -p C:/hudson/hudson-slave/workspace/Buildr-ci-build-jruby-win32/tmp/home
mkdir -p C:/hudson/hudson-slave/workspace/Buildr-ci-build-jruby-win32/tmp/home/.buildr
..................................No known dependencies. Compiling everything
.No known dependencies. Compiling everything
Run starting. Expected test count is: 1
Suite Starting - MySuite
Test Starting - MySuite: addition
Test Succeeded - MySuite: addition
Suite Completed - MySuite
Run completed in 471 milliseconds.
Total number of tests run: 1
Suites: completed 1, aborted 0
Tests: succeeded 1, failed 0, ignored 0, pending 0
All tests passed.
.No known dependencies. Compiling everything
.No known dependencies. Compiling everything
Run starting. Expected test count is: 1
Suite Starting - InnerClassTest
Test Starting - InnerClassTest: addition
Test Succeeded - InnerClassTest: addition
Suite Completed - InnerClassTest
Run completed in 355 milliseconds.
Total number of tests run: 1
Suites: completed 1, aborted 0
Tests: succeeded 1, failed 0, ignored 0, pending 0
All tests passed.
.No known dependencies. Compiling everything
Run starting. Expected test count is: 1
Suite Starting - PassingSuite
Test Starting - PassingSuite: addition
Test Succeeded - PassingSuite: addition
Suite Completed - PassingSuite
Run completed in 231 milliseconds.
Total number of tests run: 1
Suites: completed 1, aborted 0
Tests: succeeded 1, failed 0, ignored 0, pending 0
All tests passed.
.Build timed out. Aborting
Recording test results


Mime
View raw message