buildr-ci mailing list archives

Site index · List index
Message view « Date » · « Thread »
Top « Date » · « Thread »
From Apache Hudson Server <hud...@hudson.zones.apache.org>
Subject Build failed in Hudson: Buildr-ci-build #66
Date Fri, 16 Jul 2010 22:04:35 GMT
See <http://hudson.zones.apache.org/hudson/job/Buildr-ci-build/66/changes>

Changes:

[toulmean] path_to_bin should use normalize_path

------------------------------------------
[...truncated 807 lines...]
<http://hudson.zones.apache.org/hudson/job/Buildr-ci-build/ws/lib/buildr/core/application.rb>:146:in
`switch_to_namespace'
<http://hudson.zones.apache.org/hudson/job/Buildr-ci-build/ws/lib/buildr/core/project.rb>:635:in
`execute'
<http://hudson.zones.apache.org/hudson/job/Buildr-ci-build/ws/lib/buildr/core/application.rb>:636:in
`invoke_with_call_chain'
/usr/lib/ruby/1.8/monitor.rb:242:in `synchronize'
<http://hudson.zones.apache.org/hudson/job/Buildr-ci-build/ws/lib/buildr/core/application.rb>:622:in
`invoke_with_call_chain'
<http://hudson.zones.apache.org/hudson/job/Buildr-ci-build/ws/lib/buildr/core/application.rb>:617:in
`invoke'
./spec/groovy/../spec_helpers.rb:348:in `define'
./spec/groovy/../spec_helpers.rb:348:in `tap'
./spec/groovy/../spec_helpers.rb:348:in `define'
./spec/java/bdd_spec.rb:63:in `foo'
./spec/java/bdd_spec.rb:238:
/home/toulmean/buildr-gems/gems/rspec-1.2.9/lib/spec/example/example_methods.rb:40:in `instance_eval'
/home/toulmean/buildr-gems/gems/rspec-1.2.9/lib/spec/example/example_methods.rb:40:in `execute'
/usr/lib/ruby/1.8/timeout.rb:53:in `timeout'
/home/toulmean/buildr-gems/gems/rspec-1.2.9/lib/spec/example/example_methods.rb:37:in `execute'
/home/toulmean/buildr-gems/gems/rspec-1.2.9/lib/spec/example/example_group_methods.rb:214:in
`run_examples'
/home/toulmean/buildr-gems/gems/rspec-1.2.9/lib/spec/example/example_group_methods.rb:212:in
`each'
/home/toulmean/buildr-gems/gems/rspec-1.2.9/lib/spec/example/example_group_methods.rb:212:in
`run_examples'
/home/toulmean/buildr-gems/gems/rspec-1.2.9/lib/spec/example/example_group_methods.rb:103:in
`run'
/home/toulmean/buildr-gems/gems/rspec-1.2.9/lib/spec/runner/example_group_runner.rb:23:in
`run'
/home/toulmean/buildr-gems/gems/rspec-1.2.9/lib/spec/runner/example_group_runner.rb:22:in
`each'
/home/toulmean/buildr-gems/gems/rspec-1.2.9/lib/spec/runner/example_group_runner.rb:22:in
`run'
/home/toulmean/buildr-gems/gems/rspec-1.2.9/lib/spec/runner/options.rb:151:in `run_examples'
/home/toulmean/buildr-gems/gems/rspec-1.2.9/lib/spec/runner/command_line.rb:9:in `run'
/home/toulmean/buildr-gems/gems/rspec-1.2.9/bin/spec:5:

15)
'Buildr::JtestR should run rspecs' FAILED
expected [] to include "<http://hudson.zones.apache.org/hudson/job/Buildr-ci-build/ws/tmp/src/spec/ruby/success_spec.rb">
/home/toulmean/buildr-gems/gems/rspec-1.2.9/lib/spec/expectations/fail_with.rb:41:in `fail_with'
/home/toulmean/buildr-gems/gems/rspec-1.2.9/lib/spec/expectations/handler.rb:21:in `handle_matcher'
/home/toulmean/buildr-gems/gems/rspec-1.2.9/lib/spec/expectations/extensions/kernel.rb:27:in
`should'
./spec/java/bdd_spec.rb:259:
./spec/java/bdd_spec.rb:66:in `instance_eval'
./spec/java/bdd_spec.rb:66:in `foo'
<http://hudson.zones.apache.org/hudson/job/Buildr-ci-build/ws/lib/buildr/core/project.rb>:225:in
`instance_exec'
<http://hudson.zones.apache.org/hudson/job/Buildr-ci-build/ws/lib/buildr/core/project.rb>:225:in
`define'
/home/toulmean/buildr-gems/gems/rake-0.8.7/lib/rake.rb:636:in `call'
/home/toulmean/buildr-gems/gems/rake-0.8.7/lib/rake.rb:636:in `execute_without_a_record'
/home/toulmean/buildr-gems/gems/rake-0.8.7/lib/rake.rb:631:in `each'
/home/toulmean/buildr-gems/gems/rake-0.8.7/lib/rake.rb:631:in `execute_without_a_record'
./spec/groovy/../spec_helpers.rb:154:in `execute'
<http://hudson.zones.apache.org/hudson/job/Buildr-ci-build/ws/lib/buildr/core/project.rb>:636:in
`execute'
<http://hudson.zones.apache.org/hudson/job/Buildr-ci-build/ws/lib/buildr/core/application.rb>:146:in
`switch_to_namespace'
<http://hudson.zones.apache.org/hudson/job/Buildr-ci-build/ws/lib/buildr/core/project.rb>:635:in
`execute'
<http://hudson.zones.apache.org/hudson/job/Buildr-ci-build/ws/lib/buildr/core/application.rb>:636:in
`invoke_with_call_chain'
/usr/lib/ruby/1.8/monitor.rb:242:in `synchronize'
<http://hudson.zones.apache.org/hudson/job/Buildr-ci-build/ws/lib/buildr/core/application.rb>:622:in
`invoke_with_call_chain'
<http://hudson.zones.apache.org/hudson/job/Buildr-ci-build/ws/lib/buildr/core/application.rb>:617:in
`invoke'
./spec/groovy/../spec_helpers.rb:348:in `define'
./spec/groovy/../spec_helpers.rb:348:in `tap'
./spec/groovy/../spec_helpers.rb:348:in `define'
./spec/java/bdd_spec.rb:63:in `foo'
./spec/java/bdd_spec.rb:255:
/home/toulmean/buildr-gems/gems/rspec-1.2.9/lib/spec/example/example_methods.rb:40:in `instance_eval'
/home/toulmean/buildr-gems/gems/rspec-1.2.9/lib/spec/example/example_methods.rb:40:in `execute'
/usr/lib/ruby/1.8/timeout.rb:53:in `timeout'
/home/toulmean/buildr-gems/gems/rspec-1.2.9/lib/spec/example/example_methods.rb:37:in `execute'
/home/toulmean/buildr-gems/gems/rspec-1.2.9/lib/spec/example/example_group_methods.rb:214:in
`run_examples'
/home/toulmean/buildr-gems/gems/rspec-1.2.9/lib/spec/example/example_group_methods.rb:212:in
`each'
/home/toulmean/buildr-gems/gems/rspec-1.2.9/lib/spec/example/example_group_methods.rb:212:in
`run_examples'
/home/toulmean/buildr-gems/gems/rspec-1.2.9/lib/spec/example/example_group_methods.rb:103:in
`run'
/home/toulmean/buildr-gems/gems/rspec-1.2.9/lib/spec/runner/example_group_runner.rb:23:in
`run'
/home/toulmean/buildr-gems/gems/rspec-1.2.9/lib/spec/runner/example_group_runner.rb:22:in
`each'
/home/toulmean/buildr-gems/gems/rspec-1.2.9/lib/spec/runner/example_group_runner.rb:22:in
`run'
/home/toulmean/buildr-gems/gems/rspec-1.2.9/lib/spec/runner/options.rb:151:in `run_examples'
/home/toulmean/buildr-gems/gems/rspec-1.2.9/lib/spec/runner/command_line.rb:9:in `run'
/home/toulmean/buildr-gems/gems/rspec-1.2.9/bin/spec:5:

16)
RuntimeError in 'Buildr::JBehave should include classes whose name ends with Behavior'
Tests failed!
<http://hudson.zones.apache.org/hudson/job/Buildr-ci-build/ws/lib/buildr/core/test.rb>:531:in
`run_tests'
<http://hudson.zones.apache.org/hudson/job/Buildr-ci-build/ws/lib/buildr/core/test.rb>:242:in
`initialize'
/home/toulmean/buildr-gems/gems/rake-0.8.7/lib/rake.rb:636:in `call'
/home/toulmean/buildr-gems/gems/rake-0.8.7/lib/rake.rb:636:in `execute_without_a_record'
/home/toulmean/buildr-gems/gems/rake-0.8.7/lib/rake.rb:631:in `each'
/home/toulmean/buildr-gems/gems/rake-0.8.7/lib/rake.rb:631:in `execute_without_a_record'
./spec/groovy/../spec_helpers.rb:154:in `execute'
<http://hudson.zones.apache.org/hudson/job/Buildr-ci-build/ws/lib/buildr/core/test.rb>:270:in
`execute'
<http://hudson.zones.apache.org/hudson/job/Buildr-ci-build/ws/lib/buildr/core/application.rb>:636:in
`invoke_with_call_chain'
/usr/lib/ruby/1.8/monitor.rb:242:in `synchronize'
<http://hudson.zones.apache.org/hudson/job/Buildr-ci-build/ws/lib/buildr/core/application.rb>:622:in
`invoke_with_call_chain'
<http://hudson.zones.apache.org/hudson/job/Buildr-ci-build/ws/lib/buildr/core/application.rb>:617:in
`invoke'
./spec/java/bdd_spec.rb:342:
./spec/java/bdd_spec.rb:341:in `tap'
./spec/java/bdd_spec.rb:341:
/home/toulmean/buildr-gems/gems/rspec-1.2.9/lib/spec/example/example_methods.rb:40:in `instance_eval'
/home/toulmean/buildr-gems/gems/rspec-1.2.9/lib/spec/example/example_methods.rb:40:in `execute'
/usr/lib/ruby/1.8/timeout.rb:53:in `timeout'
/home/toulmean/buildr-gems/gems/rspec-1.2.9/lib/spec/example/example_methods.rb:37:in `execute'
/home/toulmean/buildr-gems/gems/rspec-1.2.9/lib/spec/example/example_group_methods.rb:214:in
`run_examples'
/home/toulmean/buildr-gems/gems/rspec-1.2.9/lib/spec/example/example_group_methods.rb:212:in
`each'
/home/toulmean/buildr-gems/gems/rspec-1.2.9/lib/spec/example/example_group_methods.rb:212:in
`run_examples'
/home/toulmean/buildr-gems/gems/rspec-1.2.9/lib/spec/example/example_group_methods.rb:103:in
`run'
/home/toulmean/buildr-gems/gems/rspec-1.2.9/lib/spec/runner/example_group_runner.rb:23:in
`run'
/home/toulmean/buildr-gems/gems/rspec-1.2.9/lib/spec/runner/example_group_runner.rb:22:in
`each'
/home/toulmean/buildr-gems/gems/rspec-1.2.9/lib/spec/runner/example_group_runner.rb:22:in
`run'
/home/toulmean/buildr-gems/gems/rspec-1.2.9/lib/spec/runner/options.rb:151:in `run_examples'
/home/toulmean/buildr-gems/gems/rspec-1.2.9/lib/spec/runner/command_line.rb:9:in `run'
/home/toulmean/buildr-gems/gems/rspec-1.2.9/bin/spec:5:

17)
RuntimeError in 'Buildr::JBehave should include classes implementing Behaviours'
Tests failed!
<http://hudson.zones.apache.org/hudson/job/Buildr-ci-build/ws/lib/buildr/core/test.rb>:531:in
`run_tests'
<http://hudson.zones.apache.org/hudson/job/Buildr-ci-build/ws/lib/buildr/core/test.rb>:242:in
`initialize'
/home/toulmean/buildr-gems/gems/rake-0.8.7/lib/rake.rb:636:in `call'
/home/toulmean/buildr-gems/gems/rake-0.8.7/lib/rake.rb:636:in `execute_without_a_record'
/home/toulmean/buildr-gems/gems/rake-0.8.7/lib/rake.rb:631:in `each'
/home/toulmean/buildr-gems/gems/rake-0.8.7/lib/rake.rb:631:in `execute_without_a_record'
./spec/groovy/../spec_helpers.rb:154:in `execute'
<http://hudson.zones.apache.org/hudson/job/Buildr-ci-build/ws/lib/buildr/core/test.rb>:270:in
`execute'
<http://hudson.zones.apache.org/hudson/job/Buildr-ci-build/ws/lib/buildr/core/application.rb>:636:in
`invoke_with_call_chain'
/usr/lib/ruby/1.8/monitor.rb:242:in `synchronize'
<http://hudson.zones.apache.org/hudson/job/Buildr-ci-build/ws/lib/buildr/core/application.rb>:622:in
`invoke_with_call_chain'
<http://hudson.zones.apache.org/hudson/job/Buildr-ci-build/ws/lib/buildr/core/application.rb>:617:in
`invoke'
./spec/java/bdd_spec.rb:369:
./spec/java/bdd_spec.rb:368:in `tap'
./spec/java/bdd_spec.rb:368:
/home/toulmean/buildr-gems/gems/rspec-1.2.9/lib/spec/example/example_methods.rb:40:in `instance_eval'
/home/toulmean/buildr-gems/gems/rspec-1.2.9/lib/spec/example/example_methods.rb:40:in `execute'
/usr/lib/ruby/1.8/timeout.rb:53:in `timeout'
/home/toulmean/buildr-gems/gems/rspec-1.2.9/lib/spec/example/example_methods.rb:37:in `execute'
/home/toulmean/buildr-gems/gems/rspec-1.2.9/lib/spec/example/example_group_methods.rb:214:in
`run_examples'
/home/toulmean/buildr-gems/gems/rspec-1.2.9/lib/spec/example/example_group_methods.rb:212:in
`each'
/home/toulmean/buildr-gems/gems/rspec-1.2.9/lib/spec/example/example_group_methods.rb:212:in
`run_examples'
/home/toulmean/buildr-gems/gems/rspec-1.2.9/lib/spec/example/example_group_methods.rb:103:in
`run'
/home/toulmean/buildr-gems/gems/rspec-1.2.9/lib/spec/runner/example_group_runner.rb:23:in
`run'
/home/toulmean/buildr-gems/gems/rspec-1.2.9/lib/spec/runner/example_group_runner.rb:22:in
`each'
/home/toulmean/buildr-gems/gems/rspec-1.2.9/lib/spec/runner/example_group_runner.rb:22:in
`run'
/home/toulmean/buildr-gems/gems/rspec-1.2.9/lib/spec/runner/options.rb:151:in `run_examples'
/home/toulmean/buildr-gems/gems/rspec-1.2.9/lib/spec/runner/command_line.rb:9:in `run'
/home/toulmean/buildr-gems/gems/rspec-1.2.9/bin/spec:5:

18)
'Java#java when JAVA_HOME points to an invalid JRE/JDK installation should fail with an error
message mentioning JAVA_HOME' FAILED
expected "undefined method `normalize_path' for File:Class" to match /JAVA_HOME/
/home/toulmean/buildr-gems/gems/rspec-1.2.9/lib/spec/expectations/fail_with.rb:41:in `fail_with'
/home/toulmean/buildr-gems/gems/rspec-1.2.9/lib/spec/expectations/handler.rb:21:in `handle_matcher'
/home/toulmean/buildr-gems/gems/rspec-1.2.9/lib/spec/expectations/extensions/kernel.rb:27:in
`should'
./spec/java/java_spec.rb:108:
/home/toulmean/buildr-gems/gems/rspec-1.2.9/lib/spec/example/example_methods.rb:40:in `instance_eval'
/home/toulmean/buildr-gems/gems/rspec-1.2.9/lib/spec/example/example_methods.rb:40:in `execute'
/usr/lib/ruby/1.8/timeout.rb:53:in `timeout'
/home/toulmean/buildr-gems/gems/rspec-1.2.9/lib/spec/example/example_methods.rb:37:in `execute'
/home/toulmean/buildr-gems/gems/rspec-1.2.9/lib/spec/example/example_group_methods.rb:214:in
`run_examples'
/home/toulmean/buildr-gems/gems/rspec-1.2.9/lib/spec/example/example_group_methods.rb:212:in
`each'
/home/toulmean/buildr-gems/gems/rspec-1.2.9/lib/spec/example/example_group_methods.rb:212:in
`run_examples'
/home/toulmean/buildr-gems/gems/rspec-1.2.9/lib/spec/example/example_group_methods.rb:103:in
`run'
/home/toulmean/buildr-gems/gems/rspec-1.2.9/lib/spec/runner/example_group_runner.rb:23:in
`run'
/home/toulmean/buildr-gems/gems/rspec-1.2.9/lib/spec/runner/example_group_runner.rb:22:in
`each'
/home/toulmean/buildr-gems/gems/rspec-1.2.9/lib/spec/runner/example_group_runner.rb:22:in
`run'
/home/toulmean/buildr-gems/gems/rspec-1.2.9/lib/spec/runner/options.rb:151:in `run_examples'
/home/toulmean/buildr-gems/gems/rspec-1.2.9/lib/spec/runner/command_line.rb:9:in `run'
/home/toulmean/buildr-gems/gems/rspec-1.2.9/bin/spec:5:

19)
RuntimeError in 'Buildr::Scala::Specs should include public objects extending org.specs.Specification'
Tests failed!
<http://hudson.zones.apache.org/hudson/job/Buildr-ci-build/ws/lib/buildr/core/test.rb>:531:in
`run_tests'
<http://hudson.zones.apache.org/hudson/job/Buildr-ci-build/ws/lib/buildr/core/test.rb>:242:in
`initialize'
/home/toulmean/buildr-gems/gems/rake-0.8.7/lib/rake.rb:636:in `call'
/home/toulmean/buildr-gems/gems/rake-0.8.7/lib/rake.rb:636:in `execute_without_a_record'
/home/toulmean/buildr-gems/gems/rake-0.8.7/lib/rake.rb:631:in `each'
/home/toulmean/buildr-gems/gems/rake-0.8.7/lib/rake.rb:631:in `execute_without_a_record'
./spec/groovy/../spec_helpers.rb:154:in `execute'
<http://hudson.zones.apache.org/hudson/job/Buildr-ci-build/ws/lib/buildr/core/test.rb>:270:in
`execute'
<http://hudson.zones.apache.org/hudson/job/Buildr-ci-build/ws/lib/buildr/core/application.rb>:636:in
`invoke_with_call_chain'
/usr/lib/ruby/1.8/monitor.rb:242:in `synchronize'
<http://hudson.zones.apache.org/hudson/job/Buildr-ci-build/ws/lib/buildr/core/application.rb>:622:in
`invoke_with_call_chain'
<http://hudson.zones.apache.org/hudson/job/Buildr-ci-build/ws/lib/buildr/core/application.rb>:617:in
`invoke'
./spec/scala/bdd_spec.rb:72:
/home/toulmean/buildr-gems/gems/rspec-1.2.9/lib/spec/example/example_methods.rb:40:in `instance_eval'
/home/toulmean/buildr-gems/gems/rspec-1.2.9/lib/spec/example/example_methods.rb:40:in `execute'
/usr/lib/ruby/1.8/timeout.rb:53:in `timeout'
/home/toulmean/buildr-gems/gems/rspec-1.2.9/lib/spec/example/example_methods.rb:37:in `execute'
/home/toulmean/buildr-gems/gems/rspec-1.2.9/lib/spec/example/example_group_methods.rb:214:in
`run_examples'
/home/toulmean/buildr-gems/gems/rspec-1.2.9/lib/spec/example/example_group_methods.rb:212:in
`each'
/home/toulmean/buildr-gems/gems/rspec-1.2.9/lib/spec/example/example_group_methods.rb:212:in
`run_examples'
/home/toulmean/buildr-gems/gems/rspec-1.2.9/lib/spec/example/example_group_methods.rb:103:in
`run'
/home/toulmean/buildr-gems/gems/rspec-1.2.9/lib/spec/runner/example_group_runner.rb:23:in
`run'
/home/toulmean/buildr-gems/gems/rspec-1.2.9/lib/spec/runner/example_group_runner.rb:22:in
`each'
/home/toulmean/buildr-gems/gems/rspec-1.2.9/lib/spec/runner/example_group_runner.rb:22:in
`run'
/home/toulmean/buildr-gems/gems/rspec-1.2.9/lib/spec/runner/options.rb:151:in `run_examples'
/home/toulmean/buildr-gems/gems/rspec-1.2.9/lib/spec/runner/command_line.rb:9:in `run'
/home/toulmean/buildr-gems/gems/rspec-1.2.9/bin/spec:5:

20)
RuntimeError in 'Buildr::Scala::Specs should include public objects extending org.specs.Specification
even with companion classes'
Tests failed!
<http://hudson.zones.apache.org/hudson/job/Buildr-ci-build/ws/lib/buildr/core/test.rb>:531:in
`run_tests'
<http://hudson.zones.apache.org/hudson/job/Buildr-ci-build/ws/lib/buildr/core/test.rb>:242:in
`initialize'
/home/toulmean/buildr-gems/gems/rake-0.8.7/lib/rake.rb:636:in `call'
/home/toulmean/buildr-gems/gems/rake-0.8.7/lib/rake.rb:636:in `execute_without_a_record'
/home/toulmean/buildr-gems/gems/rake-0.8.7/lib/rake.rb:631:in `each'
/home/toulmean/buildr-gems/gems/rake-0.8.7/lib/rake.rb:631:in `execute_without_a_record'
./spec/groovy/../spec_helpers.rb:154:in `execute'
<http://hudson.zones.apache.org/hudson/job/Buildr-ci-build/ws/lib/buildr/core/test.rb>:270:in
`execute'
<http://hudson.zones.apache.org/hudson/job/Buildr-ci-build/ws/lib/buildr/core/application.rb>:636:in
`invoke_with_call_chain'
/usr/lib/ruby/1.8/monitor.rb:242:in `synchronize'
<http://hudson.zones.apache.org/hudson/job/Buildr-ci-build/ws/lib/buildr/core/application.rb>:622:in
`invoke_with_call_chain'
<http://hudson.zones.apache.org/hudson/job/Buildr-ci-build/ws/lib/buildr/core/application.rb>:617:in
`invoke'
./spec/scala/bdd_spec.rb:89:
/home/toulmean/buildr-gems/gems/rspec-1.2.9/lib/spec/example/example_methods.rb:40:in `instance_eval'
/home/toulmean/buildr-gems/gems/rspec-1.2.9/lib/spec/example/example_methods.rb:40:in `execute'
/usr/lib/ruby/1.8/timeout.rb:53:in `timeout'
/home/toulmean/buildr-gems/gems/rspec-1.2.9/lib/spec/example/example_methods.rb:37:in `execute'
/home/toulmean/buildr-gems/gems/rspec-1.2.9/lib/spec/example/example_group_methods.rb:214:in
`run_examples'
/home/toulmean/buildr-gems/gems/rspec-1.2.9/lib/spec/example/example_group_methods.rb:212:in
`each'
/home/toulmean/buildr-gems/gems/rspec-1.2.9/lib/spec/example/example_group_methods.rb:212:in
`run_examples'
/home/toulmean/buildr-gems/gems/rspec-1.2.9/lib/spec/example/example_group_methods.rb:103:in
`run'
/home/toulmean/buildr-gems/gems/rspec-1.2.9/lib/spec/runner/example_group_runner.rb:23:in
`run'
/home/toulmean/buildr-gems/gems/rspec-1.2.9/lib/spec/runner/example_group_runner.rb:22:in
`each'
/home/toulmean/buildr-gems/gems/rspec-1.2.9/lib/spec/runner/example_group_runner.rb:22:in
`run'
/home/toulmean/buildr-gems/gems/rspec-1.2.9/lib/spec/runner/options.rb:151:in `run_examples'
/home/toulmean/buildr-gems/gems/rspec-1.2.9/lib/spec/runner/command_line.rb:9:in `run'
/home/toulmean/buildr-gems/gems/rspec-1.2.9/bin/spec:5:

21)
'Buildr::Scala::Specs should pass when spec passes' FAILED
expected no Exception, got #<RuntimeError: Tests failed!>
/home/toulmean/buildr-gems/gems/rspec-1.2.9/lib/spec/expectations/fail_with.rb:41:in `fail_with'
/home/toulmean/buildr-gems/gems/rspec-1.2.9/lib/spec/expectations/handler.rb:44:in `handle_matcher'
/home/toulmean/buildr-gems/gems/rspec-1.2.9/lib/spec/expectations/extensions/kernel.rb:50:in
`should_not'
./spec/scala/bdd_spec.rb:104:
/home/toulmean/buildr-gems/gems/rspec-1.2.9/lib/spec/example/example_methods.rb:40:in `instance_eval'
/home/toulmean/buildr-gems/gems/rspec-1.2.9/lib/spec/example/example_methods.rb:40:in `execute'
/usr/lib/ruby/1.8/timeout.rb:53:in `timeout'
/home/toulmean/buildr-gems/gems/rspec-1.2.9/lib/spec/example/example_methods.rb:37:in `execute'
/home/toulmean/buildr-gems/gems/rspec-1.2.9/lib/spec/example/example_group_methods.rb:214:in
`run_examples'
/home/toulmean/buildr-gems/gems/rspec-1.2.9/lib/spec/example/example_group_methods.rb:212:in
`each'
/home/toulmean/buildr-gems/gems/rspec-1.2.9/lib/spec/example/example_group_methods.rb:212:in
`run_examples'
/home/toulmean/buildr-gems/gems/rspec-1.2.9/lib/spec/example/example_group_methods.rb:103:in
`run'
/home/toulmean/buildr-gems/gems/rspec-1.2.9/lib/spec/runner/example_group_runner.rb:23:in
`run'
/home/toulmean/buildr-gems/gems/rspec-1.2.9/lib/spec/runner/example_group_runner.rb:22:in
`each'
/home/toulmean/buildr-gems/gems/rspec-1.2.9/lib/spec/runner/example_group_runner.rb:22:in
`run'
/home/toulmean/buildr-gems/gems/rspec-1.2.9/lib/spec/runner/options.rb:151:in `run_examples'
/home/toulmean/buildr-gems/gems/rspec-1.2.9/lib/spec/runner/command_line.rb:9:in `run'
/home/toulmean/buildr-gems/gems/rspec-1.2.9/bin/spec:5:

Finished in 197.122815 seconds

2052 examples, 21 failures, 2 pending
rake aborted!
Command /usr/bin/ruby1.8 -I"lib"  "/home/toulmean/buildr-gems/gems/rspec-1.2.9/bin/spec" "spec/groovy/bdd_spec.rb"
"spec/groovy/compiler_spec.rb" "spec/addon/drb_spec.rb" "spec/java/commands_spec.rb" "spec/java/external_spec.rb"
"spec/java/ecj_spec.rb" "spec/java/packaging_spec.rb" "spec/java/tests_spec.rb" "spec/java/bdd_spec.rb"
"spec/java/emma_spec.rb" "spec/java/ant_spec.rb" "spec/java/cobertura_spec.rb" "spec/java/compiler_spec.rb"
"spec/java/java_spec.rb" "spec/core/compile_spec.rb" "spec/core/common_spec.rb" "spec/core/cc_spec.rb"
"spec/core/project_spec.rb" "spec/core/generate_spec.rb" "spec/core/checks_spec.rb" "spec/core/application_spec.rb"
"spec/core/util_spec.rb" "spec/core/extension_spec.rb" "spec/core/transport_spec.rb" "spec/core/test_spec.rb"
"spec/core/build_spec.rb" "spec/ide/idea7x_spec.rb" "spec/ide/eclipse_spec.rb" "spec/packaging/artifact_spec.rb"
"spec/packaging/artifact_namespace_spec.rb" "spec/packaging/packaging_spec.rb" "spec/packaging/archive_spec.rb"
"spec/version_requirement_spec.rb" "spec/scala/tests_spec.rb" "spec/scala/bdd_spec.rb" "spec/scala/compiler_spec.rb"
 --format failing_examples:failed --format html:_reports/specs.html --backtrace --require
"/home/toulmean/buildr-gems/gems/ci_reporter-1.6.2/lib/ci/reporter/rake/rspec_loader.rb" --format
CI::Reporter::RSpec failed

(See full trace by running task with --trace)
Recording test results


Mime
View raw message