buildr-ci mailing list archives

Site index · List index
Message view « Date » · « Thread »
Top « Date » · « Thread »
From Apache Hudson Server <hud...@hudson.zones.apache.org>
Subject Build failed in Hudson: Buildr-artifacts-build #8
Date Thu, 22 Jul 2010 06:38:40 GMT
See <http://hudson.zones.apache.org/hudson/job/Buildr-artifacts-build/8/>

------------------------------------------
[...truncated 3840 lines...]
  at org.scalatest.FunSuite$$anonfun$runTests$1.apply(FunSuite.scala:1255)
  at scala.collection.LinearSeqOptimized$class.foreach(LinearSeqOptimized.scala:61)
  at scala.collection.immutable.List.foreach(List.scala:45)
  at org.scalatest.FunSuite$class.runTests(FunSuite.scala:1255)
  at FailingSuite.runTests(FailingSuite.scala:1)
  at org.scalatest.Suite$class.run(Suite.scala:1804)
  at FailingSuite.org$scalatest$FunSuite$$super$run(FailingSuite.scala:1)
  at org.scalatest.FunSuite$class.run(FunSuite.scala:1304)
  at FailingSuite.run(FailingSuite.scala:1)
  at org.scalatest.tools.SuiteRunner.run(SuiteRunner.scala:59)
  at org.scalatest.tools.Runner$$anonfun$doRunRunRunADoRunRun$3.apply(Runner.scala:1523)
  at org.scalatest.tools.Runner$$anonfun$doRunRunRunADoRunRun$3.apply(Runner.scala:1520)
  at scala.collection.LinearSeqOptimized$class.foreach(LinearSeqOptimized.scala:61)
  at scala.collection.immutable.List.foreach(List.scala:45)
  at org.scalatest.tools.Runner$.doRunRunRunADoRunRun(Runner.scala:1520)
  at org.scalatest.tools.Runner$$anonfun$runOptionallyWithPassFailReporter$2.apply(Runner.scala:616)
  at org.scalatest.tools.Runner$$anonfun$runOptionallyWithPassFailReporter$2.apply(Runner.scala:615)
  at org.scalatest.tools.Runner$.withClassLoaderAndDispatchReporter(Runner.scala:1564)
  at org.scalatest.tools.Runner$.runOptionallyWithPassFailReporter(Runner.scala:614)
  at org.scalatest.tools.Runner$.run(Runner.scala:517)
  at org.scalatest.tools.ScalaTestAntTask.execute(ScalaTestAntTask.scala:259)
  at org.apache.tools.ant.UnknownElement.execute(UnknownElement.java:291)
Suite Completed - FailingSuite
Run completed in 138 milliseconds.
Total number of tests run: 1
Suites: completed 1, aborted 0
Tests: succeeded 0, failed 1, ignored 0, pending 0
*** 1 TEST FAILED ***
.No known dependencies. Compiling everything
Run starting. Expected test count is: 1
Suite Starting - FailingSuite
Test Starting - FailingSuite: failing
TEST FAILED - FailingSuite: failing (FailingSuite.scala:3)
  org.scalatest.TestFailedException
  at org.scalatest.Assertions$class.newAssertionFailedException(Assertions.scala:276)
  at FailingSuite.newAssertionFailedException(FailingSuite.scala:1)
  at org.scalatest.Assertions$class.assert(Assertions.scala:271)
  at FailingSuite.assert(FailingSuite.scala:1)
  at FailingSuite$$anonfun$1.apply$mcV$sp(FailingSuite.scala:3)
  at FailingSuite$$anonfun$1.apply(FailingSuite.scala:3)
  at FailingSuite$$anonfun$1.apply(FailingSuite.scala:3)
  at org.scalatest.FunSuite$$anon$2.apply(FunSuite.scala:1158)
  at org.scalatest.Suite$class.withFixture(Suite.scala:1509)
  at FailingSuite.withFixture(FailingSuite.scala:1)
  at org.scalatest.FunSuite$class.runTest(FunSuite.scala:1155)
  at FailingSuite.runTest(FailingSuite.scala:1)
  at org.scalatest.FunSuite$$anonfun$runTests$1.apply(FunSuite.scala:1264)
  at org.scalatest.FunSuite$$anonfun$runTests$1.apply(FunSuite.scala:1255)
  at scala.collection.LinearSeqOptimized$class.foreach(LinearSeqOptimized.scala:61)
  at scala.collection.immutable.List.foreach(List.scala:45)
  at org.scalatest.FunSuite$class.runTests(FunSuite.scala:1255)
  at FailingSuite.runTests(FailingSuite.scala:1)
  at org.scalatest.Suite$class.run(Suite.scala:1804)
  at FailingSuite.org$scalatest$FunSuite$$super$run(FailingSuite.scala:1)
  at org.scalatest.FunSuite$class.run(FunSuite.scala:1304)
  at FailingSuite.run(FailingSuite.scala:1)
  at org.scalatest.tools.SuiteRunner.run(SuiteRunner.scala:59)
  at org.scalatest.tools.Runner$$anonfun$doRunRunRunADoRunRun$3.apply(Runner.scala:1523)
  at org.scalatest.tools.Runner$$anonfun$doRunRunRunADoRunRun$3.apply(Runner.scala:1520)
  at scala.collection.LinearSeqOptimized$class.foreach(LinearSeqOptimized.scala:61)
  at scala.collection.immutable.List.foreach(List.scala:45)
  at org.scalatest.tools.Runner$.doRunRunRunADoRunRun(Runner.scala:1520)
  at org.scalatest.tools.Runner$$anonfun$runOptionallyWithPassFailReporter$2.apply(Runner.scala:616)
  at org.scalatest.tools.Runner$$anonfun$runOptionallyWithPassFailReporter$2.apply(Runner.scala:615)
  at org.scalatest.tools.Runner$.withClassLoaderAndDispatchReporter(Runner.scala:1564)
  at org.scalatest.tools.Runner$.runOptionallyWithPassFailReporter(Runner.scala:614)
  at org.scalatest.tools.Runner$.run(Runner.scala:517)
  at org.scalatest.tools.ScalaTestAntTask.execute(ScalaTestAntTask.scala:259)
  at org.apache.tools.ant.UnknownElement.execute(UnknownElement.java:291)
Suite Completed - FailingSuite
Run completed in 138 milliseconds.
Total number of tests run: 1
Suites: completed 1, aborted 0
Tests: succeeded 0, failed 1, ignored 0, pending 0
*** 1 TEST FAILED ***
.No known dependencies. Compiling everything
Run starting. Expected test count is: 1
Suite Starting - PassingSuite
Test Starting - PassingSuite: passing
Test Succeeded - PassingSuite: passing
Suite Completed - PassingSuite
Run completed in 134 milliseconds.
Total number of tests run: 1
Suites: completed 1, aborted 0
Tests: succeeded 1, failed 0, ignored 0, pending 0
All tests passed.
.No known dependencies. Compiling everything
Run starting. Expected test count is: 1
Suite Starting - PassingSuite
Test Starting - PassingSuite: passing
Test Succeeded - PassingSuite: passing
Suite Completed - PassingSuite
Run completed in 133 milliseconds.
Total number of tests run: 1
Suites: completed 1, aborted 0
Tests: succeeded 1, failed 0, ignored 0, pending 0
All tests passed.
.No known dependencies. Compiling everything
Run starting. Expected test count is: 1
Suite Starting - PropertyTestSuite
Test Starting - PropertyTestSuite: testProperty
Test Succeeded - PropertyTestSuite: testProperty
Suite Completed - PropertyTestSuite
Run completed in 135 milliseconds.
Total number of tests run: 1
Suites: completed 1, aborted 0
Tests: succeeded 1, failed 0, ignored 0, pending 0
All tests passed.
.No known dependencies. Compiling everything
Run starting. Expected test count is: 2
Suite Starting - MySuite
Test Starting - MySuite: list concatenation
Test Succeeded - MySuite: list concatenation
Test Starting - MySuite: list concatenation using a test method
Test Succeeded - MySuite: list concatenation using a test method
Suite Completed - MySuite
Run completed in 450 milliseconds.
Total number of tests run: 2
Suites: completed 1, aborted 0
Tests: succeeded 2, failed 0, ignored 0, pending 0
All tests passed.
.No known dependencies. Compiling everything
Run starting. Expected test count is: 5
Suite Starting - StringSuite
Test Starting - StringSuite: startsWith
Test Succeeded - StringSuite: startsWith
Test Starting - StringSuite: endsWith
Test Succeeded - StringSuite: endsWith
Test Starting - StringSuite: concat
TEST FAILED - StringSuite: concat (Checkers.scala:241)
  Falsified after 0 passed tests:
> ARG_0 = ""
> ARG_1 = ""
  org.scalatest.prop.PropertyTestFailedException: Falsified after 0 passed tests:
> ARG_0 = ""
> ARG_1 = ""
  at org.scalatest.prop.Checkers$class.check(Checkers.scala:241)
  at StringSuite.check(StringSuite.scala:6)
  at org.scalatest.prop.Checkers$class.check(Checkers.scala:304)
  at StringSuite.check(StringSuite.scala:6)
  at org.scalatest.prop.Checkers$class.check(Checkers.scala:115)
  at StringSuite.check(StringSuite.scala:6)
  at StringSuite$$anonfun$3.apply$mcV$sp(StringSuite.scala:17)
  at StringSuite$$anonfun$3.apply(StringSuite.scala:17)
  at StringSuite$$anonfun$3.apply(StringSuite.scala:17)
  at org.scalatest.FunSuite$$anon$2.apply(FunSuite.scala:1158)
  at org.scalatest.Suite$class.withFixture(Suite.scala:1509)
  at StringSuite.withFixture(StringSuite.scala:6)
  at org.scalatest.FunSuite$class.runTest(FunSuite.scala:1155)
  at StringSuite.runTest(StringSuite.scala:6)
  at org.scalatest.FunSuite$$anonfun$runTests$1.apply(FunSuite.scala:1264)
  at org.scalatest.FunSuite$$anonfun$runTests$1.apply(FunSuite.scala:1255)
  at scala.collection.LinearSeqOptimized$class.foreach(LinearSeqOptimized.scala:61)
  at scala.collection.immutable.List.foreach(List.scala:45)
  at org.scalatest.FunSuite$class.runTests(FunSuite.scala:1255)
  at StringSuite.runTests(StringSuite.scala:6)
  at org.scalatest.Suite$class.run(Suite.scala:1804)
  at StringSuite.org$scalatest$FunSuite$$super$run(StringSuite.scala:6)
  at org.scalatest.FunSuite$class.run(FunSuite.scala:1304)
  at StringSuite.run(StringSuite.scala:6)
  at org.scalatest.tools.SuiteRunner.run(SuiteRunner.scala:59)
  at org.scalatest.tools.Runner$$anonfun$doRunRunRunADoRunRun$3.apply(Runner.scala:1523)
  at org.scalatest.tools.Runner$$anonfun$doRunRunRunADoRunRun$3.apply(Runner.scala:1520)
  at scala.collection.LinearSeqOptimized$class.foreach(LinearSeqOptimized.scala:61)
  at scala.collection.immutable.List.foreach(List.scala:45)
  at org.scalatest.tools.Runner$.doRunRunRunADoRunRun(Runner.scala:1520)
  at org.scalatest.tools.Runner$$anonfun$runOptionallyWithPassFailReporter$2.apply(Runner.scala:616)
  at org.scalatest.tools.Runner$$anonfun$runOptionallyWithPassFailReporter$2.apply(Runner.scala:615)
  at org.scalatest.tools.Runner$.withClassLoaderAndDispatchReporter(Runner.scala:1564)
  at org.scalatest.tools.Runner$.runOptionallyWithPassFailReporter(Runner.scala:614)
  at org.scalatest.tools.Runner$.run(Runner.scala:517)
  at org.scalatest.tools.ScalaTestAntTask.execute(ScalaTestAntTask.scala:259)
  at org.apache.tools.ant.UnknownElement.execute(UnknownElement.java:291)
Test Starting - StringSuite: substring2
Test Succeeded - StringSuite: substring2
Test Starting - StringSuite: substring3
Test Succeeded - StringSuite: substring3
Suite Completed - StringSuite
Run completed in 483 milliseconds.
Total number of tests run: 5
Suites: completed 1, aborted 0
Tests: succeeded 4, failed 1, ignored 0, pending 0
*** 1 TEST FAILED ***
.....No known dependencies. Compiling everything
Specification "MySpecs"
  it should
  + add

Total for specification "MySpecs":
Finished in 0 second, 61 ms
1 example, 1 expectation, 0 failure, 0 error

.No known dependencies. Compiling everything
Specification "MySpecs"
  it should
  + add

Total for specification "MySpecs":
Finished in 0 second, 61 ms
1 example, 1 expectation, 0 failure, 0 error

.No known dependencies. Compiling everything
Specification "PassingSpecs"
  it should
  + add

Total for specification "PassingSpecs":
Finished in 0 second, 61 ms
1 example, 1 expectation, 0 failure, 0 error

.No known dependencies. Compiling everything
Specification "StringSpecs"
  empty string should
  x have a zero length
    '0' is not equal to '1' (StringSpecs.scala:7)

Total for specification "StringSpecs":
Finished in 0 second, 64 ms
1 example, 1 expectation, 1 failure, 0 error

.......No known dependencies. Compiling everything
No known dependencies. Compiling everything
.No known dependencies. Compiling everything
.No known dependencies. Compiling everything
.........No known dependencies. Compiling everything
No known dependencies. Compiling everything
.No known dependencies. Compiling everything
.No known dependencies. Compiling everything
....mkdir -p <http://hudson.zones.apache.org/hudson/job/Buildr-artifacts-build/ws/tmp/home>
.mkdir -p <http://hudson.zones.apache.org/hudson/job/Buildr-artifacts-build/ws/tmp/home/.buildr>
.......................

Pending:

Buildr::Compiler::Ecj should not issue warnings for type casting when warnings are set to
warn:none, by default (RJB doesn't support well instantiating a class that has several constructors)
./spec/java/ecj_spec.rb:77

Buildr::Compiler::Ecj should issue warnings for type casting when warnings are set (RJB doesn't
support well instantiating a class that has several constructors)
./spec/java/ecj_spec.rb:86

Finished in 273.43449 seconds

2097 examples, 0 failures, 2 pending
prince --input=html --no-network --log=prince_errors.log --output=buildr.pdf _site/preface.html
_site/quick_start.html _site/installing.html _site/projects.html _site/building.html _site/artifacts.html
_site/packaging.html _site/testing.html _site/settings_profiles.html _site/languages.html
_site/more_stuff.html _site/extending.html _site/contributing.html
rake aborted!
Command failed with status (127): [prince --input=html --no-network --log=pri...]

(See full trace by running task with --trace)
Archiving artifacts


Mime
View raw message