buildr-ci mailing list archives

Site index · List index
Message view « Date » · « Thread »
Top « Date » · « Thread »
From Apache Hudson Server <hud...@hudson.zones.apache.org>
Subject Build failed in Hudson: Buildr-ci-build-jruby-win32 #48
Date Tue, 20 Jul 2010 17:22:12 GMT
See <http://hudson.zones.apache.org/hudson/job/Buildr-ci-build-jruby-win32/48/>

------------------------------------------
Started by upstream project "buildr-ci-build-jruby-jdk5" build number 49
Building remotely on hudson-win.apache.org (Windows 2008)
Updating http://svn.apache.org/repos/asf/buildr/trunk
U         CHANGELOG
U         spec\java\cobertura_spec.rb
U         spec\java\java_spec.rb
U         lib\buildr\java\cobertura.rb
U         lib\buildr\java\jruby.rb
U         lib\buildr\java\commands.rb
At revision 965913
no revision recorded for http://svn.apache.org/repos/asf/buildr/trunk in the previous build
[Buildr-ci-build-jruby-win32] $ cmd /c call C:\Users\hudson\AppData\Local\Temp\hudson7138776979299767310.bat

<http://hudson.zones.apache.org/hudson/job/Buildr-ci-build-jruby-win32/ws/>set> SCALA_HOME=C:\hudson\tools\scala-2.7.7.final


<http://hudson.zones.apache.org/hudson/job/Buildr-ci-build-jruby-win32/ws/>set> RUBY_HOME=C:\hudson\tools\jruby-1.5.1


<http://hudson.zones.apache.org/hudson/job/Buildr-ci-build-jruby-win32/ws/>set> GEM_HOME=C:\hudson\tools\gems


<http://hudson.zones.apache.org/hudson/job/Buildr-ci-build-jruby-win32/ws/>set> PATH=C:\Windows\system32;C:\Windows;C:\Windows\System32\Wbem;C:\java\java6\jre\bin;C:\bin;C:\hudson\tools\jruby-1.5.1\bin;C:\hudson\tools\gems\bin


<http://hudson.zones.apache.org/hudson/job/Buildr-ci-build-jruby-win32/ws/>jruby>
-J-Xmx256m -J-XX:MaxPermSize=256m -S rake ci  2>&1 
(in C:/hudson/hudson-slave/workspace/Buildr-ci-build-jruby-win32)
Buildr uses the SDoc RDoc generator/theme. You can install it by running rake doc:setup
Buildr uses the jekyll gem to generate the Web site. You can install it by running rake doc:setup
Compiling Java libraries ...
jruby C:/hudson/hudson-slave/workspace/Buildr-ci-build-jruby-win32/_jbuildr --buildfile buildr.buildfile
compile
(in C:/hudson/hudson-slave/workspace/Buildr-ci-build-jruby-win32, development)
Compiling buildr
Compiling buildr:java into lib/buildr/java
Note: C:\hudson\hudson-slave\workspace\Buildr-ci-build-jruby-win32\lib\buildr\java\org\apache\buildr\JavaTestFilter.java
uses or overrides a deprecated API.
Note: Recompile with -Xlint:deprecation for details.
Note: C:\hudson\hudson-slave\workspace\Buildr-ci-build-jruby-win32\lib\buildr\java\org\apache\buildr\JavaTestFilter.java
uses unchecked or unsafe operations.
Note: Recompile with -Xlint:unchecked for details.
Note: C:\hudson\hudson-slave\workspace\Buildr-ci-build-jruby-win32\lib\buildr\scala\org\apache\buildr\SpecsSingletonRunner.java
uses or overrides a deprecated API.
Note: Recompile with -Xlint:deprecation for details.
Note: C:\hudson\hudson-slave\workspace\Buildr-ci-build-jruby-win32\lib\buildr\scala\org\apache\buildr\SpecsSingletonRunner.java
uses unchecked or unsafe operations.
Note: Recompile with -Xlint:unchecked for details.
Compiling buildr:scala into lib/buildr/scala
Compiling buildr:extra into addon/buildr
Note: C:\hudson\hudson-slave\workspace\Buildr-ci-build-jruby-win32\addon\buildr\org\apache\buildr\JettyWrapper.java
uses unchecked or unsafe operations.
Note: Recompile with -Xlint:unchecked for details.
Completed in 4.936s
.......................................................................................................................................................................................................................................................................................................................................................................................................*......................................................................C:\hudson\hudson-slave\workspace\Buildr-ci-build-jruby-win32\tmp\failed.java:1:
class, interface, or enum expected
not a class         
^
C:\hudson\hudson-slave\workspace\Buildr-ci-build-jruby-win32\tmp\failed.java:1: reached end
of file while parsing
not a class         
           ^
2 errors
......................................................................................................................................................................................................................rm
-rf C:/hudson/hudson-slave/workspace/Buildr-ci-build-jruby-win32/tmp/reports/junit
rm -rf C:/hudson/hudson-slave/workspace/Buildr-ci-build-jruby-win32/tmp/target/junit-failed
mkdir -p C:/hudson/hudson-slave/workspace/Buildr-ci-build-jruby-win32/tmp/reports/junit
touch C:/hudson/hudson-slave/workspace/Buildr-ci-build-jruby-win32/tmp/reports/junit/last_successful_run
rm -rf C:/hudson/hudson-slave/workspace/Buildr-ci-build-jruby-win32/tmp/reports/junit
rm -rf C:/hudson/hudson-slave/workspace/Buildr-ci-build-jruby-win32/tmp/target/junit-failed
mkdir -p C:/hudson/hudson-slave/workspace/Buildr-ci-build-jruby-win32/tmp/target
.................rm -rf C:/hudson/hudson-slave/workspace/Buildr-ci-build-jruby-win32/tmp/reports/junit
rm -rf C:/hudson/hudson-slave/workspace/Buildr-ci-build-jruby-win32/tmp/target/junit-failed
mkdir -p C:/hudson/hudson-slave/workspace/Buildr-ci-build-jruby-win32/tmp/target
....................................................................................................
   [junit] Test FailingTest FAILED
...    [junit] Test FailingTest FAILED
.......................................................................................................................................................................Expectations
..
Time: 0.026s

Total: 1. Success!
........
Time: 0.024s

Total: 1. Success!
.................................All checks passed.
Buildfile: C:\hudson\hudson-slave\workspace\Buildr-ci-build-jruby-win32\tmp\build.xml

dist:

BUILD SUCCESSFUL
Total time: 0 seconds
.Buildfile: C:\hudson\hudson-slave\workspace\Buildr-ci-build-jruby-win32\tmp\build.xml

dist:

BUILD SUCCESSFUL
Total time: 0 seconds
..........................mkdir -p C:/hudson/hudson-slave/workspace/Buildr-ci-build-jruby-win32/tmp/home
mkdir -p C:/hudson/hudson-slave/workspace/Buildr-ci-build-jruby-win32/tmp/home/.buildr
................................javadoc: warning - No source files for package Test.java
javadoc: warning - No source files for package Test.java
javadoc: error - No public or protected classes found to document.
1 error
2 warnings
............incorrect classpath: src/dependency
incorrect classpath: src/test
.........mkdir -p C:/hudson/hudson-slave/workspace/Buildr-ci-build-jruby-win32/tmp/home
mkdir -p C:/hudson/hudson-slave/workspace/Buildr-ci-build-jruby-win32/tmp/home/.buildr
.........................................javadoc: warning - No source files for package Test.java
javadoc: warning - No source files for package Test.java
javadoc: error - No public or protected classes found to document.
1 error
2 warnings
...................................................mkdir -p C:/hudson/hudson-slave/workspace/Buildr-ci-build-jruby-win32/tmp/home
mkdir -p C:/hudson/hudson-slave/workspace/Buildr-ci-build-jruby-win32/tmp/home/.buildr
............................................javadoc: warning - No source files for package
Test.java
javadoc: warning - No source files for package Test.java
javadoc: error - No public or protected classes found to document.
1 error
2 warnings
.....................................................................................................................FATAL:
command execution failed
hudson.util.IOException2: Failed to join the process
	at hudson.Proc$RemoteProc.join(Proc.java:355)
	at hudson.Launcher$ProcStarter.join(Launcher.java:280)
	at hudson.tasks.CommandInterpreter.perform(CommandInterpreter.java:83)
	at hudson.tasks.CommandInterpreter.perform(CommandInterpreter.java:58)
	at hudson.tasks.BuildStepMonitor$1.perform(BuildStepMonitor.java:19)
	at hudson.model.AbstractBuild$AbstractRunner.perform(AbstractBuild.java:601)
	at hudson.model.Build$RunnerImpl.build(Build.java:174)
	at hudson.model.Build$RunnerImpl.doRun(Build.java:138)
	at hudson.model.AbstractBuild$AbstractRunner.run(AbstractBuild.java:416)
	at hudson.model.Run.run(Run.java:1257)
	at hudson.model.FreeStyleBuild.run(FreeStyleBuild.java:46)
	at hudson.model.ResourceController.execute(ResourceController.java:88)
	at hudson.model.Executor.run(Executor.java:127)
Caused by: java.util.concurrent.ExecutionException: hudson.remoting.RequestAbortedException:
java.io.IOException: Unexpected termination of the channel
	at hudson.remoting.Request$1.get(Request.java:218)
	at hudson.remoting.Request$1.get(Request.java:172)
	at hudson.remoting.FutureAdapter.get(FutureAdapter.java:55)
	at hudson.Proc$RemoteProc.join(Proc.java:347)
	... 12 more
Caused by: hudson.remoting.RequestAbortedException: java.io.IOException: Unexpected termination
of the channel
	at hudson.remoting.Request.abort(Request.java:257)
	at hudson.remoting.Channel.terminate(Channel.java:602)
	at hudson.remoting.Channel$ReaderThread.run(Channel.java:893)
Caused by: java.io.IOException: Unexpected termination of the channel
	at hudson.remoting.Channel$ReaderThread.run(Channel.java:875)
Caused by: java.io.EOFException
	at java.io.ObjectInputStream$BlockDataInputStream.peekByte(ObjectInputStream.java:2554)
	at java.io.ObjectInputStream.readObject0(ObjectInputStream.java:1297)
	at java.io.ObjectInputStream.readObject(ObjectInputStream.java:351)
	at hudson.remoting.Channel$ReaderThread.run(Channel.java:869)
FATAL: Unable to delete script file C:\Users\hudson\AppData\Local\Temp\hudson7138776979299767310.bat
hudson.util.IOException2: remote file operation failed: C:\Users\hudson\AppData\Local\Temp\hudson7138776979299767310.bat
at hudson.remoting.Channel@18ae0af:hudson-win.apache.org (Windows 2008)
	at hudson.FilePath.act(FilePath.java:749)
	at hudson.FilePath.act(FilePath.java:735)
	at hudson.FilePath.delete(FilePath.java:990)
	at hudson.tasks.CommandInterpreter.perform(CommandInterpreter.java:93)
	at hudson.tasks.CommandInterpreter.perform(CommandInterpreter.java:58)
	at hudson.tasks.BuildStepMonitor$1.perform(BuildStepMonitor.java:19)
	at hudson.model.AbstractBuild$AbstractRunner.perform(AbstractBuild.java:601)
	at hudson.model.Build$RunnerImpl.build(Build.java:174)
	at hudson.model.Build$RunnerImpl.doRun(Build.java:138)
	at hudson.model.AbstractBuild$AbstractRunner.run(AbstractBuild.java:416)
	at hudson.model.Run.run(Run.java:1257)
	at hudson.model.FreeStyleBuild.run(FreeStyleBuild.java:46)
	at hudson.model.ResourceController.execute(ResourceController.java:88)
	at hudson.model.Executor.run(Executor.java:127)
Caused by: hudson.remoting.ChannelClosedException: channel is already closed
	at hudson.remoting.Channel.send(Channel.java:412)
	at hudson.remoting.Request.call(Request.java:105)
	at hudson.remoting.Channel.call(Channel.java:555)
	at hudson.FilePath.act(FilePath.java:742)
	... 13 more
FATAL: channel is already closed
hudson.remoting.ChannelClosedException: channel is already closed
	at hudson.remoting.Channel.send(Channel.java:412)
	at hudson.remoting.Request.call(Request.java:105)
	at hudson.remoting.Channel.call(Channel.java:555)
	at hudson.Launcher$RemoteLauncher.kill(Launcher.java:744)
	at hudson.model.AbstractBuild$AbstractRunner.run(AbstractBuild.java:421)
	at hudson.model.Run.run(Run.java:1257)
	at hudson.model.FreeStyleBuild.run(FreeStyleBuild.java:46)
	at hudson.model.ResourceController.execute(ResourceController.java:88)
	at hudson.model.Executor.run(Executor.java:127)


Mime
View raw message