buildr-ci mailing list archives

Site index · List index
Message view « Date » · « Thread »
Top « Date » · « Thread »
From Apache Hudson Server <hud...@hudson.zones.apache.org>
Subject Build failed in Hudson: Buildr-ci-build-jruby-win32 #29
Date Tue, 29 Jun 2010 22:10:58 GMT
See <http://hudson.zones.apache.org/hudson/job/Buildr-ci-build-jruby-win32/29/changes>

Changes:

[toulmean] moving Ant back to 1.8.0 as changes break with Antwrap 0.7

------------------------------------------
[...truncated 2498 lines...]
org/jruby/javasupport/JavaMethod.java:508:in `invokeDirectWithExceptionHandling'
C:/hudson/tools/jruby-1.5.1/lib/ruby/1.8/logger.rb:348:in `execute'
C:/hudson/tools/gems/gems/Antwrap-0.7.0-java/lib/ant_project.rb:108:in `method_missing'
C:/hudson/hudson-slave/workspace/Buildr-ci-build-jruby-win32/lib/buildr/java/tests.rb:171:in
`generate'
C:/hudson/hudson-slave/workspace/Buildr-ci-build-jruby-win32/lib/buildr/java/ant.rb:77:in
`ant'
C:/hudson/hudson-slave/workspace/Buildr-ci-build-jruby-win32/lib/buildr/java/ant.rb:73:in
`tap'
C:/hudson/hudson-slave/workspace/Buildr-ci-build-jruby-win32/lib/buildr/java/ant.rb:73:in
`ant'
C:/hudson/hudson-slave/workspace/Buildr-ci-build-jruby-win32/lib/buildr/java/tests.rb:168:in
`generate'
C:/hudson/hudson-slave/workspace/Buildr-ci-build-jruby-win32/lib/buildr/java/tests.rb:280
C:/hudson/tools/jruby-1.5.1/lib/ruby/gems/1.8/gems/rake-0.8.7/lib/rake.rb:634:in `call'
C:/hudson/tools/jruby-1.5.1/lib/ruby/gems/1.8/gems/rake-0.8.7/lib/rake.rb:634:in `execute'
C:/hudson/tools/jruby-1.5.1/lib/ruby/gems/1.8/gems/rake-0.8.7/lib/rake.rb:631:in `each'
C:/hudson/tools/jruby-1.5.1/lib/ruby/gems/1.8/gems/rake-0.8.7/lib/rake.rb:631:in `execute'
./spec/spec_helpers.rb:144:in `execute'
C:/hudson/hudson-slave/workspace/Buildr-ci-build-jruby-win32/lib/buildr/core/application.rb:636:in
`invoke_with_call_chain'
C:/hudson/tools/jruby-1.5.1/lib/ruby/1.8/monitor.rb:191:in `mon_synchronize'
C:/hudson/hudson-slave/workspace/Buildr-ci-build-jruby-win32/lib/buildr/core/application.rb:622:in
`invoke_with_call_chain'
C:/hudson/hudson-slave/workspace/Buildr-ci-build-jruby-win32/lib/buildr/core/application.rb:617:in
`invoke'
./spec/java/tests_spec.rb:308:
C:/hudson/tools/jruby-1.5.1/lib/ruby/gems/1.8/gems/rspec-1.3.0/lib/spec/matchers/change.rb:16:in
`call'
C:/hudson/tools/jruby-1.5.1/lib/ruby/gems/1.8/gems/rspec-1.3.0/lib/spec/matchers/change.rb:16:in
`matches?'
C:/hudson/tools/jruby-1.5.1/lib/ruby/gems/1.8/gems/rspec-1.3.0/lib/spec/expectations/handler.rb:11:in
`handle_matcher'
C:/hudson/tools/jruby-1.5.1/lib/ruby/gems/1.8/gems/rspec-1.3.0/lib/spec/expectations/extensions/kernel.rb:27:in
`should'
./spec/java/tests_spec.rb:308:
C:/hudson/tools/jruby-1.5.1/lib/ruby/gems/1.8/gems/rspec-1.3.0/lib/spec/example/example_methods.rb:40:in
`instance_eval'
C:/hudson/tools/jruby-1.5.1/lib/ruby/gems/1.8/gems/rspec-1.3.0/lib/spec/example/example_methods.rb:40:in
`execute'
C:/hudson/tools/jruby-1.5.1/lib/ruby/gems/1.8/gems/rspec-1.3.0/lib/spec/example/example_methods.rb:37:in
`execute'
C:/hudson/tools/jruby-1.5.1/lib/ruby/gems/1.8/gems/rspec-1.3.0/lib/spec/example/example_group_methods.rb:214:in
`run_examples'
C:/hudson/tools/jruby-1.5.1/lib/ruby/gems/1.8/gems/rspec-1.3.0/lib/spec/example/example_group_methods.rb:212:in
`each'
C:/hudson/tools/jruby-1.5.1/lib/ruby/gems/1.8/gems/rspec-1.3.0/lib/spec/example/example_group_methods.rb:212:in
`run_examples'
C:/hudson/tools/jruby-1.5.1/lib/ruby/gems/1.8/gems/rspec-1.3.0/lib/spec/example/example_group_methods.rb:103:in
`run'
C:/hudson/tools/jruby-1.5.1/lib/ruby/gems/1.8/gems/rspec-1.3.0/lib/spec/runner/example_group_runner.rb:23:in
`run'
C:/hudson/tools/jruby-1.5.1/lib/ruby/gems/1.8/gems/rspec-1.3.0/lib/spec/runner/example_group_runner.rb:22:in
`each'
C:/hudson/tools/jruby-1.5.1/lib/ruby/gems/1.8/gems/rspec-1.3.0/lib/spec/runner/example_group_runner.rb:22:in
`run'
C:/hudson/tools/jruby-1.5.1/lib/ruby/gems/1.8/gems/rspec-1.3.0/lib/spec/runner/options.rb:152:in
`run_examples'
C:/hudson/tools/jruby-1.5.1/lib/ruby/gems/1.8/gems/rspec-1.3.0/lib/spec/runner/command_line.rb:9:in
`run'
C:/hudson/tools/jruby-1.5.1/lib/ruby/gems/1.8/gems/rspec-1.3.0/bin/spec:5

3)
NativeException in 'Buildr::JUnit report should generate a consolidated XML report'
org.apache.tools.ant.BuildException: Errors while applying transformations: java.lang.ClassNotFoundException:
org.apache.tools.ant.taskdefs.optional.TraXLiaison
org/apache/tools/ant/taskdefs/optional/junit/AggregateTransformer.java:266:in `transform'
org/apache/tools/ant/taskdefs/optional/junit/XMLResultAggregator.java:158:in `execute'
org/apache/tools/ant/UnknownElement.java:291:in `execute'
sun.reflect.GeneratedMethodAccessor24:-1:in `invoke'
sun/reflect/DelegatingMethodAccessorImpl.java:25:in `invoke'
java/lang/reflect/Method.java:597:in `invoke'
org/jruby/javasupport/JavaMethod.java:508:in `invokeDirectWithExceptionHandling'
org/apache/tools/ant/taskdefs/optional/junit/AggregateTransformer.java:266:in `transform'
org/apache/tools/ant/taskdefs/optional/junit/XMLResultAggregator.java:158:in `execute'
org/apache/tools/ant/UnknownElement.java:291:in `execute'
sun.reflect.GeneratedMethodAccessor24:-1:in `invoke'
sun/reflect/DelegatingMethodAccessorImpl.java:25:in `invoke'
java/lang/reflect/Method.java:597:in `invoke'
org/jruby/javasupport/JavaMethod.java:508:in `invokeDirectWithExceptionHandling'
C:/hudson/tools/jruby-1.5.1/lib/ruby/1.8/logger.rb:348:in `execute'
C:/hudson/tools/gems/gems/Antwrap-0.7.0-java/lib/ant_project.rb:108:in `method_missing'
C:/hudson/hudson-slave/workspace/Buildr-ci-build-jruby-win32/lib/buildr/java/tests.rb:171:in
`generate'
C:/hudson/hudson-slave/workspace/Buildr-ci-build-jruby-win32/lib/buildr/java/ant.rb:77:in
`ant'
C:/hudson/hudson-slave/workspace/Buildr-ci-build-jruby-win32/lib/buildr/java/ant.rb:73:in
`tap'
C:/hudson/hudson-slave/workspace/Buildr-ci-build-jruby-win32/lib/buildr/java/ant.rb:73:in
`ant'
C:/hudson/hudson-slave/workspace/Buildr-ci-build-jruby-win32/lib/buildr/java/tests.rb:168:in
`generate'
C:/hudson/hudson-slave/workspace/Buildr-ci-build-jruby-win32/lib/buildr/java/tests.rb:280
C:/hudson/tools/jruby-1.5.1/lib/ruby/gems/1.8/gems/rake-0.8.7/lib/rake.rb:634:in `call'
C:/hudson/tools/jruby-1.5.1/lib/ruby/gems/1.8/gems/rake-0.8.7/lib/rake.rb:634:in `execute'
C:/hudson/tools/jruby-1.5.1/lib/ruby/gems/1.8/gems/rake-0.8.7/lib/rake.rb:631:in `each'
C:/hudson/tools/jruby-1.5.1/lib/ruby/gems/1.8/gems/rake-0.8.7/lib/rake.rb:631:in `execute'
./spec/spec_helpers.rb:144:in `execute'
C:/hudson/hudson-slave/workspace/Buildr-ci-build-jruby-win32/lib/buildr/core/application.rb:636:in
`invoke_with_call_chain'
C:/hudson/tools/jruby-1.5.1/lib/ruby/1.8/monitor.rb:191:in `mon_synchronize'
C:/hudson/hudson-slave/workspace/Buildr-ci-build-jruby-win32/lib/buildr/core/application.rb:622:in
`invoke_with_call_chain'
C:/hudson/hudson-slave/workspace/Buildr-ci-build-jruby-win32/lib/buildr/core/application.rb:617:in
`invoke'
./spec/java/tests_spec.rb:317:
C:/hudson/tools/jruby-1.5.1/lib/ruby/gems/1.8/gems/rspec-1.3.0/lib/spec/matchers/change.rb:16:in
`call'
C:/hudson/tools/jruby-1.5.1/lib/ruby/gems/1.8/gems/rspec-1.3.0/lib/spec/matchers/change.rb:16:in
`matches?'
C:/hudson/tools/jruby-1.5.1/lib/ruby/gems/1.8/gems/rspec-1.3.0/lib/spec/expectations/handler.rb:11:in
`handle_matcher'
C:/hudson/tools/jruby-1.5.1/lib/ruby/gems/1.8/gems/rspec-1.3.0/lib/spec/expectations/extensions/kernel.rb:27:in
`should'
./spec/java/tests_spec.rb:317:
C:/hudson/tools/jruby-1.5.1/lib/ruby/gems/1.8/gems/rspec-1.3.0/lib/spec/example/example_methods.rb:40:in
`instance_eval'
C:/hudson/tools/jruby-1.5.1/lib/ruby/gems/1.8/gems/rspec-1.3.0/lib/spec/example/example_methods.rb:40:in
`execute'
C:/hudson/tools/jruby-1.5.1/lib/ruby/gems/1.8/gems/rspec-1.3.0/lib/spec/example/example_methods.rb:37:in
`execute'
C:/hudson/tools/jruby-1.5.1/lib/ruby/gems/1.8/gems/rspec-1.3.0/lib/spec/example/example_group_methods.rb:214:in
`run_examples'
C:/hudson/tools/jruby-1.5.1/lib/ruby/gems/1.8/gems/rspec-1.3.0/lib/spec/example/example_group_methods.rb:212:in
`each'
C:/hudson/tools/jruby-1.5.1/lib/ruby/gems/1.8/gems/rspec-1.3.0/lib/spec/example/example_group_methods.rb:212:in
`run_examples'
C:/hudson/tools/jruby-1.5.1/lib/ruby/gems/1.8/gems/rspec-1.3.0/lib/spec/example/example_group_methods.rb:103:in
`run'
C:/hudson/tools/jruby-1.5.1/lib/ruby/gems/1.8/gems/rspec-1.3.0/lib/spec/runner/example_group_runner.rb:23:in
`run'
C:/hudson/tools/jruby-1.5.1/lib/ruby/gems/1.8/gems/rspec-1.3.0/lib/spec/runner/example_group_runner.rb:22:in
`each'
C:/hudson/tools/jruby-1.5.1/lib/ruby/gems/1.8/gems/rspec-1.3.0/lib/spec/runner/example_group_runner.rb:22:in
`run'
C:/hudson/tools/jruby-1.5.1/lib/ruby/gems/1.8/gems/rspec-1.3.0/lib/spec/runner/options.rb:152:in
`run_examples'
C:/hudson/tools/jruby-1.5.1/lib/ruby/gems/1.8/gems/rspec-1.3.0/lib/spec/runner/command_line.rb:9:in
`run'
C:/hudson/tools/jruby-1.5.1/lib/ruby/gems/1.8/gems/rspec-1.3.0/bin/spec:5

4)
NativeException in 'Buildr::JUnit report should generate single page when frames is false'
org.apache.tools.ant.BuildException: Errors while applying transformations: java.lang.ClassNotFoundException:
org.apache.tools.ant.taskdefs.optional.TraXLiaison
org/apache/tools/ant/taskdefs/optional/junit/AggregateTransformer.java:266:in `transform'
org/apache/tools/ant/taskdefs/optional/junit/XMLResultAggregator.java:158:in `execute'
org/apache/tools/ant/UnknownElement.java:291:in `execute'
sun.reflect.GeneratedMethodAccessor24:-1:in `invoke'
sun/reflect/DelegatingMethodAccessorImpl.java:25:in `invoke'
java/lang/reflect/Method.java:597:in `invoke'
org/jruby/javasupport/JavaMethod.java:508:in `invokeDirectWithExceptionHandling'
org/apache/tools/ant/taskdefs/optional/junit/AggregateTransformer.java:266:in `transform'
org/apache/tools/ant/taskdefs/optional/junit/XMLResultAggregator.java:158:in `execute'
org/apache/tools/ant/UnknownElement.java:291:in `execute'
sun.reflect.GeneratedMethodAccessor24:-1:in `invoke'
sun/reflect/DelegatingMethodAccessorImpl.java:25:in `invoke'
java/lang/reflect/Method.java:597:in `invoke'
org/jruby/javasupport/JavaMethod.java:508:in `invokeDirectWithExceptionHandling'
C:/hudson/tools/jruby-1.5.1/lib/ruby/1.8/logger.rb:348:in `execute'
C:/hudson/tools/gems/gems/Antwrap-0.7.0-java/lib/ant_project.rb:108:in `method_missing'
C:/hudson/hudson-slave/workspace/Buildr-ci-build-jruby-win32/lib/buildr/java/tests.rb:171:in
`generate'
C:/hudson/hudson-slave/workspace/Buildr-ci-build-jruby-win32/lib/buildr/java/ant.rb:77:in
`ant'
C:/hudson/hudson-slave/workspace/Buildr-ci-build-jruby-win32/lib/buildr/java/ant.rb:73:in
`tap'
C:/hudson/hudson-slave/workspace/Buildr-ci-build-jruby-win32/lib/buildr/java/ant.rb:73:in
`ant'
C:/hudson/hudson-slave/workspace/Buildr-ci-build-jruby-win32/lib/buildr/java/tests.rb:168:in
`generate'
C:/hudson/hudson-slave/workspace/Buildr-ci-build-jruby-win32/lib/buildr/java/tests.rb:280
C:/hudson/tools/jruby-1.5.1/lib/ruby/gems/1.8/gems/rake-0.8.7/lib/rake.rb:634:in `call'
C:/hudson/tools/jruby-1.5.1/lib/ruby/gems/1.8/gems/rake-0.8.7/lib/rake.rb:634:in `execute'
C:/hudson/tools/jruby-1.5.1/lib/ruby/gems/1.8/gems/rake-0.8.7/lib/rake.rb:631:in `each'
C:/hudson/tools/jruby-1.5.1/lib/ruby/gems/1.8/gems/rake-0.8.7/lib/rake.rb:631:in `execute'
./spec/spec_helpers.rb:144:in `execute'
C:/hudson/hudson-slave/workspace/Buildr-ci-build-jruby-win32/lib/buildr/core/application.rb:636:in
`invoke_with_call_chain'
C:/hudson/tools/jruby-1.5.1/lib/ruby/1.8/monitor.rb:191:in `mon_synchronize'
C:/hudson/hudson-slave/workspace/Buildr-ci-build-jruby-win32/lib/buildr/core/application.rb:622:in
`invoke_with_call_chain'
C:/hudson/hudson-slave/workspace/Buildr-ci-build-jruby-win32/lib/buildr/core/application.rb:617:in
`invoke'
./spec/java/tests_spec.rb:326:
C:/hudson/tools/jruby-1.5.1/lib/ruby/gems/1.8/gems/rspec-1.3.0/lib/spec/example/example_methods.rb:40:in
`instance_eval'
C:/hudson/tools/jruby-1.5.1/lib/ruby/gems/1.8/gems/rspec-1.3.0/lib/spec/example/example_methods.rb:40:in
`execute'
C:/hudson/tools/jruby-1.5.1/lib/ruby/gems/1.8/gems/rspec-1.3.0/lib/spec/example/example_methods.rb:37:in
`execute'
C:/hudson/tools/jruby-1.5.1/lib/ruby/gems/1.8/gems/rspec-1.3.0/lib/spec/example/example_group_methods.rb:214:in
`run_examples'
C:/hudson/tools/jruby-1.5.1/lib/ruby/gems/1.8/gems/rspec-1.3.0/lib/spec/example/example_group_methods.rb:212:in
`each'
C:/hudson/tools/jruby-1.5.1/lib/ruby/gems/1.8/gems/rspec-1.3.0/lib/spec/example/example_group_methods.rb:212:in
`run_examples'
C:/hudson/tools/jruby-1.5.1/lib/ruby/gems/1.8/gems/rspec-1.3.0/lib/spec/example/example_group_methods.rb:103:in
`run'
C:/hudson/tools/jruby-1.5.1/lib/ruby/gems/1.8/gems/rspec-1.3.0/lib/spec/runner/example_group_runner.rb:23:in
`run'
C:/hudson/tools/jruby-1.5.1/lib/ruby/gems/1.8/gems/rspec-1.3.0/lib/spec/runner/example_group_runner.rb:22:in
`each'
C:/hudson/tools/jruby-1.5.1/lib/ruby/gems/1.8/gems/rspec-1.3.0/lib/spec/runner/example_group_runner.rb:22:in
`run'
C:/hudson/tools/jruby-1.5.1/lib/ruby/gems/1.8/gems/rspec-1.3.0/lib/spec/runner/options.rb:152:in
`run_examples'
C:/hudson/tools/jruby-1.5.1/lib/ruby/gems/1.8/gems/rspec-1.3.0/lib/spec/runner/command_line.rb:9:in
`run'
C:/hudson/tools/jruby-1.5.1/lib/ruby/gems/1.8/gems/rspec-1.3.0/bin/spec:5

5)
NativeException in 'Buildr::JUnit report should generate frame page when frames is false'
org.apache.tools.ant.BuildException: Errors while applying transformations: java.lang.ClassNotFoundException:
org.apache.tools.ant.taskdefs.optional.TraXLiaison
org/apache/tools/ant/taskdefs/optional/junit/AggregateTransformer.java:266:in `transform'
org/apache/tools/ant/taskdefs/optional/junit/XMLResultAggregator.java:158:in `execute'
org/apache/tools/ant/UnknownElement.java:291:in `execute'
sun.reflect.GeneratedMethodAccessor24:-1:in `invoke'
sun/reflect/DelegatingMethodAccessorImpl.java:25:in `invoke'
java/lang/reflect/Method.java:597:in `invoke'
org/jruby/javasupport/JavaMethod.java:508:in `invokeDirectWithExceptionHandling'
org/apache/tools/ant/taskdefs/optional/junit/AggregateTransformer.java:266:in `transform'
org/apache/tools/ant/taskdefs/optional/junit/XMLResultAggregator.java:158:in `execute'
org/apache/tools/ant/UnknownElement.java:291:in `execute'
sun.reflect.GeneratedMethodAccessor24:-1:in `invoke'
sun/reflect/DelegatingMethodAccessorImpl.java:25:in `invoke'
java/lang/reflect/Method.java:597:in `invoke'
org/jruby/javasupport/JavaMethod.java:508:in `invokeDirectWithExceptionHandling'
C:/hudson/tools/jruby-1.5.1/lib/ruby/1.8/logger.rb:348:in `execute'
C:/hudson/tools/gems/gems/Antwrap-0.7.0-java/lib/ant_project.rb:108:in `method_missing'
C:/hudson/hudson-slave/workspace/Buildr-ci-build-jruby-win32/lib/buildr/java/tests.rb:171:in
`generate'
C:/hudson/hudson-slave/workspace/Buildr-ci-build-jruby-win32/lib/buildr/java/ant.rb:77:in
`ant'
C:/hudson/hudson-slave/workspace/Buildr-ci-build-jruby-win32/lib/buildr/java/ant.rb:73:in
`tap'
C:/hudson/hudson-slave/workspace/Buildr-ci-build-jruby-win32/lib/buildr/java/ant.rb:73:in
`ant'
C:/hudson/hudson-slave/workspace/Buildr-ci-build-jruby-win32/lib/buildr/java/tests.rb:168:in
`generate'
C:/hudson/hudson-slave/workspace/Buildr-ci-build-jruby-win32/lib/buildr/java/tests.rb:280
C:/hudson/tools/jruby-1.5.1/lib/ruby/gems/1.8/gems/rake-0.8.7/lib/rake.rb:634:in `call'
C:/hudson/tools/jruby-1.5.1/lib/ruby/gems/1.8/gems/rake-0.8.7/lib/rake.rb:634:in `execute'
C:/hudson/tools/jruby-1.5.1/lib/ruby/gems/1.8/gems/rake-0.8.7/lib/rake.rb:631:in `each'
C:/hudson/tools/jruby-1.5.1/lib/ruby/gems/1.8/gems/rake-0.8.7/lib/rake.rb:631:in `execute'
./spec/spec_helpers.rb:144:in `execute'
C:/hudson/hudson-slave/workspace/Buildr-ci-build-jruby-win32/lib/buildr/core/application.rb:636:in
`invoke_with_call_chain'
C:/hudson/tools/jruby-1.5.1/lib/ruby/1.8/monitor.rb:191:in `mon_synchronize'
C:/hudson/hudson-slave/workspace/Buildr-ci-build-jruby-win32/lib/buildr/core/application.rb:622:in
`invoke_with_call_chain'
C:/hudson/hudson-slave/workspace/Buildr-ci-build-jruby-win32/lib/buildr/core/application.rb:617:in
`invoke'
./spec/java/tests_spec.rb:332:
C:/hudson/tools/jruby-1.5.1/lib/ruby/gems/1.8/gems/rspec-1.3.0/lib/spec/example/example_methods.rb:40:in
`instance_eval'
C:/hudson/tools/jruby-1.5.1/lib/ruby/gems/1.8/gems/rspec-1.3.0/lib/spec/example/example_methods.rb:40:in
`execute'
C:/hudson/tools/jruby-1.5.1/lib/ruby/gems/1.8/gems/rspec-1.3.0/lib/spec/example/example_methods.rb:37:in
`execute'
C:/hudson/tools/jruby-1.5.1/lib/ruby/gems/1.8/gems/rspec-1.3.0/lib/spec/example/example_group_methods.rb:214:in
`run_examples'
C:/hudson/tools/jruby-1.5.1/lib/ruby/gems/1.8/gems/rspec-1.3.0/lib/spec/example/example_group_methods.rb:212:in
`each'
C:/hudson/tools/jruby-1.5.1/lib/ruby/gems/1.8/gems/rspec-1.3.0/lib/spec/example/example_group_methods.rb:212:in
`run_examples'
C:/hudson/tools/jruby-1.5.1/lib/ruby/gems/1.8/gems/rspec-1.3.0/lib/spec/example/example_group_methods.rb:103:in
`run'
C:/hudson/tools/jruby-1.5.1/lib/ruby/gems/1.8/gems/rspec-1.3.0/lib/spec/runner/example_group_runner.rb:23:in
`run'
C:/hudson/tools/jruby-1.5.1/lib/ruby/gems/1.8/gems/rspec-1.3.0/lib/spec/runner/example_group_runner.rb:22:in
`each'
C:/hudson/tools/jruby-1.5.1/lib/ruby/gems/1.8/gems/rspec-1.3.0/lib/spec/runner/example_group_runner.rb:22:in
`run'
C:/hudson/tools/jruby-1.5.1/lib/ruby/gems/1.8/gems/rspec-1.3.0/lib/spec/runner/options.rb:152:in
`run_examples'
C:/hudson/tools/jruby-1.5.1/lib/ruby/gems/1.8/gems/rspec-1.3.0/lib/spec/runner/command_line.rb:9:in
`run'
C:/hudson/tools/jruby-1.5.1/lib/ruby/gems/1.8/gems/rspec-1.3.0/bin/spec:5

6)
NativeException in 'Buildr::JUnit report should generate reports from all projects that ran
test cases'
org.apache.tools.ant.BuildException: Errors while applying transformations: java.lang.ClassNotFoundException:
org.apache.tools.ant.taskdefs.optional.TraXLiaison
org/apache/tools/ant/taskdefs/optional/junit/AggregateTransformer.java:266:in `transform'
org/apache/tools/ant/taskdefs/optional/junit/XMLResultAggregator.java:158:in `execute'
org/apache/tools/ant/UnknownElement.java:291:in `execute'
sun.reflect.GeneratedMethodAccessor24:-1:in `invoke'
sun/reflect/DelegatingMethodAccessorImpl.java:25:in `invoke'
java/lang/reflect/Method.java:597:in `invoke'
org/jruby/javasupport/JavaMethod.java:508:in `invokeDirectWithExceptionHandling'
org/apache/tools/ant/taskdefs/optional/junit/AggregateTransformer.java:266:in `transform'
org/apache/tools/ant/taskdefs/optional/junit/XMLResultAggregator.java:158:in `execute'
org/apache/tools/ant/UnknownElement.java:291:in `execute'
sun.reflect.GeneratedMethodAccessor24:-1:in `invoke'
sun/reflect/DelegatingMethodAccessorImpl.java:25:in `invoke'
java/lang/reflect/Method.java:597:in `invoke'
org/jruby/javasupport/JavaMethod.java:508:in `invokeDirectWithExceptionHandling'
C:/hudson/tools/jruby-1.5.1/lib/ruby/1.8/logger.rb:348:in `execute'
C:/hudson/tools/gems/gems/Antwrap-0.7.0-java/lib/ant_project.rb:108:in `method_missing'
C:/hudson/hudson-slave/workspace/Buildr-ci-build-jruby-win32/lib/buildr/java/tests.rb:171:in
`generate'
C:/hudson/hudson-slave/workspace/Buildr-ci-build-jruby-win32/lib/buildr/java/ant.rb:77:in
`ant'
C:/hudson/hudson-slave/workspace/Buildr-ci-build-jruby-win32/lib/buildr/java/ant.rb:73:in
`tap'
C:/hudson/hudson-slave/workspace/Buildr-ci-build-jruby-win32/lib/buildr/java/ant.rb:73:in
`ant'
C:/hudson/hudson-slave/workspace/Buildr-ci-build-jruby-win32/lib/buildr/java/tests.rb:168:in
`generate'
C:/hudson/hudson-slave/workspace/Buildr-ci-build-jruby-win32/lib/buildr/java/tests.rb:280
C:/hudson/tools/jruby-1.5.1/lib/ruby/gems/1.8/gems/rake-0.8.7/lib/rake.rb:634:in `call'
C:/hudson/tools/jruby-1.5.1/lib/ruby/gems/1.8/gems/rake-0.8.7/lib/rake.rb:634:in `execute'
C:/hudson/tools/jruby-1.5.1/lib/ruby/gems/1.8/gems/rake-0.8.7/lib/rake.rb:631:in `each'
C:/hudson/tools/jruby-1.5.1/lib/ruby/gems/1.8/gems/rake-0.8.7/lib/rake.rb:631:in `execute'
./spec/spec_helpers.rb:144:in `execute'
C:/hudson/hudson-slave/workspace/Buildr-ci-build-jruby-win32/lib/buildr/core/application.rb:636:in
`invoke_with_call_chain'
C:/hudson/tools/jruby-1.5.1/lib/ruby/1.8/monitor.rb:191:in `mon_synchronize'
C:/hudson/hudson-slave/workspace/Buildr-ci-build-jruby-win32/lib/buildr/core/application.rb:622:in
`invoke_with_call_chain'
C:/hudson/hudson-slave/workspace/Buildr-ci-build-jruby-win32/lib/buildr/core/application.rb:617:in
`invoke'
./spec/java/tests_spec.rb:344:
C:/hudson/tools/jruby-1.5.1/lib/ruby/gems/1.8/gems/rspec-1.3.0/lib/spec/example/example_methods.rb:40:in
`instance_eval'
C:/hudson/tools/jruby-1.5.1/lib/ruby/gems/1.8/gems/rspec-1.3.0/lib/spec/example/example_methods.rb:40:in
`execute'
C:/hudson/tools/jruby-1.5.1/lib/ruby/gems/1.8/gems/rspec-1.3.0/lib/spec/example/example_methods.rb:37:in
`execute'
C:/hudson/tools/jruby-1.5.1/lib/ruby/gems/1.8/gems/rspec-1.3.0/lib/spec/example/example_group_methods.rb:214:in
`run_examples'
C:/hudson/tools/jruby-1.5.1/lib/ruby/gems/1.8/gems/rspec-1.3.0/lib/spec/example/example_group_methods.rb:212:in
`each'
C:/hudson/tools/jruby-1.5.1/lib/ruby/gems/1.8/gems/rspec-1.3.0/lib/spec/example/example_group_methods.rb:212:in
`run_examples'
C:/hudson/tools/jruby-1.5.1/lib/ruby/gems/1.8/gems/rspec-1.3.0/lib/spec/example/example_group_methods.rb:103:in
`run'
C:/hudson/tools/jruby-1.5.1/lib/ruby/gems/1.8/gems/rspec-1.3.0/lib/spec/runner/example_group_runner.rb:23:in
`run'
C:/hudson/tools/jruby-1.5.1/lib/ruby/gems/1.8/gems/rspec-1.3.0/lib/spec/runner/example_group_runner.rb:22:in
`each'
C:/hudson/tools/jruby-1.5.1/lib/ruby/gems/1.8/gems/rspec-1.3.0/lib/spec/runner/example_group_runner.rb:22:in
`run'
C:/hudson/tools/jruby-1.5.1/lib/ruby/gems/1.8/gems/rspec-1.3.0/lib/spec/runner/options.rb:152:in
`run_examples'
C:/hudson/tools/jruby-1.5.1/lib/ruby/gems/1.8/gems/rspec-1.3.0/lib/spec/runner/command_line.rb:9:in
`run'
C:/hudson/tools/jruby-1.5.1/lib/ruby/gems/1.8/gems/rspec-1.3.0/bin/spec:5

Finished in 560.881 seconds

1935 examples, 6 failures
rake aborted!
Command C:/hudson/tools/jruby-1.5.1/bin/jruby.exe -I"lib"  "C:/hudson/tools/jruby-1.5.1/lib/ruby/gems/1.8/gems/rspec-1.3.0/bin/spec"
"spec/version_requirement_spec.rb" "spec/addon/drb_spec.rb" "spec/core/application_spec.rb"
"spec/core/build_spec.rb" "spec/core/cc_spec.rb" "spec/core/checks_spec.rb" "spec/core/common_spec.rb"
"spec/core/compile_spec.rb" "spec/core/extension_spec.rb" "spec/core/generate_spec.rb" "spec/core/project_spec.rb"
"spec/core/test_spec.rb" "spec/core/transport_spec.rb" "spec/core/util_spec.rb" "spec/ide/eclipse_spec.rb"
"spec/ide/idea7x_spec.rb" "spec/java/ant_spec.rb" "spec/java/bdd_spec.rb" "spec/java/cobertura_spec.rb"
"spec/java/commands_spec.rb" "spec/java/compiler_spec.rb" "spec/java/emma_spec.rb" "spec/java/external_spec.rb"
"spec/java/java_spec.rb" "spec/java/packaging_spec.rb" "spec/java/tests_spec.rb" "spec/packaging/archive_spec.rb"
"spec/packaging/artifact_namespace_spec.rb" "spec/packaging/artifact_spec.rb" "spec/packaging/packaging_spec.rb"
"spec/scala/bdd_spec.rb" "spec/scala/compiler_spec.rb" "spec/scala/tests_spec.rb"  --format
failing_examples:failed --format html:_reports/specs.html --backtrace --require "C:/hudson/tools/gems/gems/ci_reporter-1.6.2/lib/ci/reporter/rake/rspec_loader.rb"
--format CI::Reporter::RSpec failed

(See full trace by running task with --trace)

<http://hudson.zones.apache.org/hudson/job/Buildr-ci-build-jruby-win32/ws/>exit>
1 
Recording test results


Mime
View raw message