buildr-ci mailing list archives

Site index · List index
Message view « Date » · « Thread »
Top « Date » · « Thread »
From Apache Hudson Server <hud...@hudson.zones.apache.org>
Subject Build failed in Hudson: buildr-ci-build-jruby #37
Date Tue, 29 Jun 2010 21:07:34 GMT
See <http://hudson.zones.apache.org/hudson/job/buildr-ci-build-jruby/37/changes>

Changes:

[toulmean] make sure to only require runtime dependencies in spec_helpers

[toulmean] remove annoying warning message from rubygems, and make sure to only check for
runtime dependencies

------------------------------------------
[...truncated 1663 lines...]
/home/toulmean/jruby-1.5.1/lib/ruby/gems/1.8/gems/rspec-1.3.0/lib/spec/runner/example_group_runner.rb:22:in
`each'
/home/toulmean/jruby-1.5.1/lib/ruby/gems/1.8/gems/rspec-1.3.0/lib/spec/runner/example_group_runner.rb:22:in
`run'
/home/toulmean/jruby-1.5.1/lib/ruby/gems/1.8/gems/rspec-1.3.0/lib/spec/runner/options.rb:152:in
`run_examples'
/home/toulmean/jruby-1.5.1/lib/ruby/gems/1.8/gems/rspec-1.3.0/lib/spec/runner/command_line.rb:9:in
`run'
/home/toulmean/jruby-1.5.1/lib/ruby/gems/1.8/gems/rspec-1.3.0/bin/spec:5:

9)
'javac compiler should identify itself from source directories' FAILED

expected :javac
     got :externaljavac

(compared using eql?)
/home/toulmean/jruby-1.5.1/lib/ruby/gems/1.8/gems/rspec-1.3.0/lib/spec/expectations/fail_with.rb:41:in
`fail_with'
/home/toulmean/jruby-1.5.1/lib/ruby/gems/1.8/gems/rspec-1.3.0/lib/spec/expectations/handler.rb:21:in
`handle_matcher'
/home/toulmean/jruby-1.5.1/lib/ruby/gems/1.8/gems/rspec-1.3.0/lib/spec/expectations/extensions/kernel.rb:27:in
`should'
./spec/java/compiler_spec.rb:23:
/home/toulmean/jruby-1.5.1/lib/ruby/gems/1.8/gems/rspec-1.3.0/lib/spec/example/example_methods.rb:40:in
`instance_eval'
/home/toulmean/jruby-1.5.1/lib/ruby/gems/1.8/gems/rspec-1.3.0/lib/spec/example/example_methods.rb:40:in
`execute'
/home/toulmean/jruby-1.5.1/lib/ruby/gems/1.8/gems/rspec-1.3.0/lib/spec/example/example_methods.rb:37:in
`execute'
/home/toulmean/jruby-1.5.1/lib/ruby/gems/1.8/gems/rspec-1.3.0/lib/spec/example/example_group_methods.rb:214:in
`run_examples'
/home/toulmean/jruby-1.5.1/lib/ruby/gems/1.8/gems/rspec-1.3.0/lib/spec/example/example_group_methods.rb:212:in
`each'
/home/toulmean/jruby-1.5.1/lib/ruby/gems/1.8/gems/rspec-1.3.0/lib/spec/example/example_group_methods.rb:212:in
`run_examples'
/home/toulmean/jruby-1.5.1/lib/ruby/gems/1.8/gems/rspec-1.3.0/lib/spec/example/example_group_methods.rb:103:in
`run'
/home/toulmean/jruby-1.5.1/lib/ruby/gems/1.8/gems/rspec-1.3.0/lib/spec/runner/example_group_runner.rb:23:in
`run'
/home/toulmean/jruby-1.5.1/lib/ruby/gems/1.8/gems/rspec-1.3.0/lib/spec/runner/example_group_runner.rb:22:in
`each'
/home/toulmean/jruby-1.5.1/lib/ruby/gems/1.8/gems/rspec-1.3.0/lib/spec/runner/example_group_runner.rb:22:in
`run'
/home/toulmean/jruby-1.5.1/lib/ruby/gems/1.8/gems/rspec-1.3.0/lib/spec/runner/options.rb:152:in
`run_examples'
/home/toulmean/jruby-1.5.1/lib/ruby/gems/1.8/gems/rspec-1.3.0/lib/spec/runner/command_line.rb:9:in
`run'
/home/toulmean/jruby-1.5.1/lib/ruby/gems/1.8/gems/rspec-1.3.0/bin/spec:5:

10)
'javac compiler should identify from source directories using custom layout' FAILED

expected :javac
     got :externaljavac

(compared using eql?)
/home/toulmean/jruby-1.5.1/lib/ruby/gems/1.8/gems/rspec-1.3.0/lib/spec/expectations/fail_with.rb:41:in
`fail_with'
/home/toulmean/jruby-1.5.1/lib/ruby/gems/1.8/gems/rspec-1.3.0/lib/spec/expectations/handler.rb:21:in
`handle_matcher'
/home/toulmean/jruby-1.5.1/lib/ruby/gems/1.8/gems/rspec-1.3.0/lib/spec/expectations/extensions/kernel.rb:27:in
`should'
./spec/java/compiler_spec.rb:33:
<http://hudson.zones.apache.org/hudson/job/buildr-ci-build-jruby/ws/lib/buildr/core/project.rb>:225:in
`instance_exec'
<http://hudson.zones.apache.org/hudson/job/buildr-ci-build-jruby/ws/lib/buildr/core/project.rb>:225:in
`define'
/home/toulmean/jruby-1.5.1/lib/ruby/gems/1.8/gems/rake-0.8.7/lib/rake.rb:636:in `call'
/home/toulmean/jruby-1.5.1/lib/ruby/gems/1.8/gems/rake-0.8.7/lib/rake.rb:636:in `execute'
/home/toulmean/jruby-1.5.1/lib/ruby/gems/1.8/gems/rake-0.8.7/lib/rake.rb:631:in `each'
/home/toulmean/jruby-1.5.1/lib/ruby/gems/1.8/gems/rake-0.8.7/lib/rake.rb:631:in `execute'
./spec/spec_helpers.rb:144:in `execute'
<http://hudson.zones.apache.org/hudson/job/buildr-ci-build-jruby/ws/lib/buildr/core/project.rb>:636:in
`execute'
<http://hudson.zones.apache.org/hudson/job/buildr-ci-build-jruby/ws/lib/buildr/core/application.rb>:146:in
`switch_to_namespace'
<http://hudson.zones.apache.org/hudson/job/buildr-ci-build-jruby/ws/lib/buildr/core/project.rb>:635:in
`execute'
<http://hudson.zones.apache.org/hudson/job/buildr-ci-build-jruby/ws/lib/buildr/core/application.rb>:636:in
`invoke_with_call_chain'
/home/toulmean/jruby-1.5.1/lib/ruby/1.8/monitor.rb:191:in `mon_synchronize'
<http://hudson.zones.apache.org/hudson/job/buildr-ci-build-jruby/ws/lib/buildr/core/application.rb>:622:in
`invoke_with_call_chain'
<http://hudson.zones.apache.org/hudson/job/buildr-ci-build-jruby/ws/lib/buildr/core/application.rb>:617:in
`invoke'
./spec/spec_helpers.rb:338:in `define'
./spec/spec_helpers.rb:338:in `tap'
./spec/spec_helpers.rb:338:in `define'
./spec/java/compiler_spec.rb:32:
/home/toulmean/jruby-1.5.1/lib/ruby/gems/1.8/gems/rspec-1.3.0/lib/spec/example/example_methods.rb:40:in
`instance_eval'
/home/toulmean/jruby-1.5.1/lib/ruby/gems/1.8/gems/rspec-1.3.0/lib/spec/example/example_methods.rb:40:in
`execute'
/home/toulmean/jruby-1.5.1/lib/ruby/gems/1.8/gems/rspec-1.3.0/lib/spec/example/example_methods.rb:37:in
`execute'
/home/toulmean/jruby-1.5.1/lib/ruby/gems/1.8/gems/rspec-1.3.0/lib/spec/example/example_group_methods.rb:214:in
`run_examples'
/home/toulmean/jruby-1.5.1/lib/ruby/gems/1.8/gems/rspec-1.3.0/lib/spec/example/example_group_methods.rb:212:in
`each'
/home/toulmean/jruby-1.5.1/lib/ruby/gems/1.8/gems/rspec-1.3.0/lib/spec/example/example_group_methods.rb:212:in
`run_examples'
/home/toulmean/jruby-1.5.1/lib/ruby/gems/1.8/gems/rspec-1.3.0/lib/spec/example/example_group_methods.rb:103:in
`run'
/home/toulmean/jruby-1.5.1/lib/ruby/gems/1.8/gems/rspec-1.3.0/lib/spec/runner/example_group_runner.rb:23:in
`run'
/home/toulmean/jruby-1.5.1/lib/ruby/gems/1.8/gems/rspec-1.3.0/lib/spec/runner/example_group_runner.rb:22:in
`each'
/home/toulmean/jruby-1.5.1/lib/ruby/gems/1.8/gems/rspec-1.3.0/lib/spec/runner/example_group_runner.rb:22:in
`run'
/home/toulmean/jruby-1.5.1/lib/ruby/gems/1.8/gems/rspec-1.3.0/lib/spec/runner/options.rb:152:in
`run_examples'
/home/toulmean/jruby-1.5.1/lib/ruby/gems/1.8/gems/rspec-1.3.0/lib/spec/runner/command_line.rb:9:in
`run'
/home/toulmean/jruby-1.5.1/lib/ruby/gems/1.8/gems/rspec-1.3.0/bin/spec:5:

11)
'javac compiler should identify from compile source directories' FAILED
result should have been changed to :javac, but is now :externaljavac
/home/toulmean/jruby-1.5.1/lib/ruby/gems/1.8/gems/rspec-1.3.0/lib/spec/expectations/fail_with.rb:41:in
`fail_with'
/home/toulmean/jruby-1.5.1/lib/ruby/gems/1.8/gems/rspec-1.3.0/lib/spec/expectations/handler.rb:21:in
`handle_matcher'
/home/toulmean/jruby-1.5.1/lib/ruby/gems/1.8/gems/rspec-1.3.0/lib/spec/expectations/extensions/kernel.rb:27:in
`should'
./spec/java/compiler_spec.rb:42:
<http://hudson.zones.apache.org/hudson/job/buildr-ci-build-jruby/ws/lib/buildr/core/project.rb>:225:in
`instance_exec'
<http://hudson.zones.apache.org/hudson/job/buildr-ci-build-jruby/ws/lib/buildr/core/project.rb>:225:in
`define'
/home/toulmean/jruby-1.5.1/lib/ruby/gems/1.8/gems/rake-0.8.7/lib/rake.rb:636:in `call'
/home/toulmean/jruby-1.5.1/lib/ruby/gems/1.8/gems/rake-0.8.7/lib/rake.rb:636:in `execute'
/home/toulmean/jruby-1.5.1/lib/ruby/gems/1.8/gems/rake-0.8.7/lib/rake.rb:631:in `each'
/home/toulmean/jruby-1.5.1/lib/ruby/gems/1.8/gems/rake-0.8.7/lib/rake.rb:631:in `execute'
./spec/spec_helpers.rb:144:in `execute'
<http://hudson.zones.apache.org/hudson/job/buildr-ci-build-jruby/ws/lib/buildr/core/project.rb>:636:in
`execute'
<http://hudson.zones.apache.org/hudson/job/buildr-ci-build-jruby/ws/lib/buildr/core/application.rb>:146:in
`switch_to_namespace'
<http://hudson.zones.apache.org/hudson/job/buildr-ci-build-jruby/ws/lib/buildr/core/project.rb>:635:in
`execute'
<http://hudson.zones.apache.org/hudson/job/buildr-ci-build-jruby/ws/lib/buildr/core/application.rb>:636:in
`invoke_with_call_chain'
/home/toulmean/jruby-1.5.1/lib/ruby/1.8/monitor.rb:191:in `mon_synchronize'
<http://hudson.zones.apache.org/hudson/job/buildr-ci-build-jruby/ws/lib/buildr/core/application.rb>:622:in
`invoke_with_call_chain'
<http://hudson.zones.apache.org/hudson/job/buildr-ci-build-jruby/ws/lib/buildr/core/application.rb>:617:in
`invoke'
./spec/spec_helpers.rb:338:in `define'
./spec/spec_helpers.rb:338:in `tap'
./spec/spec_helpers.rb:338:in `define'
./spec/java/compiler_spec.rb:41:
/home/toulmean/jruby-1.5.1/lib/ruby/gems/1.8/gems/rspec-1.3.0/lib/spec/example/example_methods.rb:40:in
`instance_eval'
/home/toulmean/jruby-1.5.1/lib/ruby/gems/1.8/gems/rspec-1.3.0/lib/spec/example/example_methods.rb:40:in
`execute'
/home/toulmean/jruby-1.5.1/lib/ruby/gems/1.8/gems/rspec-1.3.0/lib/spec/example/example_methods.rb:37:in
`execute'
/home/toulmean/jruby-1.5.1/lib/ruby/gems/1.8/gems/rspec-1.3.0/lib/spec/example/example_group_methods.rb:214:in
`run_examples'
/home/toulmean/jruby-1.5.1/lib/ruby/gems/1.8/gems/rspec-1.3.0/lib/spec/example/example_group_methods.rb:212:in
`each'
/home/toulmean/jruby-1.5.1/lib/ruby/gems/1.8/gems/rspec-1.3.0/lib/spec/example/example_group_methods.rb:212:in
`run_examples'
/home/toulmean/jruby-1.5.1/lib/ruby/gems/1.8/gems/rspec-1.3.0/lib/spec/example/example_group_methods.rb:103:in
`run'
/home/toulmean/jruby-1.5.1/lib/ruby/gems/1.8/gems/rspec-1.3.0/lib/spec/runner/example_group_runner.rb:23:in
`run'
/home/toulmean/jruby-1.5.1/lib/ruby/gems/1.8/gems/rspec-1.3.0/lib/spec/runner/example_group_runner.rb:22:in
`each'
/home/toulmean/jruby-1.5.1/lib/ruby/gems/1.8/gems/rspec-1.3.0/lib/spec/runner/example_group_runner.rb:22:in
`run'
/home/toulmean/jruby-1.5.1/lib/ruby/gems/1.8/gems/rspec-1.3.0/lib/spec/runner/options.rb:152:in
`run_examples'
/home/toulmean/jruby-1.5.1/lib/ruby/gems/1.8/gems/rspec-1.3.0/lib/spec/runner/command_line.rb:9:in
`run'
/home/toulmean/jruby-1.5.1/lib/ruby/gems/1.8/gems/rspec-1.3.0/bin/spec:5:

12)
RuntimeError in 'javac compiler should include tools.jar dependency'
Failed to compile, see errors above
<http://hudson.zones.apache.org/hudson/job/buildr-ci-build-jruby/ws/lib/buildr/java/external.rb>:43:in
`compile'
<http://hudson.zones.apache.org/hudson/job/buildr-ci-build-jruby/ws/lib/buildr/core/compile.rb>:247:in
`initialize'
/home/toulmean/jruby-1.5.1/lib/ruby/gems/1.8/gems/rake-0.8.7/lib/rake.rb:634:in `call'
/home/toulmean/jruby-1.5.1/lib/ruby/gems/1.8/gems/rake-0.8.7/lib/rake.rb:634:in `execute'
/home/toulmean/jruby-1.5.1/lib/ruby/gems/1.8/gems/rake-0.8.7/lib/rake.rb:631:in `each'
/home/toulmean/jruby-1.5.1/lib/ruby/gems/1.8/gems/rake-0.8.7/lib/rake.rb:631:in `execute'
./spec/spec_helpers.rb:144:in `execute'
<http://hudson.zones.apache.org/hudson/job/buildr-ci-build-jruby/ws/lib/buildr/core/application.rb>:636:in
`invoke_with_call_chain'
/home/toulmean/jruby-1.5.1/lib/ruby/1.8/monitor.rb:191:in `mon_synchronize'
<http://hudson.zones.apache.org/hudson/job/buildr-ci-build-jruby/ws/lib/buildr/core/application.rb>:622:in
`invoke_with_call_chain'
<http://hudson.zones.apache.org/hudson/job/buildr-ci-build-jruby/ws/lib/buildr/core/application.rb>:617:in
`invoke'
./spec/java/compiler_spec.rb:87:
/home/toulmean/jruby-1.5.1/lib/ruby/gems/1.8/gems/rspec-1.3.0/lib/spec/example/example_methods.rb:40:in
`instance_eval'
/home/toulmean/jruby-1.5.1/lib/ruby/gems/1.8/gems/rspec-1.3.0/lib/spec/example/example_methods.rb:40:in
`execute'
/home/toulmean/jruby-1.5.1/lib/ruby/gems/1.8/gems/rspec-1.3.0/lib/spec/example/example_methods.rb:37:in
`execute'
/home/toulmean/jruby-1.5.1/lib/ruby/gems/1.8/gems/rspec-1.3.0/lib/spec/example/example_group_methods.rb:214:in
`run_examples'
/home/toulmean/jruby-1.5.1/lib/ruby/gems/1.8/gems/rspec-1.3.0/lib/spec/example/example_group_methods.rb:212:in
`each'
/home/toulmean/jruby-1.5.1/lib/ruby/gems/1.8/gems/rspec-1.3.0/lib/spec/example/example_group_methods.rb:212:in
`run_examples'
/home/toulmean/jruby-1.5.1/lib/ruby/gems/1.8/gems/rspec-1.3.0/lib/spec/example/example_group_methods.rb:103:in
`run'
/home/toulmean/jruby-1.5.1/lib/ruby/gems/1.8/gems/rspec-1.3.0/lib/spec/runner/example_group_runner.rb:23:in
`run'
/home/toulmean/jruby-1.5.1/lib/ruby/gems/1.8/gems/rspec-1.3.0/lib/spec/runner/example_group_runner.rb:22:in
`each'
/home/toulmean/jruby-1.5.1/lib/ruby/gems/1.8/gems/rspec-1.3.0/lib/spec/runner/example_group_runner.rb:22:in
`run'
/home/toulmean/jruby-1.5.1/lib/ruby/gems/1.8/gems/rspec-1.3.0/lib/spec/runner/options.rb:152:in
`run_examples'
/home/toulmean/jruby-1.5.1/lib/ruby/gems/1.8/gems/rspec-1.3.0/lib/spec/runner/command_line.rb:9:in
`run'
/home/toulmean/jruby-1.5.1/lib/ruby/gems/1.8/gems/rspec-1.3.0/bin/spec:5:

13)
'Buildr::CompileTask should allow overriding the guessed compiler' FAILED
expected: :javac,
     got: :externaljavac (using ==)
/home/toulmean/jruby-1.5.1/lib/ruby/gems/1.8/gems/rspec-1.3.0/lib/spec/expectations/fail_with.rb:41:in
`fail_with'
/home/toulmean/jruby-1.5.1/lib/ruby/gems/1.8/gems/rspec-1.3.0/lib/spec/matchers/operator_matcher.rb:39:in
`fail_with_message'
/home/toulmean/jruby-1.5.1/lib/ruby/gems/1.8/gems/rspec-1.3.0/lib/spec/matchers/operator_matcher.rb:61:in
`__delegate_operator'
/home/toulmean/jruby-1.5.1/lib/ruby/gems/1.8/gems/rspec-1.3.0/lib/spec/matchers/operator_matcher.rb:51:in
`eval_match'
/home/toulmean/jruby-1.5.1/lib/ruby/gems/1.8/gems/rspec-1.3.0/lib/spec/matchers/operator_matcher.rb:29:in
`=='
./spec/core/compile_spec.rb:114:
/home/toulmean/jruby-1.5.1/lib/ruby/gems/1.8/gems/rspec-1.3.0/lib/spec/example/example_methods.rb:40:in
`instance_eval'
/home/toulmean/jruby-1.5.1/lib/ruby/gems/1.8/gems/rspec-1.3.0/lib/spec/example/example_methods.rb:40:in
`execute'
/home/toulmean/jruby-1.5.1/lib/ruby/gems/1.8/gems/rspec-1.3.0/lib/spec/example/example_methods.rb:37:in
`execute'
/home/toulmean/jruby-1.5.1/lib/ruby/gems/1.8/gems/rspec-1.3.0/lib/spec/example/example_group_methods.rb:214:in
`run_examples'
/home/toulmean/jruby-1.5.1/lib/ruby/gems/1.8/gems/rspec-1.3.0/lib/spec/example/example_group_methods.rb:212:in
`each'
/home/toulmean/jruby-1.5.1/lib/ruby/gems/1.8/gems/rspec-1.3.0/lib/spec/example/example_group_methods.rb:212:in
`run_examples'
/home/toulmean/jruby-1.5.1/lib/ruby/gems/1.8/gems/rspec-1.3.0/lib/spec/example/example_group_methods.rb:103:in
`run'
/home/toulmean/jruby-1.5.1/lib/ruby/gems/1.8/gems/rspec-1.3.0/lib/spec/runner/example_group_runner.rb:23:in
`run'
/home/toulmean/jruby-1.5.1/lib/ruby/gems/1.8/gems/rspec-1.3.0/lib/spec/runner/example_group_runner.rb:22:in
`each'
/home/toulmean/jruby-1.5.1/lib/ruby/gems/1.8/gems/rspec-1.3.0/lib/spec/runner/example_group_runner.rb:22:in
`run'
/home/toulmean/jruby-1.5.1/lib/ruby/gems/1.8/gems/rspec-1.3.0/lib/spec/runner/options.rb:152:in
`run_examples'
/home/toulmean/jruby-1.5.1/lib/ruby/gems/1.8/gems/rspec-1.3.0/lib/spec/runner/command_line.rb:9:in
`run'
/home/toulmean/jruby-1.5.1/lib/ruby/gems/1.8/gems/rspec-1.3.0/bin/spec:5:

14)
'Buildr::Project#test.compile should identify compiler from project' FAILED

expected :javac
     got :externaljavac

(compared using eql?)
/home/toulmean/jruby-1.5.1/lib/ruby/gems/1.8/gems/rspec-1.3.0/lib/spec/expectations/fail_with.rb:41:in
`fail_with'
/home/toulmean/jruby-1.5.1/lib/ruby/gems/1.8/gems/rspec-1.3.0/lib/spec/expectations/handler.rb:21:in
`handle_matcher'
/home/toulmean/jruby-1.5.1/lib/ruby/gems/1.8/gems/rspec-1.3.0/lib/spec/expectations/extensions/kernel.rb:27:in
`should'
./spec/core/test_spec.rb:546:
<http://hudson.zones.apache.org/hudson/job/buildr-ci-build-jruby/ws/lib/buildr/core/project.rb>:225:in
`instance_exec'
<http://hudson.zones.apache.org/hudson/job/buildr-ci-build-jruby/ws/lib/buildr/core/project.rb>:225:in
`define'
/home/toulmean/jruby-1.5.1/lib/ruby/gems/1.8/gems/rake-0.8.7/lib/rake.rb:636:in `call'
/home/toulmean/jruby-1.5.1/lib/ruby/gems/1.8/gems/rake-0.8.7/lib/rake.rb:636:in `execute'
/home/toulmean/jruby-1.5.1/lib/ruby/gems/1.8/gems/rake-0.8.7/lib/rake.rb:631:in `each'
/home/toulmean/jruby-1.5.1/lib/ruby/gems/1.8/gems/rake-0.8.7/lib/rake.rb:631:in `execute'
./spec/spec_helpers.rb:144:in `execute'
<http://hudson.zones.apache.org/hudson/job/buildr-ci-build-jruby/ws/lib/buildr/core/project.rb>:636:in
`execute'
<http://hudson.zones.apache.org/hudson/job/buildr-ci-build-jruby/ws/lib/buildr/core/application.rb>:146:in
`switch_to_namespace'
<http://hudson.zones.apache.org/hudson/job/buildr-ci-build-jruby/ws/lib/buildr/core/project.rb>:635:in
`execute'
<http://hudson.zones.apache.org/hudson/job/buildr-ci-build-jruby/ws/lib/buildr/core/application.rb>:636:in
`invoke_with_call_chain'
/home/toulmean/jruby-1.5.1/lib/ruby/1.8/monitor.rb:191:in `mon_synchronize'
<http://hudson.zones.apache.org/hudson/job/buildr-ci-build-jruby/ws/lib/buildr/core/application.rb>:622:in
`invoke_with_call_chain'
<http://hudson.zones.apache.org/hudson/job/buildr-ci-build-jruby/ws/lib/buildr/core/application.rb>:617:in
`invoke'
./spec/spec_helpers.rb:338:in `define'
./spec/spec_helpers.rb:338:in `tap'
./spec/spec_helpers.rb:338:in `define'
./spec/core/test_spec.rb:545:
/home/toulmean/jruby-1.5.1/lib/ruby/gems/1.8/gems/rspec-1.3.0/lib/spec/example/example_methods.rb:40:in
`instance_eval'
/home/toulmean/jruby-1.5.1/lib/ruby/gems/1.8/gems/rspec-1.3.0/lib/spec/example/example_methods.rb:40:in
`execute'
/home/toulmean/jruby-1.5.1/lib/ruby/gems/1.8/gems/rspec-1.3.0/lib/spec/example/example_methods.rb:37:in
`execute'
/home/toulmean/jruby-1.5.1/lib/ruby/gems/1.8/gems/rspec-1.3.0/lib/spec/example/example_group_methods.rb:214:in
`run_examples'
/home/toulmean/jruby-1.5.1/lib/ruby/gems/1.8/gems/rspec-1.3.0/lib/spec/example/example_group_methods.rb:212:in
`each'
/home/toulmean/jruby-1.5.1/lib/ruby/gems/1.8/gems/rspec-1.3.0/lib/spec/example/example_group_methods.rb:212:in
`run_examples'
/home/toulmean/jruby-1.5.1/lib/ruby/gems/1.8/gems/rspec-1.3.0/lib/spec/example/example_group_methods.rb:103:in
`run'
/home/toulmean/jruby-1.5.1/lib/ruby/gems/1.8/gems/rspec-1.3.0/lib/spec/runner/example_group_runner.rb:23:in
`run'
/home/toulmean/jruby-1.5.1/lib/ruby/gems/1.8/gems/rspec-1.3.0/lib/spec/runner/example_group_runner.rb:22:in
`each'
/home/toulmean/jruby-1.5.1/lib/ruby/gems/1.8/gems/rspec-1.3.0/lib/spec/runner/example_group_runner.rb:22:in
`run'
/home/toulmean/jruby-1.5.1/lib/ruby/gems/1.8/gems/rspec-1.3.0/lib/spec/runner/options.rb:152:in
`run_examples'
/home/toulmean/jruby-1.5.1/lib/ruby/gems/1.8/gems/rspec-1.3.0/lib/spec/runner/command_line.rb:9:in
`run'
/home/toulmean/jruby-1.5.1/lib/ruby/gems/1.8/gems/rspec-1.3.0/bin/spec:5:

15)
RuntimeError in 'Buildr::Project#test.compile should clean after itself'
Failed to compile, see errors above
<http://hudson.zones.apache.org/hudson/job/buildr-ci-build-jruby/ws/lib/buildr/java/external.rb>:43:in
`compile'
<http://hudson.zones.apache.org/hudson/job/buildr-ci-build-jruby/ws/lib/buildr/core/compile.rb>:247:in
`initialize'
/home/toulmean/jruby-1.5.1/lib/ruby/gems/1.8/gems/rake-0.8.7/lib/rake.rb:634:in `call'
/home/toulmean/jruby-1.5.1/lib/ruby/gems/1.8/gems/rake-0.8.7/lib/rake.rb:634:in `execute'
/home/toulmean/jruby-1.5.1/lib/ruby/gems/1.8/gems/rake-0.8.7/lib/rake.rb:631:in `each'
/home/toulmean/jruby-1.5.1/lib/ruby/gems/1.8/gems/rake-0.8.7/lib/rake.rb:631:in `execute'
./spec/spec_helpers.rb:144:in `execute'
<http://hudson.zones.apache.org/hudson/job/buildr-ci-build-jruby/ws/lib/buildr/core/test.rb>:640:in
`execute_after_skip_if_no_test'
<http://hudson.zones.apache.org/hudson/job/buildr-ci-build-jruby/ws/lib/buildr/core/application.rb>:636:in
`invoke_with_call_chain'
/home/toulmean/jruby-1.5.1/lib/ruby/1.8/monitor.rb:191:in `mon_synchronize'
<http://hudson.zones.apache.org/hudson/job/buildr-ci-build-jruby/ws/lib/buildr/core/application.rb>:622:in
`invoke_with_call_chain'
<http://hudson.zones.apache.org/hudson/job/buildr-ci-build-jruby/ws/lib/buildr/core/application.rb>:617:in
`invoke'
./spec/core/test_spec.rb:591:
/home/toulmean/jruby-1.5.1/lib/ruby/gems/1.8/gems/rspec-1.3.0/lib/spec/example/example_methods.rb:40:in
`instance_eval'
/home/toulmean/jruby-1.5.1/lib/ruby/gems/1.8/gems/rspec-1.3.0/lib/spec/example/example_methods.rb:40:in
`execute'
/home/toulmean/jruby-1.5.1/lib/ruby/gems/1.8/gems/rspec-1.3.0/lib/spec/example/example_methods.rb:37:in
`execute'
/home/toulmean/jruby-1.5.1/lib/ruby/gems/1.8/gems/rspec-1.3.0/lib/spec/example/example_group_methods.rb:214:in
`run_examples'
/home/toulmean/jruby-1.5.1/lib/ruby/gems/1.8/gems/rspec-1.3.0/lib/spec/example/example_group_methods.rb:212:in
`each'
/home/toulmean/jruby-1.5.1/lib/ruby/gems/1.8/gems/rspec-1.3.0/lib/spec/example/example_group_methods.rb:212:in
`run_examples'
/home/toulmean/jruby-1.5.1/lib/ruby/gems/1.8/gems/rspec-1.3.0/lib/spec/example/example_group_methods.rb:103:in
`run'
/home/toulmean/jruby-1.5.1/lib/ruby/gems/1.8/gems/rspec-1.3.0/lib/spec/runner/example_group_runner.rb:23:in
`run'
/home/toulmean/jruby-1.5.1/lib/ruby/gems/1.8/gems/rspec-1.3.0/lib/spec/runner/example_group_runner.rb:22:in
`each'
/home/toulmean/jruby-1.5.1/lib/ruby/gems/1.8/gems/rspec-1.3.0/lib/spec/runner/example_group_runner.rb:22:in
`run'
/home/toulmean/jruby-1.5.1/lib/ruby/gems/1.8/gems/rspec-1.3.0/lib/spec/runner/options.rb:152:in
`run_examples'
/home/toulmean/jruby-1.5.1/lib/ruby/gems/1.8/gems/rspec-1.3.0/lib/spec/runner/command_line.rb:9:in
`run'
/home/toulmean/jruby-1.5.1/lib/ruby/gems/1.8/gems/rspec-1.3.0/bin/spec:5:

Finished in 322.153 seconds

1936 examples, 15 failures
mkdir -p <http://hudson.zones.apache.org/hudson/job/buildr-ci-build-jruby/ws/tmp/home>
mkdir -p <http://hudson.zones.apache.org/hudson/job/buildr-ci-build-jruby/ws/tmp/home/.buildr>
rake aborted!
Command /home/toulmean/jruby-1.5.1/bin/jruby -I"lib"  "/home/toulmean/jruby-1.5.1/lib/ruby/gems/1.8/gems/rspec-1.3.0/bin/spec"
"spec/version_requirement_spec.rb" "spec/addon/drb_spec.rb" "spec/java/commands_spec.rb" "spec/java/external_spec.rb"
"spec/java/packaging_spec.rb" "spec/java/tests_spec.rb" "spec/java/bdd_spec.rb" "spec/java/emma_spec.rb"
"spec/java/ant_spec.rb" "spec/java/cobertura_spec.rb" "spec/java/compiler_spec.rb" "spec/java/java_spec.rb"
"spec/core/compile_spec.rb" "spec/core/common_spec.rb" "spec/core/cc_spec.rb" "spec/core/project_spec.rb"
"spec/core/generate_spec.rb" "spec/core/checks_spec.rb" "spec/core/application_spec.rb" "spec/core/util_spec.rb"
"spec/core/extension_spec.rb" "spec/core/transport_spec.rb" "spec/core/test_spec.rb" "spec/core/build_spec.rb"
"spec/ide/idea7x_spec.rb" "spec/ide/eclipse_spec.rb" "spec/packaging/artifact_spec.rb" "spec/packaging/artifact_namespace_spec.rb"
"spec/packaging/packaging_spec.rb" "spec/packaging/archive_spec.rb" "spec/scala/tests_spec.rb"
"spec/scala/bdd_spec.rb" "spec/scala/compiler_spec.rb"  --format failing_examples:failed --format
html:_reports/specs.html --backtrace --require "/home/toulmean/buildr-gems/gems/ci_reporter-1.6.2/lib/ci/reporter/rake/rspec_loader.rb"
--format CI::Reporter::RSpec failed

(See full trace by running task with --trace)
Recording test results


Mime
View raw message