buildr-ci mailing list archives

Site index · List index
Message view « Date » · « Thread »
Top « Date » · « Thread »
From Apache Hudson Server <hud...@hudson.zones.apache.org>
Subject Build failed in Hudson: Buildr-ci-build #40
Date Tue, 29 Jun 2010 20:52:35 GMT
See <http://hudson.zones.apache.org/hudson/job/Buildr-ci-build/40/changes>

Changes:

[toulmean] make sure to only require runtime dependencies in spec_helpers

------------------------------------------
[...truncated 684 lines...]
/home/toulmean/buildr-gems/gems/Antwrap-0.7.0-java/lib/ant_project.rb:108:in `method_missing'
<http://hudson.zones.apache.org/hudson/job/Buildr-ci-build/ws/lib/buildr/java/tests.rb>:171:in
`generate'
<http://hudson.zones.apache.org/hudson/job/Buildr-ci-build/ws/lib/buildr/java/ant.rb>:77:in
`ant'
<http://hudson.zones.apache.org/hudson/job/Buildr-ci-build/ws/lib/buildr/java/ant.rb>:73:in
`tap'
<http://hudson.zones.apache.org/hudson/job/Buildr-ci-build/ws/lib/buildr/java/ant.rb>:73:in
`ant'
<http://hudson.zones.apache.org/hudson/job/Buildr-ci-build/ws/lib/buildr/java/tests.rb>:168:in
`generate'
<http://hudson.zones.apache.org/hudson/job/Buildr-ci-build/ws/lib/buildr/java/tests.rb>:280:
/home/toulmean/buildr-gems/gems/rake-0.8.7/lib/rake.rb:634:in `call'
/home/toulmean/buildr-gems/gems/rake-0.8.7/lib/rake.rb:634:in `execute_without_a_record'
/home/toulmean/buildr-gems/gems/rake-0.8.7/lib/rake.rb:631:in `each'
/home/toulmean/buildr-gems/gems/rake-0.8.7/lib/rake.rb:631:in `execute_without_a_record'
./spec/groovy/../spec_helpers.rb:144:in `execute'
<http://hudson.zones.apache.org/hudson/job/Buildr-ci-build/ws/lib/buildr/core/application.rb>:636:in
`invoke_with_call_chain'
/usr/lib/ruby/1.8/monitor.rb:242:in `synchronize'
<http://hudson.zones.apache.org/hudson/job/Buildr-ci-build/ws/lib/buildr/core/application.rb>:622:in
`invoke_with_call_chain'
<http://hudson.zones.apache.org/hudson/job/Buildr-ci-build/ws/lib/buildr/core/application.rb>:617:in
`invoke'
./spec/java/tests_spec.rb:344:
/home/toulmean/buildr-gems/gems/rspec-1.2.9/lib/spec/example/example_methods.rb:40:in `instance_eval'
/home/toulmean/buildr-gems/gems/rspec-1.2.9/lib/spec/example/example_methods.rb:40:in `execute'
/usr/lib/ruby/1.8/timeout.rb:53:in `timeout'
/home/toulmean/buildr-gems/gems/rspec-1.2.9/lib/spec/example/example_methods.rb:37:in `execute'
/home/toulmean/buildr-gems/gems/rspec-1.2.9/lib/spec/example/example_group_methods.rb:214:in
`run_examples'
/home/toulmean/buildr-gems/gems/rspec-1.2.9/lib/spec/example/example_group_methods.rb:212:in
`each'
/home/toulmean/buildr-gems/gems/rspec-1.2.9/lib/spec/example/example_group_methods.rb:212:in
`run_examples'
/home/toulmean/buildr-gems/gems/rspec-1.2.9/lib/spec/example/example_group_methods.rb:103:in
`run'
/home/toulmean/buildr-gems/gems/rspec-1.2.9/lib/spec/runner/example_group_runner.rb:23:in
`run'
/home/toulmean/buildr-gems/gems/rspec-1.2.9/lib/spec/runner/example_group_runner.rb:22:in
`each'
/home/toulmean/buildr-gems/gems/rspec-1.2.9/lib/spec/runner/example_group_runner.rb:22:in
`run'
/home/toulmean/buildr-gems/gems/rspec-1.2.9/lib/spec/runner/options.rb:151:in `run_examples'
/home/toulmean/buildr-gems/gems/rspec-1.2.9/lib/spec/runner/command_line.rb:9:in `run'
/home/toulmean/buildr-gems/gems/rspec-1.2.9/bin/spec:5:

7)
'javac compiler should identify itself from source directories' FAILED

expected :javac
     got :externaljavac

(compared using eql?)
/home/toulmean/buildr-gems/gems/rspec-1.2.9/lib/spec/expectations/fail_with.rb:41:in `fail_with'
/home/toulmean/buildr-gems/gems/rspec-1.2.9/lib/spec/expectations/handler.rb:21:in `handle_matcher'
/home/toulmean/buildr-gems/gems/rspec-1.2.9/lib/spec/expectations/extensions/kernel.rb:27:in
`should'
./spec/java/compiler_spec.rb:23:
/home/toulmean/buildr-gems/gems/rspec-1.2.9/lib/spec/example/example_methods.rb:40:in `instance_eval'
/home/toulmean/buildr-gems/gems/rspec-1.2.9/lib/spec/example/example_methods.rb:40:in `execute'
/usr/lib/ruby/1.8/timeout.rb:53:in `timeout'
/home/toulmean/buildr-gems/gems/rspec-1.2.9/lib/spec/example/example_methods.rb:37:in `execute'
/home/toulmean/buildr-gems/gems/rspec-1.2.9/lib/spec/example/example_group_methods.rb:214:in
`run_examples'
/home/toulmean/buildr-gems/gems/rspec-1.2.9/lib/spec/example/example_group_methods.rb:212:in
`each'
/home/toulmean/buildr-gems/gems/rspec-1.2.9/lib/spec/example/example_group_methods.rb:212:in
`run_examples'
/home/toulmean/buildr-gems/gems/rspec-1.2.9/lib/spec/example/example_group_methods.rb:103:in
`run'
/home/toulmean/buildr-gems/gems/rspec-1.2.9/lib/spec/runner/example_group_runner.rb:23:in
`run'
/home/toulmean/buildr-gems/gems/rspec-1.2.9/lib/spec/runner/example_group_runner.rb:22:in
`each'
/home/toulmean/buildr-gems/gems/rspec-1.2.9/lib/spec/runner/example_group_runner.rb:22:in
`run'
/home/toulmean/buildr-gems/gems/rspec-1.2.9/lib/spec/runner/options.rb:151:in `run_examples'
/home/toulmean/buildr-gems/gems/rspec-1.2.9/lib/spec/runner/command_line.rb:9:in `run'
/home/toulmean/buildr-gems/gems/rspec-1.2.9/bin/spec:5:

8)
'javac compiler should identify from source directories using custom layout' FAILED

expected :javac
     got :externaljavac

(compared using eql?)
/home/toulmean/buildr-gems/gems/rspec-1.2.9/lib/spec/expectations/fail_with.rb:41:in `fail_with'
/home/toulmean/buildr-gems/gems/rspec-1.2.9/lib/spec/expectations/handler.rb:21:in `handle_matcher'
/home/toulmean/buildr-gems/gems/rspec-1.2.9/lib/spec/expectations/extensions/kernel.rb:27:in
`should'
./spec/java/compiler_spec.rb:33:
<http://hudson.zones.apache.org/hudson/job/Buildr-ci-build/ws/lib/buildr/core/project.rb>:225:in
`instance_exec'
<http://hudson.zones.apache.org/hudson/job/Buildr-ci-build/ws/lib/buildr/core/project.rb>:225:in
`define'
/home/toulmean/buildr-gems/gems/rake-0.8.7/lib/rake.rb:636:in `call'
/home/toulmean/buildr-gems/gems/rake-0.8.7/lib/rake.rb:636:in `execute_without_a_record'
/home/toulmean/buildr-gems/gems/rake-0.8.7/lib/rake.rb:631:in `each'
/home/toulmean/buildr-gems/gems/rake-0.8.7/lib/rake.rb:631:in `execute_without_a_record'
./spec/groovy/../spec_helpers.rb:144:in `execute'
<http://hudson.zones.apache.org/hudson/job/Buildr-ci-build/ws/lib/buildr/core/project.rb>:636:in
`execute'
<http://hudson.zones.apache.org/hudson/job/Buildr-ci-build/ws/lib/buildr/core/application.rb>:146:in
`switch_to_namespace'
<http://hudson.zones.apache.org/hudson/job/Buildr-ci-build/ws/lib/buildr/core/project.rb>:635:in
`execute'
<http://hudson.zones.apache.org/hudson/job/Buildr-ci-build/ws/lib/buildr/core/application.rb>:636:in
`invoke_with_call_chain'
/usr/lib/ruby/1.8/monitor.rb:242:in `synchronize'
<http://hudson.zones.apache.org/hudson/job/Buildr-ci-build/ws/lib/buildr/core/application.rb>:622:in
`invoke_with_call_chain'
<http://hudson.zones.apache.org/hudson/job/Buildr-ci-build/ws/lib/buildr/core/application.rb>:617:in
`invoke'
./spec/groovy/../spec_helpers.rb:338:in `define'
./spec/groovy/../spec_helpers.rb:338:in `tap'
./spec/groovy/../spec_helpers.rb:338:in `define'
./spec/java/compiler_spec.rb:32:
/home/toulmean/buildr-gems/gems/rspec-1.2.9/lib/spec/example/example_methods.rb:40:in `instance_eval'
/home/toulmean/buildr-gems/gems/rspec-1.2.9/lib/spec/example/example_methods.rb:40:in `execute'
/usr/lib/ruby/1.8/timeout.rb:53:in `timeout'
/home/toulmean/buildr-gems/gems/rspec-1.2.9/lib/spec/example/example_methods.rb:37:in `execute'
/home/toulmean/buildr-gems/gems/rspec-1.2.9/lib/spec/example/example_group_methods.rb:214:in
`run_examples'
/home/toulmean/buildr-gems/gems/rspec-1.2.9/lib/spec/example/example_group_methods.rb:212:in
`each'
/home/toulmean/buildr-gems/gems/rspec-1.2.9/lib/spec/example/example_group_methods.rb:212:in
`run_examples'
/home/toulmean/buildr-gems/gems/rspec-1.2.9/lib/spec/example/example_group_methods.rb:103:in
`run'
/home/toulmean/buildr-gems/gems/rspec-1.2.9/lib/spec/runner/example_group_runner.rb:23:in
`run'
/home/toulmean/buildr-gems/gems/rspec-1.2.9/lib/spec/runner/example_group_runner.rb:22:in
`each'
/home/toulmean/buildr-gems/gems/rspec-1.2.9/lib/spec/runner/example_group_runner.rb:22:in
`run'
/home/toulmean/buildr-gems/gems/rspec-1.2.9/lib/spec/runner/options.rb:151:in `run_examples'
/home/toulmean/buildr-gems/gems/rspec-1.2.9/lib/spec/runner/command_line.rb:9:in `run'
/home/toulmean/buildr-gems/gems/rspec-1.2.9/bin/spec:5:

9)
'javac compiler should identify from compile source directories' FAILED
result should have been changed to :javac, but is now :externaljavac
/home/toulmean/buildr-gems/gems/rspec-1.2.9/lib/spec/expectations/fail_with.rb:41:in `fail_with'
/home/toulmean/buildr-gems/gems/rspec-1.2.9/lib/spec/expectations/handler.rb:21:in `handle_matcher'
/home/toulmean/buildr-gems/gems/rspec-1.2.9/lib/spec/expectations/extensions/kernel.rb:27:in
`should'
./spec/java/compiler_spec.rb:42:
<http://hudson.zones.apache.org/hudson/job/Buildr-ci-build/ws/lib/buildr/core/project.rb>:225:in
`instance_exec'
<http://hudson.zones.apache.org/hudson/job/Buildr-ci-build/ws/lib/buildr/core/project.rb>:225:in
`define'
/home/toulmean/buildr-gems/gems/rake-0.8.7/lib/rake.rb:636:in `call'
/home/toulmean/buildr-gems/gems/rake-0.8.7/lib/rake.rb:636:in `execute_without_a_record'
/home/toulmean/buildr-gems/gems/rake-0.8.7/lib/rake.rb:631:in `each'
/home/toulmean/buildr-gems/gems/rake-0.8.7/lib/rake.rb:631:in `execute_without_a_record'
./spec/groovy/../spec_helpers.rb:144:in `execute'
<http://hudson.zones.apache.org/hudson/job/Buildr-ci-build/ws/lib/buildr/core/project.rb>:636:in
`execute'
<http://hudson.zones.apache.org/hudson/job/Buildr-ci-build/ws/lib/buildr/core/application.rb>:146:in
`switch_to_namespace'
<http://hudson.zones.apache.org/hudson/job/Buildr-ci-build/ws/lib/buildr/core/project.rb>:635:in
`execute'
<http://hudson.zones.apache.org/hudson/job/Buildr-ci-build/ws/lib/buildr/core/application.rb>:636:in
`invoke_with_call_chain'
/usr/lib/ruby/1.8/monitor.rb:242:in `synchronize'
<http://hudson.zones.apache.org/hudson/job/Buildr-ci-build/ws/lib/buildr/core/application.rb>:622:in
`invoke_with_call_chain'
<http://hudson.zones.apache.org/hudson/job/Buildr-ci-build/ws/lib/buildr/core/application.rb>:617:in
`invoke'
./spec/groovy/../spec_helpers.rb:338:in `define'
./spec/groovy/../spec_helpers.rb:338:in `tap'
./spec/groovy/../spec_helpers.rb:338:in `define'
./spec/java/compiler_spec.rb:41:
/home/toulmean/buildr-gems/gems/rspec-1.2.9/lib/spec/example/example_methods.rb:40:in `instance_eval'
/home/toulmean/buildr-gems/gems/rspec-1.2.9/lib/spec/example/example_methods.rb:40:in `execute'
/usr/lib/ruby/1.8/timeout.rb:53:in `timeout'
/home/toulmean/buildr-gems/gems/rspec-1.2.9/lib/spec/example/example_methods.rb:37:in `execute'
/home/toulmean/buildr-gems/gems/rspec-1.2.9/lib/spec/example/example_group_methods.rb:214:in
`run_examples'
/home/toulmean/buildr-gems/gems/rspec-1.2.9/lib/spec/example/example_group_methods.rb:212:in
`each'
/home/toulmean/buildr-gems/gems/rspec-1.2.9/lib/spec/example/example_group_methods.rb:212:in
`run_examples'
/home/toulmean/buildr-gems/gems/rspec-1.2.9/lib/spec/example/example_group_methods.rb:103:in
`run'
/home/toulmean/buildr-gems/gems/rspec-1.2.9/lib/spec/runner/example_group_runner.rb:23:in
`run'
/home/toulmean/buildr-gems/gems/rspec-1.2.9/lib/spec/runner/example_group_runner.rb:22:in
`each'
/home/toulmean/buildr-gems/gems/rspec-1.2.9/lib/spec/runner/example_group_runner.rb:22:in
`run'
/home/toulmean/buildr-gems/gems/rspec-1.2.9/lib/spec/runner/options.rb:151:in `run_examples'
/home/toulmean/buildr-gems/gems/rspec-1.2.9/lib/spec/runner/command_line.rb:9:in `run'
/home/toulmean/buildr-gems/gems/rspec-1.2.9/bin/spec:5:

10)
RuntimeError in 'javac compiler should include tools.jar dependency'
Failed to compile, see errors above
<http://hudson.zones.apache.org/hudson/job/Buildr-ci-build/ws/lib/buildr/java/external.rb>:43:in
`compile'
<http://hudson.zones.apache.org/hudson/job/Buildr-ci-build/ws/lib/buildr/core/compile.rb>:247:in
`initialize'
/home/toulmean/buildr-gems/gems/rake-0.8.7/lib/rake.rb:634:in `call'
/home/toulmean/buildr-gems/gems/rake-0.8.7/lib/rake.rb:634:in `execute_without_a_record'
/home/toulmean/buildr-gems/gems/rake-0.8.7/lib/rake.rb:631:in `each'
/home/toulmean/buildr-gems/gems/rake-0.8.7/lib/rake.rb:631:in `execute_without_a_record'
./spec/groovy/../spec_helpers.rb:144:in `execute'
<http://hudson.zones.apache.org/hudson/job/Buildr-ci-build/ws/lib/buildr/core/application.rb>:636:in
`invoke_with_call_chain'
/usr/lib/ruby/1.8/monitor.rb:242:in `synchronize'
<http://hudson.zones.apache.org/hudson/job/Buildr-ci-build/ws/lib/buildr/core/application.rb>:622:in
`invoke_with_call_chain'
<http://hudson.zones.apache.org/hudson/job/Buildr-ci-build/ws/lib/buildr/core/application.rb>:617:in
`invoke'
./spec/java/compiler_spec.rb:87:
/home/toulmean/buildr-gems/gems/rspec-1.2.9/lib/spec/example/example_methods.rb:40:in `instance_eval'
/home/toulmean/buildr-gems/gems/rspec-1.2.9/lib/spec/example/example_methods.rb:40:in `execute'
/usr/lib/ruby/1.8/timeout.rb:53:in `timeout'
/home/toulmean/buildr-gems/gems/rspec-1.2.9/lib/spec/example/example_methods.rb:37:in `execute'
/home/toulmean/buildr-gems/gems/rspec-1.2.9/lib/spec/example/example_group_methods.rb:214:in
`run_examples'
/home/toulmean/buildr-gems/gems/rspec-1.2.9/lib/spec/example/example_group_methods.rb:212:in
`each'
/home/toulmean/buildr-gems/gems/rspec-1.2.9/lib/spec/example/example_group_methods.rb:212:in
`run_examples'
/home/toulmean/buildr-gems/gems/rspec-1.2.9/lib/spec/example/example_group_methods.rb:103:in
`run'
/home/toulmean/buildr-gems/gems/rspec-1.2.9/lib/spec/runner/example_group_runner.rb:23:in
`run'
/home/toulmean/buildr-gems/gems/rspec-1.2.9/lib/spec/runner/example_group_runner.rb:22:in
`each'
/home/toulmean/buildr-gems/gems/rspec-1.2.9/lib/spec/runner/example_group_runner.rb:22:in
`run'
/home/toulmean/buildr-gems/gems/rspec-1.2.9/lib/spec/runner/options.rb:151:in `run_examples'
/home/toulmean/buildr-gems/gems/rspec-1.2.9/lib/spec/runner/command_line.rb:9:in `run'
/home/toulmean/buildr-gems/gems/rspec-1.2.9/bin/spec:5:

11)
'Buildr::CompileTask should allow overriding the guessed compiler' FAILED
expected: :javac,
     got: :externaljavac (using ==)
/home/toulmean/buildr-gems/gems/rspec-1.2.9/lib/spec/expectations/fail_with.rb:41:in `fail_with'
/home/toulmean/buildr-gems/gems/rspec-1.2.9/lib/spec/matchers/operator_matcher.rb:39:in `fail_with_message'
/home/toulmean/buildr-gems/gems/rspec-1.2.9/lib/spec/matchers/operator_matcher.rb:61:in `__delegate_operator'
/home/toulmean/buildr-gems/gems/rspec-1.2.9/lib/spec/matchers/operator_matcher.rb:51:in `eval_match'
/home/toulmean/buildr-gems/gems/rspec-1.2.9/lib/spec/matchers/operator_matcher.rb:29:in `=='
./spec/core/compile_spec.rb:114:
/home/toulmean/buildr-gems/gems/rspec-1.2.9/lib/spec/example/example_methods.rb:40:in `instance_eval'
/home/toulmean/buildr-gems/gems/rspec-1.2.9/lib/spec/example/example_methods.rb:40:in `execute'
/usr/lib/ruby/1.8/timeout.rb:53:in `timeout'
/home/toulmean/buildr-gems/gems/rspec-1.2.9/lib/spec/example/example_methods.rb:37:in `execute'
/home/toulmean/buildr-gems/gems/rspec-1.2.9/lib/spec/example/example_group_methods.rb:214:in
`run_examples'
/home/toulmean/buildr-gems/gems/rspec-1.2.9/lib/spec/example/example_group_methods.rb:212:in
`each'
/home/toulmean/buildr-gems/gems/rspec-1.2.9/lib/spec/example/example_group_methods.rb:212:in
`run_examples'
/home/toulmean/buildr-gems/gems/rspec-1.2.9/lib/spec/example/example_group_methods.rb:103:in
`run'
/home/toulmean/buildr-gems/gems/rspec-1.2.9/lib/spec/runner/example_group_runner.rb:23:in
`run'
/home/toulmean/buildr-gems/gems/rspec-1.2.9/lib/spec/runner/example_group_runner.rb:22:in
`each'
/home/toulmean/buildr-gems/gems/rspec-1.2.9/lib/spec/runner/example_group_runner.rb:22:in
`run'
/home/toulmean/buildr-gems/gems/rspec-1.2.9/lib/spec/runner/options.rb:151:in `run_examples'
/home/toulmean/buildr-gems/gems/rspec-1.2.9/lib/spec/runner/command_line.rb:9:in `run'
/home/toulmean/buildr-gems/gems/rspec-1.2.9/bin/spec:5:

12)
'Buildr::Project#test.compile should identify compiler from project' FAILED

expected :javac
     got :externaljavac

(compared using eql?)
/home/toulmean/buildr-gems/gems/rspec-1.2.9/lib/spec/expectations/fail_with.rb:41:in `fail_with'
/home/toulmean/buildr-gems/gems/rspec-1.2.9/lib/spec/expectations/handler.rb:21:in `handle_matcher'
/home/toulmean/buildr-gems/gems/rspec-1.2.9/lib/spec/expectations/extensions/kernel.rb:27:in
`should'
./spec/core/test_spec.rb:546:
<http://hudson.zones.apache.org/hudson/job/Buildr-ci-build/ws/lib/buildr/core/project.rb>:225:in
`instance_exec'
<http://hudson.zones.apache.org/hudson/job/Buildr-ci-build/ws/lib/buildr/core/project.rb>:225:in
`define'
/home/toulmean/buildr-gems/gems/rake-0.8.7/lib/rake.rb:636:in `call'
/home/toulmean/buildr-gems/gems/rake-0.8.7/lib/rake.rb:636:in `execute_without_a_record'
/home/toulmean/buildr-gems/gems/rake-0.8.7/lib/rake.rb:631:in `each'
/home/toulmean/buildr-gems/gems/rake-0.8.7/lib/rake.rb:631:in `execute_without_a_record'
./spec/groovy/../spec_helpers.rb:144:in `execute'
<http://hudson.zones.apache.org/hudson/job/Buildr-ci-build/ws/lib/buildr/core/project.rb>:636:in
`execute'
<http://hudson.zones.apache.org/hudson/job/Buildr-ci-build/ws/lib/buildr/core/application.rb>:146:in
`switch_to_namespace'
<http://hudson.zones.apache.org/hudson/job/Buildr-ci-build/ws/lib/buildr/core/project.rb>:635:in
`execute'
<http://hudson.zones.apache.org/hudson/job/Buildr-ci-build/ws/lib/buildr/core/application.rb>:636:in
`invoke_with_call_chain'
/usr/lib/ruby/1.8/monitor.rb:242:in `synchronize'
<http://hudson.zones.apache.org/hudson/job/Buildr-ci-build/ws/lib/buildr/core/application.rb>:622:in
`invoke_with_call_chain'
<http://hudson.zones.apache.org/hudson/job/Buildr-ci-build/ws/lib/buildr/core/application.rb>:617:in
`invoke'
./spec/groovy/../spec_helpers.rb:338:in `define'
./spec/groovy/../spec_helpers.rb:338:in `tap'
./spec/groovy/../spec_helpers.rb:338:in `define'
./spec/core/test_spec.rb:545:
/home/toulmean/buildr-gems/gems/rspec-1.2.9/lib/spec/example/example_methods.rb:40:in `instance_eval'
/home/toulmean/buildr-gems/gems/rspec-1.2.9/lib/spec/example/example_methods.rb:40:in `execute'
/usr/lib/ruby/1.8/timeout.rb:53:in `timeout'
/home/toulmean/buildr-gems/gems/rspec-1.2.9/lib/spec/example/example_methods.rb:37:in `execute'
/home/toulmean/buildr-gems/gems/rspec-1.2.9/lib/spec/example/example_group_methods.rb:214:in
`run_examples'
/home/toulmean/buildr-gems/gems/rspec-1.2.9/lib/spec/example/example_group_methods.rb:212:in
`each'
/home/toulmean/buildr-gems/gems/rspec-1.2.9/lib/spec/example/example_group_methods.rb:212:in
`run_examples'
/home/toulmean/buildr-gems/gems/rspec-1.2.9/lib/spec/example/example_group_methods.rb:103:in
`run'
/home/toulmean/buildr-gems/gems/rspec-1.2.9/lib/spec/runner/example_group_runner.rb:23:in
`run'
/home/toulmean/buildr-gems/gems/rspec-1.2.9/lib/spec/runner/example_group_runner.rb:22:in
`each'
/home/toulmean/buildr-gems/gems/rspec-1.2.9/lib/spec/runner/example_group_runner.rb:22:in
`run'
/home/toulmean/buildr-gems/gems/rspec-1.2.9/lib/spec/runner/options.rb:151:in `run_examples'
/home/toulmean/buildr-gems/gems/rspec-1.2.9/lib/spec/runner/command_line.rb:9:in `run'
/home/toulmean/buildr-gems/gems/rspec-1.2.9/bin/spec:5:

Finished in 331.651418 seconds

1971 examples, 12 failures
rake aborted!
Command /usr/bin/ruby1.8 -I"lib"  "/home/toulmean/buildr-gems/gems/rspec-1.2.9/bin/spec" "spec/groovy/bdd_spec.rb"
"spec/groovy/compiler_spec.rb" "spec/addon/drb_spec.rb" "spec/java/commands_spec.rb" "spec/java/external_spec.rb"
"spec/java/packaging_spec.rb" "spec/java/tests_spec.rb" "spec/java/bdd_spec.rb" "spec/java/emma_spec.rb"
"spec/java/ant_spec.rb" "spec/java/cobertura_spec.rb" "spec/java/compiler_spec.rb" "spec/java/java_spec.rb"
"spec/core/compile_spec.rb" "spec/core/common_spec.rb" "spec/core/cc_spec.rb" "spec/core/project_spec.rb"
"spec/core/generate_spec.rb" "spec/core/checks_spec.rb" "spec/core/application_spec.rb" "spec/core/util_spec.rb"
"spec/core/extension_spec.rb" "spec/core/transport_spec.rb" "spec/core/test_spec.rb" "spec/core/build_spec.rb"
"spec/ide/idea7x_spec.rb" "spec/ide/eclipse_spec.rb" "spec/packaging/artifact_spec.rb" "spec/packaging/artifact_namespace_spec.rb"
"spec/packaging/packaging_spec.rb" "spec/packaging/archive_spec.rb" "spec/version_requirement_spec.rb"
"spec/scala/tests_spec.rb" "spec/scala/bdd_spec.rb" "spec/scala/compiler_spec.rb"  --format
failing_examples:failed --format html:_reports/specs.html --backtrace --require "/home/toulmean/buildr-gems/gems/ci_reporter-1.6.2/lib/ci/reporter/rake/rspec_loader.rb"
--format CI::Reporter::RSpec failed

(See full trace by running task with --trace)
Recording test results


Mime
View raw message