brooklyn-dev mailing list archives

Site index · List index
Message view « Date » · « Thread »
Top « Date » · « Thread »
From Apache Jenkins Server <jenk...@builds.apache.org>
Subject Build failed in Jenkins: brooklyn-master-build-docker #54
Date Tue, 05 Dec 2017 09:14:08 GMT
See <https://builds.apache.org/job/brooklyn-master-build-docker/54/display/redirect>

------------------------------------------
[...truncated 8.72 MB...]
	at org.ops4j.pax.exam.karaf.container.internal.KarafTestContainer.start(KarafTestContainer.java:187)
	at org.ops4j.pax.exam.spi.reactors.EagerSingleStagedReactor.setUp(EagerSingleStagedReactor.java:86)
	at org.ops4j.pax.exam.spi.reactors.EagerSingleStagedReactor.beforeClass(EagerSingleStagedReactor.java:136)
	at org.ops4j.pax.exam.spi.reactors.ReactorManager.beforeClass(ReactorManager.java:457)
	at org.ops4j.pax.exam.junit.impl.ProbeRunner.run(ProbeRunner.java:97)
	at org.ops4j.pax.exam.junit.PaxExam.run(PaxExam.java:93)
	at org.junit.runners.Suite.runChild(Suite.java:128)
	at org.junit.runners.Suite.runChild(Suite.java:27)
	at org.junit.runners.ParentRunner$3.run(ParentRunner.java:290)
	at org.junit.runners.ParentRunner$1.schedule(ParentRunner.java:71)
	at org.junit.runners.ParentRunner.runChildren(ParentRunner.java:288)
	at org.junit.runners.ParentRunner.access$000(ParentRunner.java:58)
	at org.junit.runners.ParentRunner$2.evaluate(ParentRunner.java:268)
	at org.junit.runners.ParentRunner.run(ParentRunner.java:363)
	at org.junit.runner.JUnitCore.run(JUnitCore.java:137)
	at org.junit.runner.JUnitCore.run(JUnitCore.java:115)
	at org.apache.maven.surefire.junitcore.JUnitCoreWrapper.createRequestAndRun(JUnitCoreWrapper.java:108)
	at org.apache.maven.surefire.junitcore.JUnitCoreWrapper.executeEager(JUnitCoreWrapper.java:78)
	at org.apache.maven.surefire.junitcore.JUnitCoreWrapper.execute(JUnitCoreWrapper.java:54)
	at org.apache.maven.surefire.junitcore.JUnitCoreProvider.invoke(JUnitCoreProvider.java:144)
	at org.apache.maven.surefire.booter.ForkedBooter.invokeProviderInSameClassLoader(ForkedBooter.java:203)
	at org.apache.maven.surefire.booter.ForkedBooter.runSuitesInProcess(ForkedBooter.java:155)
	at org.apache.maven.surefire.booter.ForkedBooter.main(ForkedBooter.java:103)
Caused by: java.rmi.NotBoundException: fed6f26b-97b7-4803-9c11-8dd4ef9dac94
	at sun.rmi.registry.RegistryImpl.lookup(RegistryImpl.java:227)
	at sun.rmi.registry.RegistryImpl_Skel.dispatch(RegistryImpl_Skel.java:115)
	at sun.rmi.server.UnicastServerRef.oldDispatch(UnicastServerRef.java:468)
	at sun.rmi.server.UnicastServerRef.dispatch(UnicastServerRef.java:300)
	at sun.rmi.transport.Transport$1.run(Transport.java:200)
	at sun.rmi.transport.Transport$1.run(Transport.java:197)
	at java.security.AccessController.doPrivileged(Native Method)
	at sun.rmi.transport.Transport.serviceCall(Transport.java:196)
	at sun.rmi.transport.tcp.TCPTransport.handleMessages(TCPTransport.java:568)
	at sun.rmi.transport.tcp.TCPTransport$ConnectionHandler.run0(TCPTransport.java:826)
	at sun.rmi.transport.tcp.TCPTransport$ConnectionHandler.lambda$run$0(TCPTransport.java:683)
	at java.security.AccessController.doPrivileged(Native Method)
	at sun.rmi.transport.tcp.TCPTransport$ConnectionHandler.run(TCPTransport.java:682)
	at java.util.concurrent.ThreadPoolExecutor.runWorker(ThreadPoolExecutor.java:1149)
	at java.util.concurrent.ThreadPoolExecutor$Worker.run(ThreadPoolExecutor.java:624)
	at java.lang.Thread.run(Thread.java:748)
	at sun.rmi.transport.StreamRemoteCall.exceptionReceivedFromServer(StreamRemoteCall.java:283)
	at sun.rmi.transport.StreamRemoteCall.executeCall(StreamRemoteCall.java:260)
	at sun.rmi.server.UnicastRef.invoke(UnicastRef.java:375)
	at sun.rmi.registry.RegistryImpl_Stub.lookup(RegistryImpl_Stub.java:119)
	at org.ops4j.pax.exam.rbc.client.intern.RemoteBundleContextClientImpl.getRemoteBundleContext(RemoteBundleContextClientImpl.java:248)
	at org.ops4j.pax.exam.rbc.client.intern.RemoteBundleContextClientImpl.waitForState(RemoteBundleContextClientImpl.java:218)
	at org.ops4j.pax.exam.karaf.container.internal.KarafTestContainer.waitForState(KarafTestContainer.java:646)
	at org.ops4j.pax.exam.karaf.container.internal.KarafTestContainer.startKaraf(KarafTestContainer.java:253)
	at org.ops4j.pax.exam.karaf.container.internal.KarafTestContainer.start(KarafTestContainer.java:187)
	at org.ops4j.pax.exam.spi.reactors.EagerSingleStagedReactor.setUp(EagerSingleStagedReactor.java:86)
	at org.ops4j.pax.exam.spi.reactors.EagerSingleStagedReactor.beforeClass(EagerSingleStagedReactor.java:136)
	at org.ops4j.pax.exam.spi.reactors.ReactorManager.beforeClass(ReactorManager.java:457)
	at org.ops4j.pax.exam.junit.impl.ProbeRunner.run(ProbeRunner.java:97)
	at org.ops4j.pax.exam.junit.PaxExam.run(PaxExam.java:93)
	at org.junit.runners.Suite.runChild(Suite.java:128)
	at org.junit.runners.Suite.runChild(Suite.java:27)
	at org.junit.runners.ParentRunner$3.run(ParentRunner.java:290)
	at org.junit.runners.ParentRunner$1.schedule(ParentRunner.java:71)
	at org.junit.runners.ParentRunner.runChildren(ParentRunner.java:288)
	at org.junit.runners.ParentRunner.access$000(ParentRunner.java:58)
	at org.junit.runners.ParentRunner$2.evaluate(ParentRunner.java:268)
	at org.junit.runners.ParentRunner.run(ParentRunner.java:363)
	at org.junit.runner.JUnitCore.run(JUnitCore.java:137)
	at org.junit.runner.JUnitCore.run(JUnitCore.java:115)
	at org.apache.maven.surefire.junitcore.JUnitCoreWrapper.createRequestAndRun(JUnitCoreWrapper.java:108)
	at org.apache.maven.surefire.junitcore.JUnitCoreWrapper.executeEager(JUnitCoreWrapper.java:78)
	at org.apache.maven.surefire.junitcore.JUnitCoreWrapper.execute(JUnitCoreWrapper.java:54)
	at org.apache.maven.surefire.junitcore.JUnitCoreProvider.invoke(JUnitCoreProvider.java:144)
	at org.apache.maven.surefire.booter.ForkedBooter.invokeProviderInSameClassLoader(ForkedBooter.java:203)
	at org.apache.maven.surefire.booter.ForkedBooter.runSuitesInProcess(ForkedBooter.java:155)
	at org.apache.maven.surefire.booter.ForkedBooter.main(ForkedBooter.java:103)

Failure when constructing test  Time elapsed: 0.406 sec  <<< ERROR!
java.lang.RuntimeException: Container never came up
	at org.ops4j.pax.exam.karaf.container.internal.KarafTestContainer.stop(KarafTestContainer.java:616)
	at org.ops4j.pax.exam.spi.reactors.EagerSingleStagedReactor.tearDown(EagerSingleStagedReactor.java:118)
	at org.ops4j.pax.exam.spi.reactors.EagerSingleStagedReactor.afterClass(EagerSingleStagedReactor.java:132)
	at org.ops4j.pax.exam.spi.reactors.ReactorManager.afterClass(ReactorManager.java:441)
	at org.ops4j.pax.exam.junit.impl.ProbeRunner.run(ProbeRunner.java:107)
	at org.ops4j.pax.exam.junit.PaxExam.run(PaxExam.java:93)
	at org.junit.runners.Suite.runChild(Suite.java:128)
	at org.junit.runners.Suite.runChild(Suite.java:27)
	at org.junit.runners.ParentRunner$3.run(ParentRunner.java:290)
	at org.junit.runners.ParentRunner$1.schedule(ParentRunner.java:71)
	at org.junit.runners.ParentRunner.runChildren(ParentRunner.java:288)
	at org.junit.runners.ParentRunner.access$000(ParentRunner.java:58)
	at org.junit.runners.ParentRunner$2.evaluate(ParentRunner.java:268)
	at org.junit.runners.ParentRunner.run(ParentRunner.java:363)
	at org.junit.runner.JUnitCore.run(JUnitCore.java:137)
	at org.junit.runner.JUnitCore.run(JUnitCore.java:115)
	at org.apache.maven.surefire.junitcore.JUnitCoreWrapper.createRequestAndRun(JUnitCoreWrapper.java:108)
	at org.apache.maven.surefire.junitcore.JUnitCoreWrapper.executeEager(JUnitCoreWrapper.java:78)
	at org.apache.maven.surefire.junitcore.JUnitCoreWrapper.execute(JUnitCoreWrapper.java:54)
	at org.apache.maven.surefire.junitcore.JUnitCoreProvider.invoke(JUnitCoreProvider.java:144)
	at org.apache.maven.surefire.booter.ForkedBooter.invokeProviderInSameClassLoader(ForkedBooter.java:203)
	at org.apache.maven.surefire.booter.ForkedBooter.runSuitesInProcess(ForkedBooter.java:155)
	at org.apache.maven.surefire.booter.ForkedBooter.main(ForkedBooter.java:103)


Results :

Tests in error: 
  Container never came up
  AssemblyTest.org.apache.brooklyn.AssemblyTest ยป Runtime Cannot get the remote ...

Tests run: 2, Failures: 0, Errors: 2, Skipped: 0

[INFO] ------------------------------------------------------------------------
[INFO] Reactor Summary:
[INFO] 
[INFO] Brooklyn REST JavaScript Web GUI ................... SUCCESS [ 36.211 s]
[INFO] Brooklyn Server Root ............................... SUCCESS [  0.205 s]
[INFO] Brooklyn Parent Project ............................ SUCCESS [  2.799 s]
[INFO] Brooklyn Test Support Utilities .................... SUCCESS [  3.701 s]
[INFO] Brooklyn Logback Includable Configuration .......... SUCCESS [  0.403 s]
[INFO] Brooklyn Common Utilities .......................... SUCCESS [ 24.532 s]
[INFO] Brooklyn API ....................................... SUCCESS [  1.370 s]
[INFO] CAMP Server Parent Project ......................... SUCCESS [  0.344 s]
[INFO] CAMP Base .......................................... SUCCESS [  2.709 s]
[INFO] Brooklyn Test Support .............................. SUCCESS [  0.703 s]
[INFO] Brooklyn REST Swagger Apidoc Utilities ............. SUCCESS [  0.936 s]
[INFO] Brooklyn Logback Configuration ..................... SUCCESS [  0.215 s]
[INFO] CAMP Server ........................................ SUCCESS [  5.413 s]
[INFO] Brooklyn Felix Runtime ............................. SUCCESS [  3.767 s]
[INFO] Brooklyn Groovy Utilities .......................... SUCCESS [  2.575 s]
[INFO] Brooklyn Core ...................................... SUCCESS [03:00 min]
[INFO] Brooklyn Policies .................................. SUCCESS [ 32.371 s]
[INFO] Brooklyn WinRM Software Entities ................... SUCCESS [ 10.535 s]
[INFO] Brooklyn Secure JMXMP Agent ........................ SUCCESS [  9.908 s]
[INFO] Brooklyn JMX RMI Agent ............................. SUCCESS [  0.373 s]
[INFO] Brooklyn Jclouds Location Targets .................. SUCCESS [ 37.019 s]
[INFO] Brooklyn Software Base ............................. SUCCESS [01:14 min]
[INFO] Brooklyn CAMP ...................................... SUCCESS [02:05 min]
[INFO] Brooklyn Launcher Common ........................... SUCCESS [  5.368 s]
[INFO] Brooklyn REST API .................................. SUCCESS [  8.374 s]
[INFO] Brooklyn REST Resources ............................ SUCCESS [ 40.708 s]
[INFO] Brooklyn REST Server ............................... SUCCESS [ 21.479 s]
[INFO] Brooklyn Launcher .................................. SUCCESS [01:15 min]
[INFO] Brooklyn Container Location Targets ................ SUCCESS [ 10.940 s]
[INFO] Brooklyn Command Line Interface .................... SUCCESS [  8.316 s]
[INFO] Brooklyn Test Framework ............................ SUCCESS [ 22.734 s]
[INFO] Brooklyn OSGi init ................................. SUCCESS [  2.818 s]
[INFO] Brooklyn OSGi start ................................ SUCCESS [  1.782 s]
[INFO] Brooklyn Karaf ..................................... SUCCESS [  0.043 s]
[INFO] Jetty config fragment .............................. SUCCESS [  1.379 s]
[INFO] Apache Http Component extension .................... SUCCESS [  0.522 s]
[INFO] Brooklyn Karaf Features ............................ SUCCESS [  1.037 s]
[INFO] Brooklyn Karaf Shell Commands ...................... SUCCESS [  4.860 s]
[INFO] Brooklyn Library Root .............................. SUCCESS [  1.833 s]
[INFO] Brooklyn CM Chef ................................... SUCCESS [  6.996 s]
[INFO] Brooklyn CM SaltStack .............................. SUCCESS [  6.904 s]
[INFO] Brooklyn CM Ansible ................................ SUCCESS [  4.001 s]
[INFO] Brooklyn CM Integration Root ....................... SUCCESS [  0.270 s]
[INFO] Brooklyn Network Software Entities ................. SUCCESS [  4.576 s]
[INFO] Brooklyn OSGi Software Entities .................... SUCCESS [  3.609 s]
[INFO] Brooklyn Database Software Entities ................ SUCCESS [  7.732 s]
[INFO] Brooklyn Web App Software Entities ................. SUCCESS [ 19.866 s]
[INFO] Brooklyn Messaging Software Entities ............... SUCCESS [  8.651 s]
[INFO] Brooklyn NoSQL Data Store Software Entities ........ SUCCESS [ 17.490 s]
[INFO] Brooklyn Monitoring Software Entities .............. SUCCESS [  3.974 s]
[INFO] Brooklyn Web App Software Entities ................. SUCCESS [  0.174 s]
[INFO] Brooklyn QA ........................................ SUCCESS [ 10.571 s]
[INFO] Brooklyn Examples Aggregator Project ............... SUCCESS [  0.306 s]
[INFO] Brooklyn Examples Aggregator Project - Webapps ..... SUCCESS [  0.103 s]
[INFO] hello-world-webapp Maven Webapp .................... SUCCESS [  0.628 s]
[INFO] hello-world-sql-webapp Maven Webapp ................ SUCCESS [  0.774 s]
[INFO] Brooklyn Simple Web Cluster Example ................ SUCCESS [  5.625 s]
[INFO] Brooklyn Library Karaf integration ................. SUCCESS [  0.112 s]
[INFO] Brooklyn Library Catalog ........................... SUCCESS [  0.128 s]
[INFO] Brooklyn Library Karaf Features .................... SUCCESS [  1.310 s]
[INFO] Brooklyn Client .................................... SUCCESS [  4.075 s]
[INFO] Brooklyn Client Command Line Interface ............. SUCCESS [ 39.795 s]
[INFO] Brooklyn REST java Client .......................... SUCCESS [ 10.452 s]
[INFO] Brooklyn Downstream Project Parent ................. SUCCESS [  0.113 s]
[INFO] Brooklyn Dist Root ................................. SUCCESS [  2.992 s]
[INFO] Brooklyn All Things ................................ SUCCESS [  2.171 s]
[INFO] Brooklyn Distribution .............................. SUCCESS [ 16.712 s]
[INFO] Brooklyn Karaf Distribution Parent ................. SUCCESS [  0.028 s]
[INFO] Brooklyn Karaf Server Configuration ................ SUCCESS [  0.256 s]
[INFO] Brooklyn Dist Karaf Features ....................... SUCCESS [  0.038 s]
[INFO] Brooklyn Karaf Distribution ........................ SUCCESS [ 14.304 s]
[INFO] Brooklyn Karaf pax-exam itest ...................... FAILURE [03:08 min]
[INFO] Brooklyn Vagrant Getting Started Environment ....... SKIPPED
[INFO] Brooklyn Quick-Start Project Archetype ............. SKIPPED
[INFO] Brooklyn Shared Package Files ...................... SKIPPED
[INFO] Brooklyn RPM Package ............................... SKIPPED
[INFO] Brooklyn DEB Package ............................... SKIPPED
[INFO] Brooklyn Root ...................................... SKIPPED
[INFO] ------------------------------------------------------------------------
[INFO] BUILD FAILURE
[INFO] ------------------------------------------------------------------------
[INFO] Total time: 19:14 min
[INFO] Finished at: 2017-12-05T09:13:25Z
[INFO] Final Memory: 215M/817M
[INFO] ------------------------------------------------------------------------
[ERROR] Failed to execute goal org.apache.maven.plugins:maven-surefire-plugin:2.18.1:test
(default-test) on project brooklyn-itest: There are test failures.
[ERROR] 
[ERROR] Please refer to /usr/build/brooklyn-dist/karaf/itest/target/surefire-reports for the
individual test results.
[ERROR] -> [Help 1]
[ERROR] 
[ERROR] To see the full stack trace of the errors, re-run Maven with the -e switch.
[ERROR] Re-run Maven using the -X switch to enable full debug logging.
[ERROR] 
[ERROR] For more information about the errors and possible solutions, please read the following
articles:
[ERROR] [Help 1] http://cwiki.apache.org/confluence/display/MAVEN/MojoFailureException
[ERROR] 
[ERROR] After correcting the problems, you can resume the build with the command
[ERROR]   mvn <goals> -rf :brooklyn-itest
Build step 'Execute shell' marked build as failure
Recording test results
TestNG Reports Processing: START
Looking for TestNG results report in workspace using pattern: **/testng-results.xml
testng-results.xml was last modified before this build started. Ignoring it.
Saving reports...
Processing '/x1/jenkins/jenkins-home/jobs/brooklyn-master-build-docker/builds/54/testng/testng-results-1.xml'
Processing '/x1/jenkins/jenkins-home/jobs/brooklyn-master-build-docker/builds/54/testng/testng-results-10.xml'
Processing '/x1/jenkins/jenkins-home/jobs/brooklyn-master-build-docker/builds/54/testng/testng-results-11.xml'
Processing '/x1/jenkins/jenkins-home/jobs/brooklyn-master-build-docker/builds/54/testng/testng-results-12.xml'
Processing '/x1/jenkins/jenkins-home/jobs/brooklyn-master-build-docker/builds/54/testng/testng-results-13.xml'
Processing '/x1/jenkins/jenkins-home/jobs/brooklyn-master-build-docker/builds/54/testng/testng-results-14.xml'
Processing '/x1/jenkins/jenkins-home/jobs/brooklyn-master-build-docker/builds/54/testng/testng-results-15.xml'
Processing '/x1/jenkins/jenkins-home/jobs/brooklyn-master-build-docker/builds/54/testng/testng-results-16.xml'
Processing '/x1/jenkins/jenkins-home/jobs/brooklyn-master-build-docker/builds/54/testng/testng-results-17.xml'
Processing '/x1/jenkins/jenkins-home/jobs/brooklyn-master-build-docker/builds/54/testng/testng-results-18.xml'
Processing '/x1/jenkins/jenkins-home/jobs/brooklyn-master-build-docker/builds/54/testng/testng-results-19.xml'
Processing '/x1/jenkins/jenkins-home/jobs/brooklyn-master-build-docker/builds/54/testng/testng-results-2.xml'
Processing '/x1/jenkins/jenkins-home/jobs/brooklyn-master-build-docker/builds/54/testng/testng-results-20.xml'
Processing '/x1/jenkins/jenkins-home/jobs/brooklyn-master-build-docker/builds/54/testng/testng-results-21.xml'
Processing '/x1/jenkins/jenkins-home/jobs/brooklyn-master-build-docker/builds/54/testng/testng-results-22.xml'
Processing '/x1/jenkins/jenkins-home/jobs/brooklyn-master-build-docker/builds/54/testng/testng-results-23.xml'
Processing '/x1/jenkins/jenkins-home/jobs/brooklyn-master-build-docker/builds/54/testng/testng-results-24.xml'
Processing '/x1/jenkins/jenkins-home/jobs/brooklyn-master-build-docker/builds/54/testng/testng-results-25.xml'
Processing '/x1/jenkins/jenkins-home/jobs/brooklyn-master-build-docker/builds/54/testng/testng-results-26.xml'
Processing '/x1/jenkins/jenkins-home/jobs/brooklyn-master-build-docker/builds/54/testng/testng-results-27.xml'
Processing '/x1/jenkins/jenkins-home/jobs/brooklyn-master-build-docker/builds/54/testng/testng-results-28.xml'
Processing '/x1/jenkins/jenkins-home/jobs/brooklyn-master-build-docker/builds/54/testng/testng-results-29.xml'
Processing '/x1/jenkins/jenkins-home/jobs/brooklyn-master-build-docker/builds/54/testng/testng-results-3.xml'
Processing '/x1/jenkins/jenkins-home/jobs/brooklyn-master-build-docker/builds/54/testng/testng-results-30.xml'
Processing '/x1/jenkins/jenkins-home/jobs/brooklyn-master-build-docker/builds/54/testng/testng-results-31.xml'
Processing '/x1/jenkins/jenkins-home/jobs/brooklyn-master-build-docker/builds/54/testng/testng-results-32.xml'
Processing '/x1/jenkins/jenkins-home/jobs/brooklyn-master-build-docker/builds/54/testng/testng-results-33.xml'
Processing '/x1/jenkins/jenkins-home/jobs/brooklyn-master-build-docker/builds/54/testng/testng-results-4.xml'
Processing '/x1/jenkins/jenkins-home/jobs/brooklyn-master-build-docker/builds/54/testng/testng-results-5.xml'
Processing '/x1/jenkins/jenkins-home/jobs/brooklyn-master-build-docker/builds/54/testng/testng-results-6.xml'
Processing '/x1/jenkins/jenkins-home/jobs/brooklyn-master-build-docker/builds/54/testng/testng-results-7.xml'
Processing '/x1/jenkins/jenkins-home/jobs/brooklyn-master-build-docker/builds/54/testng/testng-results-8.xml'
Processing '/x1/jenkins/jenkins-home/jobs/brooklyn-master-build-docker/builds/54/testng/testng-results-9.xml'
Processing '/x1/jenkins/jenkins-home/jobs/brooklyn-master-build-docker/builds/54/testng/testng-results.xml'
TestNG Reports Processing: FINISH

Mime
View raw message