brooklyn-dev mailing list archives

Site index · List index
Message view « Date » · « Thread »
Top « Date » · « Thread »
From Apache Jenkins Server <jenk...@builds.apache.org>
Subject Build failed in Jenkins: brooklyn-master-build-docker #57
Date Wed, 06 Dec 2017 14:54:41 GMT
See <https://builds.apache.org/job/brooklyn-master-build-docker/57/display/redirect>

------------------------------------------
[...truncated 3.70 MB...]
	Item 'MockItem[item-15]' (47.0)
	Item 'MockItem[item-26]' (47.0)
Container 'MockContainer[container-3.1.1]': 
	Item 'MockItem[item-25]' (48.0)
	Item 'MockItem[item-9]' (46.0)
	Item 'MockItem[item-24]' (47.0)
	Item 'MockItem[item-30]' (48.0)
	Item 'MockItem[item-8]' (49.0)
	Item 'MockItem[item-16]' (50.0)
Container 'MockContainer[container-4]': 
	Item 'MockItem[item-22]' (48.0)
	Item 'MockItem[item-27]' (43.0)
	Item 'MockItem[item-5]' (49.0)
	Item 'MockItem[item-10]' (48.0)
	Item 'MockItem[item-17]' (50.0)
	Item 'MockItem[item-13.1.1]' (47.0)
Container 'MockContainer[container-2]': 
	Item 'MockItem[item-14]' (49.0)
	Item 'MockItem[item-7]' (48.0)
	Item 'MockItem[item-21]' (47.0)
	Item 'MockItem[item-18]' (50.0)
	Item 'MockItem[item-6]' (48.0)
; totalMoves=56; lastMoveTime=2017-12-06 14:53:02.220; itemRates=[49, 52, 47, 45, 49, 48,
48, 49, 46, 48, 45, 50, 47, 49, 47, 50, 50, 50, 46, 49, 47, 48, 44, 47, 48, 47, 43, 44, 45,
48]
	at org.apache.brooklyn.policy.loadbalancing.LoadBalancingPolicySoakTest.runLoadBalancingSoakTest(LoadBalancingPolicySoakTest.java:177)
	at org.apache.brooklyn.policy.loadbalancing.LoadBalancingPolicySoakTest.testLoadBalancingManyItemsQuickTest(LoadBalancingPolicySoakTest.java:71)
Caused by: java.lang.AssertionError: 
extras=[]; missing=[MockItem[item-2]]; duplicates=[]; actualSize=29; expectedSize=30; actual=[MockItem[item-23],
MockItem[item-28], MockItem[item-29], MockItem[item-4], MockItem[item-11], MockItem[item-19],
MockItem[item-20], MockItem[item-1], MockItem[item-3], MockItem[item-12], MockItem[item-15],
MockItem[item-26], MockItem[item-25], MockItem[item-9], MockItem[item-24], MockItem[item-30],
MockItem[item-8], MockItem[item-16], MockItem[item-22], MockItem[item-27], MockItem[item-5],
MockItem[item-10], MockItem[item-17], MockItem[item-13.1.1], MockItem[item-14], MockItem[item-7],
MockItem[item-21], MockItem[item-18], MockItem[item-6]]; expected=[MockItem[item-1], MockItem[item-2],
MockItem[item-3], MockItem[item-4], MockItem[item-5], MockItem[item-6], MockItem[item-7],
MockItem[item-8], MockItem[item-9], MockItem[item-10], MockItem[item-11], MockItem[item-12],
MockItem[item-13.1.1], MockItem[item-14], MockItem[item-15], MockItem[item-16], MockItem[item-17],
MockItem[item-18], MockItem[item-19], MockItem[item-20], MockItem[item-21], MockItem[item-22],
MockItem[item-23], MockItem[item-24], MockItem[item-25], MockItem[item-26], MockItem[item-27],
MockItem[item-28], MockItem[item-29], MockItem[item-30]]; containers=[MockContainer[container-1],
MockContainer[container-2], MockContainer[container-3.1.1], MockContainer[container-4], MockContainer[container-5]];
containerRates=[269.0, 242.0, 288.0, 337.0, 289.0]; itemDistributionByContainer={MockContainer[container-1]=[MockItem[item-4],
MockItem[item-11], MockItem[item-19], MockItem[item-23], MockItem[item-28], MockItem[item-29]],
MockContainer[container-2]=[MockItem[item-18], MockItem[item-14], MockItem[item-6], MockItem[item-7],
MockItem[item-21]], MockContainer[container-3.1.1]=[MockItem[item-16], MockItem[item-8], MockItem[item-30],
MockItem[item-25], MockItem[item-24], MockItem[item-9]], MockContainer[container-4]=[MockItem[item-2],
MockItem[item-17], MockItem[item-5], MockItem[item-10], MockItem[item-22], MockItem[item-13.1.1],
MockItem[item-27]], MockContainer[container-5]=[MockItem[item-12], MockItem[item-20], MockItem[item-1],
MockItem[item-26], MockItem[item-3], MockItem[item-15]]}; itemDistributionByItem={MockItem[item-1]=MockContainer[container-5],
MockItem[item-2]=MockContainer[container-4], MockItem[item-3]=MockContainer[container-5],
MockItem[item-4]=MockContainer[container-1], MockItem[item-5]=MockContainer[container-4],
MockItem[item-6]=MockContainer[container-2], MockItem[item-7]=MockContainer[container-2],
MockItem[item-8]=MockContainer[container-3.1.1], MockItem[item-9]=MockContainer[container-3.1.1],
MockItem[item-10]=MockContainer[container-4], MockItem[item-11]=MockContainer[container-1],
MockItem[item-12]=MockContainer[container-5], MockItem[item-13.1.1]=MockContainer[container-4],
MockItem[item-14]=MockContainer[container-2], MockItem[item-15]=MockContainer[container-5],
MockItem[item-16]=MockContainer[container-3.1.1], MockItem[item-17]=MockContainer[container-4],
MockItem[item-18]=MockContainer[container-2], MockItem[item-19]=MockContainer[container-1],
MockItem[item-20]=MockContainer[container-5], MockItem[item-21]=MockContainer[container-2],
MockItem[item-22]=MockContainer[container-4], MockItem[item-23]=MockContainer[container-1],
MockItem[item-24]=MockContainer[container-3.1.1], MockItem[item-25]=MockContainer[container-3.1.1],
MockItem[item-26]=MockContainer[container-5], MockItem[item-27]=MockContainer[container-4],
MockItem[item-28]=MockContainer[container-1], MockItem[item-29]=MockContainer[container-1],
MockItem[item-30]=MockContainer[container-3.1.1]}; model=Container 'MockContainer[container-1]':

	Item 'MockItem[item-23]' (44.0)
	Item 'MockItem[item-28]' (44.0)
	Item 'MockItem[item-29]' (45.0)
	Item 'MockItem[item-4]' (45.0)
	Item 'MockItem[item-11]' (45.0)
	Item 'MockItem[item-19]' (46.0)
Container 'MockContainer[container-5]': 
	Item 'MockItem[item-20]' (49.0)
	Item 'MockItem[item-1]' (49.0)
	Item 'MockItem[item-3]' (47.0)
	Item 'MockItem[item-12]' (50.0)
	Item 'MockItem[item-15]' (47.0)
	Item 'MockItem[item-26]' (47.0)
Container 'MockContainer[container-3.1.1]': 
	Item 'MockItem[item-25]' (48.0)
	Item 'MockItem[item-9]' (46.0)
	Item 'MockItem[item-24]' (47.0)
	Item 'MockItem[item-30]' (48.0)
	Item 'MockItem[item-8]' (49.0)
	Item 'MockItem[item-16]' (50.0)
Container 'MockContainer[container-4]': 
	Item 'MockItem[item-22]' (48.0)
	Item 'MockItem[item-27]' (43.0)
	Item 'MockItem[item-5]' (49.0)
	Item 'MockItem[item-10]' (48.0)
	Item 'MockItem[item-17]' (50.0)
	Item 'MockItem[item-13.1.1]' (47.0)
Container 'MockContainer[container-2]': 
	Item 'MockItem[item-14]' (49.0)
	Item 'MockItem[item-7]' (48.0)
	Item 'MockItem[item-21]' (47.0)
	Item 'MockItem[item-18]' (50.0)
	Item 'MockItem[item-6]' (48.0)
; totalMoves=56; lastMoveTime=2017-12-06 14:53:02.220; itemRates=[49, 52, 47, 45, 49, 48,
48, 49, 46, 48, 45, 50, 47, 49, 47, 50, 50, 50, 46, 49, 47, 48, 44, 47, 48, 47, 43, 44, 45,
48]
	at org.apache.brooklyn.policy.loadbalancing.LoadBalancingPolicySoakTest.runLoadBalancingSoakTest(LoadBalancingPolicySoakTest.java:177)
	at org.apache.brooklyn.policy.loadbalancing.LoadBalancingPolicySoakTest.testLoadBalancingManyItemsQuickTest(LoadBalancingPolicySoakTest.java:71)


Results :

Failed tests: 
  LoadBalancingPolicySoakTest.testLoadBalancingManyItemsQuickTest:71->runLoadBalancingSoakTest:177
failed succeeds-eventually, 94 attempts, 40005ms elapsed: AssertionError: extras=[]; missing=[MockItem[item-2]];
duplicates=[]; actualSize=29; expectedSize=30; actual=[MockItem[item-23], MockItem[item-28],
MockItem[item-29], MockItem[item-4], MockItem[item-11], MockItem[item-19], MockItem[item-20],
MockItem[item-1], MockItem[item-3], MockItem[item-12], MockItem[item-15], MockItem[item-26],
MockItem[item-25], MockItem[item-9], MockItem[item-24], MockItem[item-30], MockItem[item-8],
MockItem[item-16], MockItem[item-22], MockItem[item-27], MockItem[item-5], MockItem[item-10],
MockItem[item-17], MockItem[item-13.1.1], MockItem[item-14], MockItem[item-7], MockItem[item-21],
MockItem[item-18], MockItem[item-6]]; expected=[MockItem[item-1], MockItem[item-2], MockItem[item-3],
MockItem[item-4], MockItem[item-5], MockItem[item-6], MockItem[item-7], MockItem[item-8],
MockItem[item-9], MockItem[item-10], MockItem[item-11], MockItem[item-12], MockItem[item-13.1.1],
MockItem[item-14], MockItem[item-15], MockItem[item-16], MockItem[item-17], MockItem[item-18],
MockItem[item-19], MockItem[item-20], MockItem[item-21], MockItem[item-22], MockItem[item-23],
MockItem[item-24], MockItem[item-25], MockItem[item-26], MockItem[item-27], MockItem[item-28],
MockItem[item-29], MockItem[item-30]]; containers=[MockContainer[container-1], MockContainer[container-2],
MockContainer[container-3.1.1], MockContainer[container-4], MockContainer[container-5]]; containerRates=[269.0,
242.0, 288.0, 337.0, 289.0]; itemDistributionByContainer={MockContainer[container-1]=[MockItem[item-4],
MockItem[item-11], MockItem[item-19], MockItem[item-23], MockItem[item-28], MockItem[item-29]],
MockContainer[container-2]=[MockItem[item-18], MockItem[item-14], MockItem[item-6], MockItem[item-7],
MockItem[item-21]], MockContainer[container-3.1.1]=[MockItem[item-16], MockItem[item-8], MockItem[item-30],
MockItem[item-25], MockItem[item-24], MockItem[item-9]], MockContainer[container-4]=[MockItem[item-2],
MockItem[item-17], MockItem[item-5], MockItem[item-10], MockItem[item-22], MockItem[item-13.1.1],
MockItem[item-27]], MockContainer[container-5]=[MockItem[item-12], MockItem[item-20], MockItem[item-1],
MockItem[item-26], MockItem[item-3], MockItem[item-15]]}; itemDistributionByItem={MockItem[item-1]=MockContainer[container-5],
MockItem[item-2]=MockContainer[container-4], MockItem[item-3]=MockContainer[container-5],
MockItem[item-4]=MockContainer[container-1], MockItem[item-5]=MockContainer[container-4],
MockItem[item-6]=MockContainer[container-2], MockItem[item-7]=MockContainer[container-2],
MockItem[item-8]=MockContainer[container-3.1.1], MockItem[item-9]=MockContainer[container-3.1.1],
MockItem[item-10]=MockContainer[container-4], MockItem[item-11]=MockContainer[container-1],
MockItem[item-12]=MockContainer[container-5], MockItem[item-13.1.1]=MockContainer[container-4],
MockItem[item-14]=MockContainer[container-2], MockItem[item-15]=MockContainer[container-5],
MockItem[item-16]=MockContainer[container-3.1.1], MockItem[item-17]=MockContainer[container-4],
MockItem[item-18]=MockContainer[container-2], MockItem[item-19]=MockContainer[container-1],
MockItem[item-20]=MockContainer[container-5], MockItem[item-21]=MockContainer[container-2],
MockItem[item-22]=MockContainer[container-4], MockItem[item-23]=MockContainer[container-1],
MockItem[item-24]=MockContainer[container-3.1.1], MockItem[item-25]=MockContainer[container-3.1.1],
MockItem[item-26]=MockContainer[container-5], MockItem[item-27]=MockContainer[container-4],
MockItem[item-28]=MockContainer[container-1], MockItem[item-29]=MockContainer[container-1],
MockItem[item-30]=MockContainer[container-3.1.1]}; model=Container 'MockContainer[container-1]':

	Item 'MockItem[item-23]' (44.0)
	Item 'MockItem[item-28]' (44.0)
	Item 'MockItem[item-29]' (45.0)
	Item 'MockItem[item-4]' (45.0)
	Item 'MockItem[item-11]' (45.0)
	Item 'MockItem[item-19]' (46.0)
Container 'MockContainer[container-5]': 
	Item 'MockItem[item-20]' (49.0)
	Item 'MockItem[item-1]' (49.0)
	Item 'MockItem[item-3]' (47.0)
	Item 'MockItem[item-12]' (50.0)
	Item 'MockItem[item-15]' (47.0)
	Item 'MockItem[item-26]' (47.0)
Container 'MockContainer[container-3.1.1]': 
	Item 'MockItem[item-25]' (48.0)
	Item 'MockItem[item-9]' (46.0)
	Item 'MockItem[item-24]' (47.0)
	Item 'MockItem[item-30]' (48.0)
	Item 'MockItem[item-8]' (49.0)
	Item 'MockItem[item-16]' (50.0)
Container 'MockContainer[container-4]': 
	Item 'MockItem[item-22]' (48.0)
	Item 'MockItem[item-27]' (43.0)
	Item 'MockItem[item-5]' (49.0)
	Item 'MockItem[item-10]' (48.0)
	Item 'MockItem[item-17]' (50.0)
	Item 'MockItem[item-13.1.1]' (47.0)
Container 'MockContainer[container-2]': 
	Item 'MockItem[item-14]' (49.0)
	Item 'MockItem[item-7]' (48.0)
	Item 'MockItem[item-21]' (47.0)
	Item 'MockItem[item-18]' (50.0)
	Item 'MockItem[item-6]' (48.0)
; totalMoves=56; lastMoveTime=2017-12-06 14:53:02.220; itemRates=[49, 52, 47, 45, 49, 48,
48, 49, 46, 48, 45, 50, 47, 49, 47, 50, 50, 50, 46, 49, 47, 48, 44, 47, 48, 47, 43, 44, 45,
48]

Tests run: 137, Failures: 1, Errors: 0, Skipped: 0

[INFO] ------------------------------------------------------------------------
[INFO] Reactor Summary:
[INFO] 
[INFO] Brooklyn REST JavaScript Web GUI ................... SUCCESS [ 54.651 s]
[INFO] Brooklyn Server Root ............................... SUCCESS [  0.393 s]
[INFO] Brooklyn Parent Project ............................ SUCCESS [  5.135 s]
[INFO] Brooklyn Test Support Utilities .................... SUCCESS [  5.251 s]
[INFO] Brooklyn Logback Includable Configuration .......... SUCCESS [  0.908 s]
[INFO] Brooklyn Common Utilities .......................... SUCCESS [ 34.088 s]
[INFO] Brooklyn API ....................................... SUCCESS [  2.378 s]
[INFO] CAMP Server Parent Project ......................... SUCCESS [  0.416 s]
[INFO] CAMP Base .......................................... SUCCESS [  3.347 s]
[INFO] Brooklyn Test Support .............................. SUCCESS [  1.427 s]
[INFO] Brooklyn REST Swagger Apidoc Utilities ............. SUCCESS [  2.240 s]
[INFO] Brooklyn Logback Configuration ..................... SUCCESS [  0.450 s]
[INFO] CAMP Server ........................................ SUCCESS [  7.429 s]
[INFO] Brooklyn Felix Runtime ............................. SUCCESS [  3.776 s]
[INFO] Brooklyn Groovy Utilities .......................... SUCCESS [  2.511 s]
[INFO] Brooklyn Core ...................................... SUCCESS [04:18 min]
[INFO] Brooklyn Policies .................................. FAILURE [01:18 min]
[INFO] Brooklyn WinRM Software Entities ................... SKIPPED
[INFO] Brooklyn Secure JMXMP Agent ........................ SKIPPED
[INFO] Brooklyn JMX RMI Agent ............................. SKIPPED
[INFO] Brooklyn Jclouds Location Targets .................. SKIPPED
[INFO] Brooklyn Software Base ............................. SKIPPED
[INFO] Brooklyn CAMP ...................................... SKIPPED
[INFO] Brooklyn Launcher Common ........................... SKIPPED
[INFO] Brooklyn REST API .................................. SKIPPED
[INFO] Brooklyn REST Resources ............................ SKIPPED
[INFO] Brooklyn REST Server ............................... SKIPPED
[INFO] Brooklyn Launcher .................................. SKIPPED
[INFO] Brooklyn Container Location Targets ................ SKIPPED
[INFO] Brooklyn Command Line Interface .................... SKIPPED
[INFO] Brooklyn Test Framework ............................ SKIPPED
[INFO] Brooklyn OSGi init ................................. SKIPPED
[INFO] Brooklyn OSGi start ................................ SKIPPED
[INFO] Brooklyn Karaf ..................................... SKIPPED
[INFO] Jetty config fragment .............................. SKIPPED
[INFO] Apache Http Component extension .................... SKIPPED
[INFO] Brooklyn Karaf Features ............................ SKIPPED
[INFO] Brooklyn Karaf Shell Commands ...................... SKIPPED
[INFO] Brooklyn Library Root .............................. SKIPPED
[INFO] Brooklyn CM Chef ................................... SKIPPED
[INFO] Brooklyn CM SaltStack .............................. SKIPPED
[INFO] Brooklyn CM Ansible ................................ SKIPPED
[INFO] Brooklyn CM Integration Root ....................... SKIPPED
[INFO] Brooklyn Network Software Entities ................. SKIPPED
[INFO] Brooklyn OSGi Software Entities .................... SKIPPED
[INFO] Brooklyn Database Software Entities ................ SKIPPED
[INFO] Brooklyn Web App Software Entities ................. SKIPPED
[INFO] Brooklyn Messaging Software Entities ............... SKIPPED
[INFO] Brooklyn NoSQL Data Store Software Entities ........ SKIPPED
[INFO] Brooklyn Monitoring Software Entities .............. SKIPPED
[INFO] Brooklyn Web App Software Entities ................. SKIPPED
[INFO] Brooklyn QA ........................................ SKIPPED
[INFO] Brooklyn Examples Aggregator Project ............... SKIPPED
[INFO] Brooklyn Examples Aggregator Project - Webapps ..... SKIPPED
[INFO] hello-world-webapp Maven Webapp .................... SKIPPED
[INFO] hello-world-sql-webapp Maven Webapp ................ SKIPPED
[INFO] Brooklyn Simple Web Cluster Example ................ SKIPPED
[INFO] Brooklyn Library Karaf integration ................. SKIPPED
[INFO] Brooklyn Library Catalog ........................... SKIPPED
[INFO] Brooklyn Library Karaf Features .................... SKIPPED
[INFO] Brooklyn Client .................................... SKIPPED
[INFO] Brooklyn Client Command Line Interface ............. SKIPPED
[INFO] Brooklyn REST java Client .......................... SKIPPED
[INFO] Brooklyn Downstream Project Parent ................. SKIPPED
[INFO] Brooklyn Dist Root ................................. SKIPPED
[INFO] Brooklyn All Things ................................ SKIPPED
[INFO] Brooklyn Distribution .............................. SKIPPED
[INFO] Brooklyn Karaf Distribution Parent ................. SKIPPED
[INFO] Brooklyn Karaf Server Configuration ................ SKIPPED
[INFO] Brooklyn Dist Karaf Features ....................... SKIPPED
[INFO] Brooklyn Karaf Distribution ........................ SKIPPED
[INFO] Brooklyn Karaf pax-exam itest ...................... SKIPPED
[INFO] Brooklyn Vagrant Getting Started Environment ....... SKIPPED
[INFO] Brooklyn Quick-Start Project Archetype ............. SKIPPED
[INFO] Brooklyn Shared Package Files ...................... SKIPPED
[INFO] Brooklyn RPM Package ............................... SKIPPED
[INFO] Brooklyn DEB Package ............................... SKIPPED
[INFO] Brooklyn Root ...................................... SKIPPED
[INFO] ------------------------------------------------------------------------
[INFO] BUILD FAILURE
[INFO] ------------------------------------------------------------------------
[INFO] Total time: 07:52 min
[INFO] Finished at: 2017-12-06T14:53:58Z
[INFO] Final Memory: 99M/874M
[INFO] ------------------------------------------------------------------------
[ERROR] Failed to execute goal org.apache.maven.plugins:maven-surefire-plugin:2.19.1:test
(default-test) on project brooklyn-policy: There are test failures.
[ERROR] 
[ERROR] Please refer to /usr/build/brooklyn-server/policy/target/surefire-reports for the
individual test results.
[ERROR] -> [Help 1]
[ERROR] 
[ERROR] To see the full stack trace of the errors, re-run Maven with the -e switch.
[ERROR] Re-run Maven using the -X switch to enable full debug logging.
[ERROR] 
[ERROR] For more information about the errors and possible solutions, please read the following
articles:
[ERROR] [Help 1] http://cwiki.apache.org/confluence/display/MAVEN/MojoFailureException
[ERROR] 
[ERROR] After correcting the problems, you can resume the build with the command
[ERROR]   mvn <goals> -rf :brooklyn-policy
Build step 'Execute shell' marked build as failure
Recording test results
TestNG Reports Processing: START
Looking for TestNG results report in workspace using pattern: **/testng-results.xml
testng-results.xml was last modified before this build started. Ignoring it.
testng-results.xml was last modified before this build started. Ignoring it.
testng-results.xml was last modified before this build started. Ignoring it.
testng-results.xml was last modified before this build started. Ignoring it.
testng-results.xml was last modified before this build started. Ignoring it.
testng-results.xml was last modified before this build started. Ignoring it.
testng-results.xml was last modified before this build started. Ignoring it.
testng-results.xml was last modified before this build started. Ignoring it.
testng-results.xml was last modified before this build started. Ignoring it.
testng-results.xml was last modified before this build started. Ignoring it.
testng-results.xml was last modified before this build started. Ignoring it.
testng-results.xml was last modified before this build started. Ignoring it.
testng-results.xml was last modified before this build started. Ignoring it.
testng-results.xml was last modified before this build started. Ignoring it.
testng-results.xml was last modified before this build started. Ignoring it.
testng-results.xml was last modified before this build started. Ignoring it.
testng-results.xml was last modified before this build started. Ignoring it.
testng-results.xml was last modified before this build started. Ignoring it.
testng-results.xml was last modified before this build started. Ignoring it.
testng-results.xml was last modified before this build started. Ignoring it.
testng-results.xml was last modified before this build started. Ignoring it.
testng-results.xml was last modified before this build started. Ignoring it.
testng-results.xml was last modified before this build started. Ignoring it.
testng-results.xml was last modified before this build started. Ignoring it.
testng-results.xml was last modified before this build started. Ignoring it.
testng-results.xml was last modified before this build started. Ignoring it.
testng-results.xml was last modified before this build started. Ignoring it.
testng-results.xml was last modified before this build started. Ignoring it.
Saving reports...
Processing '/x1/jenkins/jenkins-home/jobs/brooklyn-master-build-docker/builds/57/testng/testng-results-1.xml'
Processing '/x1/jenkins/jenkins-home/jobs/brooklyn-master-build-docker/builds/57/testng/testng-results-2.xml'
Processing '/x1/jenkins/jenkins-home/jobs/brooklyn-master-build-docker/builds/57/testng/testng-results-3.xml'
Processing '/x1/jenkins/jenkins-home/jobs/brooklyn-master-build-docker/builds/57/testng/testng-results-4.xml'
Processing '/x1/jenkins/jenkins-home/jobs/brooklyn-master-build-docker/builds/57/testng/testng-results-5.xml'
Processing '/x1/jenkins/jenkins-home/jobs/brooklyn-master-build-docker/builds/57/testng/testng-results-6.xml'
Processing '/x1/jenkins/jenkins-home/jobs/brooklyn-master-build-docker/builds/57/testng/testng-results.xml'
0.032971% of tests failed, which exceeded threshold of 0%. Marking build as UNSTABLE
TestNG Reports Processing: FINISH

Mime
View raw message