brooklyn-dev mailing list archives

Site index · List index
Message view « Date » · « Thread »
Top « Date » · « Thread »
From Apache Jenkins Server <jenk...@builds.apache.org>
Subject Build failed in Jenkins: brooklyn-server-master-docker #4
Date Fri, 17 Nov 2017 16:54:05 GMT
See <https://builds.apache.org/job/brooklyn-server-master-docker/4/display/redirect?page=changes>

Changes:

[duncan.grant] Fix VSP stop/start when ssh monitoring disabled

[duncan.grant] Updates tests to use effector

------------------------------------------
[...truncated 4.99 MB...]
2017-11-17 16:36:16,511 INFO  TESTNG PASSED CONFIGURATION: "Surefire test" - @AfterMethod org.apache.brooklyn.core.test.BrooklynMgmtUnitTestSupport.tearDown() finished in 8 ms
2017-11-17 16:36:16,511 INFO  TESTNG INVOKING CONFIGURATION: "Surefire test" - @BeforeMethod org.apache.brooklyn.entity.software.base.SoftwareProcessSubclassTest.setUp()
2017-11-17 16:36:16,512 INFO  Added external config supplier named 'brooklyn-demo-sample': org.apache.brooklyn.core.config.external.InPlaceExternalConfigSupplier@7c07deff
2017-11-17 16:36:16,540 INFO  TESTNG PASSED CONFIGURATION: "Surefire test" - @BeforeMethod org.apache.brooklyn.entity.software.base.SoftwareProcessSubclassTest.setUp() finished in 29 ms
2017-11-17 16:36:16,540 INFO  TESTNG INVOKING: "Surefire test" - org.apache.brooklyn.entity.software.base.SoftwareProcessSubclassTest.testRestartCalledViaMethod()
2017-11-17 16:36:16,677 INFO  TESTNG PASSED: "Surefire test" - org.apache.brooklyn.entity.software.base.SoftwareProcessSubclassTest.testRestartCalledViaMethod() finished in 137 ms
2017-11-17 16:36:16,678 INFO  TESTNG INVOKING CONFIGURATION: "Surefire test" - @AfterMethod org.apache.brooklyn.core.test.BrooklynMgmtUnitTestSupport.tearDown()
2017-11-17 16:36:16,685 INFO  TESTNG PASSED CONFIGURATION: "Surefire test" - @AfterMethod org.apache.brooklyn.core.test.BrooklynMgmtUnitTestSupport.tearDown() finished in 7 ms
2017-11-17 16:36:16,686 INFO  TESTNG INVOKING CONFIGURATION: "Surefire test" - @BeforeMethod org.apache.brooklyn.entity.software.base.SoftwareProcessSubclassTest.setUp()
2017-11-17 16:36:16,686 INFO  Added external config supplier named 'brooklyn-demo-sample': org.apache.brooklyn.core.config.external.InPlaceExternalConfigSupplier@708f238f
[GC (Metadata GC Threshold)  229795K->91478K(761344K), 0.0261078 secs]
[Full GC (Metadata GC Threshold)  91478K->62887K(761344K), 0.3863053 secs]
2017-11-17 16:36:17,106 WARN  Task[post-install-command]@u92mxSsJ was never submitted; did the code create it and forget to run it? ('cancel' the task to suppress this message)
2017-11-17 16:36:17,107 WARN  Task[post-launch]@OsOyq4mZ was never submitted; did the code create it and forget to run it? ('cancel' the task to suppress this message)
2017-11-17 16:36:17,107 WARN  Task[launch]@eaJhWmJU was never submitted; did the code create it and forget to run it? ('cancel' the task to suppress this message)
2017-11-17 16:36:17,107 WARN  Task[customize]@Oi7KcbOg was never submitted; did the code create it and forget to run it? ('cancel' the task to suppress this message)
2017-11-17 16:36:17,107 WARN  Task[post-start]@oHM8FMWv was never submitted; did the code create it and forget to run it? ('cancel' the task to suppress this message)
2017-11-17 16:36:17,115 WARN  Task[post-launch-command]@e2MQcRil was never submitted; did the code create it and forget to run it? ('cancel' the task to suppress this message)
2017-11-17 16:36:17,116 WARN  Task[post-launch]@y9rbSP1b was never submitted; did the code create it and forget to run it? ('cancel' the task to suppress this message)
2017-11-17 16:36:17,116 WARN  Task[post-start]@CnVXcuLm was never submitted; did the code create it and forget to run it? ('cancel' the task to suppress this message)
2017-11-17 16:36:17,118 WARN  Task[org.apache.brooklyn.entity.software.base.SoftwareProcessImpl$2@2d3f5ff0]@iF8MqeQn was never submitted; did the code create it and forget to run it? ('cancel' the task to suppress this message)
2017-11-17 16:36:17,118 WARN  Task[org.apache.brooklyn.entity.software.base.SoftwareProcessImpl$2@2ad31960]@mrLcX6Zg was never submitted; did the code create it and forget to run it? ('cancel' the task to suppress this message)
2017-11-17 16:36:17,118 WARN  Task[org.apache.brooklyn.entity.software.base.SoftwareProcessImpl$2@7cc6ba09]@jU8exye8 was never submitted; did the code create it and forget to run it? ('cancel' the task to suppress this message)
2017-11-17 16:36:17,118 WARN  Task[org.apache.brooklyn.entity.software.base.SoftwareProcessImpl$2@54ea5403]@Qcq1tnqL was never submitted; did the code create it and forget to run it? ('cancel' the task to suppress this message)
2017-11-17 16:36:17,118 WARN  Task[org.apache.brooklyn.entity.software.base.SoftwareProcessImpl$2@3fd41b1]@ihs7X9cw was never submitted; did the code create it and forget to run it? ('cancel' the task to suppress this message)
2017-11-17 16:36:17,118 WARN  Task[org.apache.brooklyn.entity.software.base.SoftwareProcessImpl$2@31d750b7]@OghxhV88 was never submitted; did the code create it and forget to run it? ('cancel' the task to suppress this message)
2017-11-17 16:36:17,118 WARN  Task[org.apache.brooklyn.entity.software.base.SoftwareProcessImpl$2@7888a276]@CxMIr9nJ was never submitted; did the code create it and forget to run it? ('cancel' the task to suppress this message)
2017-11-17 16:36:17,123 WARN  Task[org.apache.brooklyn.entity.software.base.SoftwareProcessImpl$2@7ec4bb28]@qEiFXei0 was never submitted; did the code create it and forget to run it? ('cancel' the task to suppress this message)
2017-11-17 16:36:17,123 WARN  Task[org.apache.brooklyn.entity.software.base.SoftwareProcessImpl$2@175d9d88]@I5t57OME was never submitted; did the code create it and forget to run it? ('cancel' the task to suppress this message)
2017-11-17 16:36:17,136 INFO  TESTNG PASSED CONFIGURATION: "Surefire test" - @BeforeMethod org.apache.brooklyn.entity.software.base.SoftwareProcessSubclassTest.setUp() finished in 450 ms
2017-11-17 16:36:17,137 INFO  TESTNG INVOKING: "Surefire test" - org.apache.brooklyn.entity.software.base.SoftwareProcessSubclassTest.testStartCalledViaInvokeEffector()
2017-11-17 16:36:17,264 INFO  TESTNG PASSED: "Surefire test" - org.apache.brooklyn.entity.software.base.SoftwareProcessSubclassTest.testStartCalledViaInvokeEffector() finished in 128 ms
2017-11-17 16:36:17,265 INFO  TESTNG INVOKING CONFIGURATION: "Surefire test" - @AfterMethod org.apache.brooklyn.core.test.BrooklynMgmtUnitTestSupport.tearDown()
2017-11-17 16:36:17,275 INFO  TESTNG PASSED CONFIGURATION: "Surefire test" - @AfterMethod org.apache.brooklyn.core.test.BrooklynMgmtUnitTestSupport.tearDown() finished in 10 ms
2017-11-17 16:36:17,275 INFO  TESTNG INVOKING CONFIGURATION: "Surefire test" - @BeforeMethod org.apache.brooklyn.entity.software.base.SoftwareProcessSubclassTest.setUp()
2017-11-17 16:36:17,275 INFO  Added external config supplier named 'brooklyn-demo-sample': org.apache.brooklyn.core.config.external.InPlaceExternalConfigSupplier@55f29d39
2017-11-17 16:36:17,300 INFO  TESTNG PASSED CONFIGURATION: "Surefire test" - @BeforeMethod org.apache.brooklyn.entity.software.base.SoftwareProcessSubclassTest.setUp() finished in 25 ms
2017-11-17 16:36:17,300 INFO  TESTNG INVOKING: "Surefire test" - org.apache.brooklyn.entity.software.base.SoftwareProcessSubclassTest.testStartCalledViaMethod()
2017-11-17 16:36:17,425 INFO  TESTNG PASSED: "Surefire test" - org.apache.brooklyn.entity.software.base.SoftwareProcessSubclassTest.testStartCalledViaMethod() finished in 125 ms
2017-11-17 16:36:17,426 INFO  TESTNG INVOKING CONFIGURATION: "Surefire test" - @AfterMethod org.apache.brooklyn.core.test.BrooklynMgmtUnitTestSupport.tearDown()
2017-11-17 16:36:17,435 INFO  TESTNG PASSED CONFIGURATION: "Surefire test" - @AfterMethod org.apache.brooklyn.core.test.BrooklynMgmtUnitTestSupport.tearDown() finished in 9 ms
2017-11-17 16:36:17,436 INFO  TESTNG INVOKING CONFIGURATION: "Surefire test" - @BeforeMethod org.apache.brooklyn.entity.software.base.SoftwareProcessSubclassTest.setUp()
2017-11-17 16:36:17,436 INFO  Added external config supplier named 'brooklyn-demo-sample': org.apache.brooklyn.core.config.external.InPlaceExternalConfigSupplier@309ac89e
2017-11-17 16:36:17,460 INFO  TESTNG PASSED CONFIGURATION: "Surefire test" - @BeforeMethod org.apache.brooklyn.entity.software.base.SoftwareProcessSubclassTest.setUp() finished in 24 ms
2017-11-17 16:36:17,460 INFO  TESTNG INVOKING: "Surefire test" - org.apache.brooklyn.entity.software.base.SoftwareProcessSubclassTest.testStopCalledViaInvokeEffector()
2017-11-17 16:36:17,601 INFO  TESTNG PASSED: "Surefire test" - org.apache.brooklyn.entity.software.base.SoftwareProcessSubclassTest.testStopCalledViaInvokeEffector() finished in 141 ms
2017-11-17 16:36:17,601 INFO  TESTNG INVOKING CONFIGURATION: "Surefire test" - @AfterMethod org.apache.brooklyn.core.test.BrooklynMgmtUnitTestSupport.tearDown()
2017-11-17 16:36:17,606 INFO  TESTNG PASSED CONFIGURATION: "Surefire test" - @AfterMethod org.apache.brooklyn.core.test.BrooklynMgmtUnitTestSupport.tearDown() finished in 5 ms
2017-11-17 16:36:17,606 INFO  TESTNG INVOKING CONFIGURATION: "Surefire test" - @BeforeMethod org.apache.brooklyn.entity.software.base.SoftwareProcessSubclassTest.setUp()
2017-11-17 16:36:17,606 INFO  Added external config supplier named 'brooklyn-demo-sample': org.apache.brooklyn.core.config.external.InPlaceExternalConfigSupplier@530aa75c
2017-11-17 16:36:17,630 INFO  TESTNG PASSED CONFIGURATION: "Surefire test" - @BeforeMethod org.apache.brooklyn.entity.software.base.SoftwareProcessSubclassTest.setUp() finished in 24 ms
2017-11-17 16:36:17,631 INFO  TESTNG INVOKING: "Surefire test" - org.apache.brooklyn.entity.software.base.SoftwareProcessSubclassTest.testStopCalledViaMethod()
2017-11-17 16:36:17,771 INFO  TESTNG PASSED: "Surefire test" - org.apache.brooklyn.entity.software.base.SoftwareProcessSubclassTest.testStopCalledViaMethod() finished in 140 ms
2017-11-17 16:36:17,772 INFO  TESTNG INVOKING CONFIGURATION: "Surefire test" - @AfterMethod org.apache.brooklyn.core.test.BrooklynMgmtUnitTestSupport.tearDown()
2017-11-17 16:36:17,782 INFO  TESTNG PASSED CONFIGURATION: "Surefire test" - @AfterMethod org.apache.brooklyn.core.test.BrooklynMgmtUnitTestSupport.tearDown() finished in 10 ms
2017-11-17 16:36:17,783 INFO  TESTNG INVOKING CONFIGURATION: "Surefire test" - @BeforeMethod org.apache.brooklyn.entity.software.base.SoftwareProcessSubclassTest.setUp()
2017-11-17 16:36:17,784 INFO  Added external config supplier named 'brooklyn-demo-sample': org.apache.brooklyn.core.config.external.InPlaceExternalConfigSupplier@4bf6bc2d
2017-11-17 16:36:17,812 INFO  TESTNG PASSED CONFIGURATION: "Surefire test" - @BeforeMethod org.apache.brooklyn.entity.software.base.SoftwareProcessSubclassTest.setUp() finished in 29 ms
2017-11-17 16:36:17,812 INFO  TESTNG INVOKING: "Surefire test" - org.apache.brooklyn.entity.software.base.SoftwareProcessSubclassTest.testStopCalledWithoutEffector()
2017-11-17 16:36:17,955 INFO  TESTNG PASSED: "Surefire test" - org.apache.brooklyn.entity.software.base.SoftwareProcessSubclassTest.testStopCalledWithoutEffector() finished in 143 ms
2017-11-17 16:36:17,955 INFO  TESTNG INVOKING CONFIGURATION: "Surefire test" - @AfterMethod org.apache.brooklyn.core.test.BrooklynMgmtUnitTestSupport.tearDown()
2017-11-17 16:36:17,961 INFO  TESTNG PASSED CONFIGURATION: "Surefire test" - @AfterMethod org.apache.brooklyn.core.test.BrooklynMgmtUnitTestSupport.tearDown() finished in 5 ms
2017-11-17 16:36:17,962 INFO  TESTNG INVOKING: "Surefire test" - org.apache.brooklyn.feed.jmx.JmxValueFunctionsTest.testCompositeDataToMap()
2017-11-17 16:36:17,963 INFO  TESTNG PASSED: "Surefire test" - org.apache.brooklyn.feed.jmx.JmxValueFunctionsTest.testCompositeDataToMap() finished in 1 ms
2017-11-17 16:36:17,964 INFO  TESTNG INVOKING: "Surefire test" - org.apache.brooklyn.feed.jmx.JmxValueFunctionsTest.testTabularDataToMap()
2017-11-17 16:36:17,964 WARN  tablularDataToMap has overwritten key key1
2017-11-17 16:36:17,964 WARN  tablularDataToMap has overwritten key key2
2017-11-17 16:36:17,964 WARN  tablularDataToMap has overwritten key key1
2017-11-17 16:36:17,964 WARN  tablularDataToMap has overwritten key key2
2017-11-17 16:36:17,964 INFO  TESTNG PASSED: "Surefire test" - org.apache.brooklyn.feed.jmx.JmxValueFunctionsTest.testTabularDataToMap() finished in 0 ms
2017-11-17 16:36:17,965 INFO  TESTNG INVOKING: "Surefire test" - org.apache.brooklyn.feed.jmx.JmxValueFunctionsTest.testTabularDataToMapOfMaps()
2017-11-17 16:36:17,966 INFO  TESTNG PASSED: "Surefire test" - org.apache.brooklyn.feed.jmx.JmxValueFunctionsTest.testTabularDataToMapOfMaps() finished in 1 ms
2017-11-17 16:36:17,966 INFO  TESTNG INVOKING: "Surefire test" - org.apache.brooklyn.entity.java.SslKeyConfigTest.testWriteKeyAndCertThenReadThem()
2017-11-17 16:36:18,231 INFO  TESTNG PASSED: "Surefire test" - org.apache.brooklyn.entity.java.SslKeyConfigTest.testWriteKeyAndCertThenReadThem() finished in 265 ms
2017-11-17 16:36:18,231 INFO  TESTNG INVOKING CONFIGURATION: "Surefire test" - @BeforeMethod org.apache.brooklyn.entity.java.JavaOptsTest.setUp()
2017-11-17 16:36:18,232 INFO  Added external config supplier named 'brooklyn-demo-sample': org.apache.brooklyn.core.config.external.InPlaceExternalConfigSupplier@282d1023
2017-11-17 16:36:18,243 INFO  TESTNG PASSED CONFIGURATION: "Surefire test" - @BeforeMethod org.apache.brooklyn.entity.java.JavaOptsTest.setUp() finished in 12 ms
2017-11-17 16:36:18,243 INFO  TESTNG INVOKING: "Surefire test" - org.apache.brooklyn.entity.java.JavaOptsTest.testBasicJmxConfigFromDefault()
2017-11-17 16:36:18,299 INFO  Creating PortForwardManager(scope=global)
2017-11-17 16:36:18,427 INFO  TESTNG PASSED: "Surefire test" - org.apache.brooklyn.entity.java.JavaOptsTest.testBasicJmxConfigFromDefault() finished in 184 ms
2017-11-17 16:36:18,428 INFO  TESTNG INVOKING CONFIGURATION: "Surefire test" - @AfterMethod org.apache.brooklyn.entity.java.JavaOptsTest.tearDown()
2017-11-17 16:36:18,440 INFO  TESTNG PASSED CONFIGURATION: "Surefire test" - @AfterMethod org.apache.brooklyn.entity.java.JavaOptsTest.tearDown() finished in 11 ms
2017-11-17 16:36:18,440 INFO  TESTNG INVOKING CONFIGURATION: "Surefire test" - @BeforeMethod org.apache.brooklyn.entity.java.JavaOptsTest.setUp()
2017-11-17 16:36:18,441 INFO  Added external config supplier named 'brooklyn-demo-sample': org.apache.brooklyn.core.config.external.InPlaceExternalConfigSupplier@7b186fb8
2017-11-17 16:36:18,452 INFO  TESTNG PASSED CONFIGURATION: "Surefire test" - @BeforeMethod org.apache.brooklyn.entity.java.JavaOptsTest.setUp() finished in 12 ms
2017-11-17 16:36:18,452 INFO  TESTNG INVOKING: "Surefire test" - org.apache.brooklyn.entity.java.JavaOptsTest.testBasicJmxFromConfig()
2017-11-17 16:36:18,485 INFO  Creating PortForwardManager(scope=global)
2017-11-17 16:36:18,611 INFO  TESTNG PASSED: "Surefire test" - org.apache.brooklyn.entity.java.JavaOptsTest.testBasicJmxFromConfig() finished in 159 ms
2017-11-17 16:36:18,612 INFO  TESTNG INVOKING CONFIGURATION: "Surefire test" - @AfterMethod org.apache.brooklyn.entity.java.JavaOptsTest.tearDown()
2017-11-17 16:36:18,624 INFO  TESTNG PASSED CONFIGURATION: "Surefire test" - @AfterMethod org.apache.brooklyn.entity.java.JavaOptsTest.tearDown() finished in 12 ms
2017-11-17 16:36:18,626 INFO  TESTNG INVOKING CONFIGURATION: "Surefire test" - @BeforeMethod org.apache.brooklyn.entity.java.JavaOptsTest.setUp()
2017-11-17 16:36:18,626 INFO  Added external config supplier named 'brooklyn-demo-sample': org.apache.brooklyn.core.config.external.InPlaceExternalConfigSupplier@276e5add
2017-11-17 16:36:18,642 INFO  TESTNG PASSED CONFIGURATION: "Surefire test" - @BeforeMethod org.apache.brooklyn.entity.java.JavaOptsTest.setUp() finished in 16 ms
2017-11-17 16:36:18,642 INFO  TESTNG INVOKING: "Surefire test" - org.apache.brooklyn.entity.java.JavaOptsTest.testBasicJmxFromFlag()
2017-11-17 16:36:18,678 INFO  Creating PortForwardManager(scope=global)
2017-11-17 16:36:18,802 INFO  TESTNG PASSED: "Surefire test" - org.apache.brooklyn.entity.java.JavaOptsTest.testBasicJmxFromFlag() finished in 160 ms
2017-11-17 16:36:18,802 INFO  TESTNG INVOKING CONFIGURATION: "Surefire test" - @AfterMethod org.apache.brooklyn.entity.java.JavaOptsTest.tearDown()
2017-11-17 16:36:18,810 INFO  TESTNG PASSED CONFIGURATION: "Surefire test" - @AfterMethod org.apache.brooklyn.entity.java.JavaOptsTest.tearDown() finished in 8 ms
2017-11-17 16:36:18,811 INFO  TESTNG INVOKING CONFIGURATION: "Surefire test" - @BeforeMethod org.apache.brooklyn.entity.java.JavaOptsTest.setUp()
2017-11-17 16:36:18,811 INFO  Added external config supplier named 'brooklyn-demo-sample': org.apache.brooklyn.core.config.external.InPlaceExternalConfigSupplier@7200702
2017-11-17 16:36:18,822 INFO  TESTNG PASSED CONFIGURATION: "Surefire test" - @BeforeMethod org.apache.brooklyn.entity.java.JavaOptsTest.setUp() finished in 11 ms
2017-11-17 16:36:18,822 INFO  TESTNG INVOKING: "Surefire test" - org.apache.brooklyn.entity.java.JavaOptsTest.testPassesJavaArgs()
2017-11-17 16:36:18,987 INFO  TESTNG PASSED: "Surefire test" - org.apache.brooklyn.entity.java.JavaOptsTest.testPassesJavaArgs() finished in 165 ms
2017-11-17 16:36:18,988 INFO  TESTNG INVOKING CONFIGURATION: "Surefire test" - @AfterMethod org.apache.brooklyn.entity.java.JavaOptsTest.tearDown()
2017-11-17 16:36:18,996 INFO  TESTNG PASSED CONFIGURATION: "Surefire test" - @AfterMethod org.apache.brooklyn.entity.java.JavaOptsTest.tearDown() finished in 8 ms
2017-11-17 16:36:18,996 INFO  TESTNG INVOKING CONFIGURATION: "Surefire test" - @BeforeMethod org.apache.brooklyn.entity.java.JavaOptsTest.setUp()
2017-11-17 16:36:18,997 INFO  Added external config supplier named 'brooklyn-demo-sample': org.apache.brooklyn.core.config.external.InPlaceExternalConfigSupplier@2ecb87b2
2017-11-17 16:36:19,012 INFO  TESTNG PASSED CONFIGURATION: "Surefire test" - @BeforeMethod org.apache.brooklyn.entity.java.JavaOptsTest.setUp() finished in 16 ms
2017-11-17 16:36:19,013 INFO  TESTNG INVOKING: "Surefire test" - org.apache.brooklyn.entity.java.JavaOptsTest.testPassesJavaOpts()
2017-11-17 16:36:19,174 INFO  TESTNG PASSED: "Surefire test" - org.apache.brooklyn.entity.java.JavaOptsTest.testPassesJavaOpts() finished in 162 ms
2017-11-17 16:36:19,175 INFO  TESTNG INVOKING CONFIGURATION: "Surefire test" - @AfterMethod org.apache.brooklyn.entity.java.JavaOptsTest.tearDown()
2017-11-17 16:36:19,184 INFO  TESTNG PASSED CONFIGURATION: "Surefire test" - @AfterMethod org.apache.brooklyn.entity.java.JavaOptsTest.tearDown() finished in 10 ms
2017-11-17 16:36:19,184 INFO  TESTNG INVOKING CONFIGURATION: "Surefire test" - @BeforeMethod org.apache.brooklyn.entity.java.JavaOptsTest.setUp()
2017-11-17 16:36:19,185 INFO  Added external config supplier named 'brooklyn-demo-sample': org.apache.brooklyn.core.config.external.InPlaceExternalConfigSupplier@51751265
2017-11-17 16:36:19,199 INFO  TESTNG PASSED CONFIGURATION: "Surefire test" - @BeforeMethod org.apache.brooklyn.entity.java.JavaOptsTest.setUp() finished in 15 ms
2017-11-17 16:36:19,199 INFO  TESTNG INVOKING: "Surefire test" - org.apache.brooklyn.entity.java.JavaOptsTest.testPassesJavaOptsObeyingMutualExclusions()
2017-11-17 16:36:19,367 INFO  TESTNG PASSED: "Surefire test" - org.apache.brooklyn.entity.java.JavaOptsTest.testPassesJavaOptsObeyingMutualExclusions() finished in 168 ms
2017-11-17 16:36:19,367 INFO  TESTNG INVOKING CONFIGURATION: "Surefire test" - @AfterMethod org.apache.brooklyn.entity.java.JavaOptsTest.tearDown()
2017-11-17 16:36:19,376 INFO  TESTNG PASSED CONFIGURATION: "Surefire test" - @AfterMethod org.apache.brooklyn.entity.java.JavaOptsTest.tearDown() finished in 9 ms
2017-11-17 16:36:19,376 INFO  TESTNG INVOKING CONFIGURATION: "Surefire test" - @BeforeMethod org.apache.brooklyn.entity.java.JavaOptsTest.setUp()
2017-11-17 16:36:19,377 INFO  Added external config supplier named 'brooklyn-demo-sample': org.apache.brooklyn.core.config.external.InPlaceExternalConfigSupplier@10d8769e
2017-11-17 16:36:19,389 INFO  TESTNG PASSED CONFIGURATION: "Surefire test" - @BeforeMethod org.apache.brooklyn.entity.java.JavaOptsTest.setUp() finished in 13 ms
2017-11-17 16:36:19,389 INFO  TESTNG INVOKING: "Surefire test" - org.apache.brooklyn.entity.java.JavaOptsTest.testPassesJavaOptsOverridingDefaults()
2017-11-17 16:36:19,549 INFO  TESTNG PASSED: "Surefire test" - org.apache.brooklyn.entity.java.JavaOptsTest.testPassesJavaOptsOverridingDefaults() finished in 160 ms
2017-11-17 16:36:19,550 INFO  TESTNG INVOKING CONFIGURATION: "Surefire test" - @AfterMethod org.apache.brooklyn.entity.java.JavaOptsTest.tearDown()
2017-11-17 16:36:19,558 INFO  TESTNG PASSED CONFIGURATION: "Surefire test" - @AfterMethod org.apache.brooklyn.entity.java.JavaOptsTest.tearDown() finished in 8 ms
2017-11-17 16:36:19,559 INFO  TESTNG INVOKING CONFIGURATION: "Surefire test" - @BeforeMethod org.apache.brooklyn.entity.java.JavaOptsTest.setUp()
2017-11-17 16:36:19,559 INFO  Added external config supplier named 'brooklyn-demo-sample': org.apache.brooklyn.core.config.external.InPlaceExternalConfigSupplier@413a2520
2017-11-17 16:36:19,571 INFO  TESTNG PASSED CONFIGURATION: "Surefire test" - @BeforeMethod org.apache.brooklyn.entity.java.JavaOptsTest.setUp() finished in 12 ms
2017-11-17 16:36:19,571 INFO  TESTNG INVOKING: "Surefire test" - org.apache.brooklyn.entity.java.JavaOptsTest.testPassesJavaSysProps()
2017-11-17 16:36:19,735 INFO  TESTNG PASSED: "Surefire test" - org.apache.brooklyn.entity.java.JavaOptsTest.testPassesJavaSysProps() finished in 164 ms
2017-11-17 16:36:19,735 INFO  TESTNG INVOKING CONFIGURATION: "Surefire test" - @AfterMethod org.apache.brooklyn.entity.java.JavaOptsTest.tearDown()
2017-11-17 16:36:19,743 INFO  TESTNG PASSED CONFIGURATION: "Surefire test" - @AfterMethod org.apache.brooklyn.entity.java.JavaOptsTest.tearDown() finished in 8 ms
2017-11-17 16:36:19,744 INFO  TESTNG INVOKING CONFIGURATION: "Surefire test" - @BeforeMethod org.apache.brooklyn.entity.java.JavaOptsTest.setUp()
2017-11-17 16:36:19,745 INFO  Added external config supplier named 'brooklyn-demo-sample': org.apache.brooklyn.core.config.external.InPlaceExternalConfigSupplier@303a484e
2017-11-17 16:36:19,758 INFO  TESTNG PASSED CONFIGURATION: "Surefire test" - @BeforeMethod org.apache.brooklyn.entity.java.JavaOptsTest.setUp() finished in 14 ms
2017-11-17 16:36:19,758 INFO  TESTNG INVOKING: "Surefire test" - org.apache.brooklyn.entity.java.JavaOptsTest.testSecureJmxConfigFromDefault()
2017-11-17 16:36:19,795 INFO  Creating PortForwardManager(scope=global)
2017-11-17 16:36:20,300 INFO  TESTNG PASSED: "Surefire test" - org.apache.brooklyn.entity.java.JavaOptsTest.testSecureJmxConfigFromDefault() finished in 541 ms
2017-11-17 16:36:20,300 INFO  TESTNG INVOKING CONFIGURATION: "Surefire test" - @AfterMethod org.apache.brooklyn.entity.java.JavaOptsTest.tearDown()
2017-11-17 16:36:20,308 INFO  TESTNG PASSED CONFIGURATION: "Surefire test" - @AfterMethod org.apache.brooklyn.entity.java.JavaOptsTest.tearDown() finished in 8 ms
2017-11-17 16:36:20,308 INFO  TESTNG INVOKING CONFIGURATION: "Surefire test" - @BeforeMethod org.apache.brooklyn.entity.java.JavaOptsTest.setUp()
2017-11-17 16:36:20,308 INFO  Added external config supplier named 'brooklyn-demo-sample': org.apache.brooklyn.core.config.external.InPlaceExternalConfigSupplier@23ba2c1e
2017-11-17 16:36:20,322 INFO  TESTNG PASSED CONFIGURATION: "Surefire test" - @BeforeMethod org.apache.brooklyn.entity.java.JavaOptsTest.setUp() finished in 14 ms
2017-11-17 16:36:20,323 INFO  TESTNG INVOKING: "Surefire test" - org.apache.brooklyn.entity.java.JavaOptsTest.testSimpleLaunchesJavaProcess()
2017-11-17 16:36:20,484 INFO  TESTNG PASSED: "Surefire test" - org.apache.brooklyn.entity.java.JavaOptsTest.testSimpleLaunchesJavaProcess() finished in 161 ms
2017-11-17 16:36:20,484 INFO  TESTNG INVOKING CONFIGURATION: "Surefire test" - @AfterMethod org.apache.brooklyn.entity.java.JavaOptsTest.tearDown()
2017-11-17 16:36:20,493 INFO  TESTNG PASSED CONFIGURATION: "Surefire test" - @AfterMethod org.apache.brooklyn.entity.java.JavaOptsTest.tearDown() finished in 9 ms
2017-11-17 16:36:20,575 INFO  TESTNG 
===============================================
    Surefire test
    Tests run: 232, Failures: 1, Skips: 0
===============================================
[GC (Allocation Failure)  274343K->74001K(760832K), 0.0440884 secs]
Tests run: 232, Failures: 1, Errors: 0, Skipped: 0, Time elapsed: 104.498 sec <<< FAILURE! - in TestSuite
testRebind(org.apache.brooklyn.entity.machine.MachineEntityJcloudsRebindTest)  Time elapsed: 31.777 sec  <<< FAILURE!
java.lang.AssertionError: failed succeeds-eventually, 75 attempts, 30002ms elapsed: AssertionError: Commands (/etc/os-release) not contain in [ExecCmd{summaryForLogging=, commands=[cat /proc/uptime], env={}, constructorProps={user=root, host=173.194.32.1, sshToolClass=org.apache.brooklyn.util.core.internal.ssh.RecordingSshTool, password=JXhGBz94BAj1, spec.original=jclouds:aws-ec2:us-east-1, spec.named.name=jclouds:aws-ec2:us-east-1, spec.final=jclouds:aws-ec2:us-east-1, privateKeyData=null, port=22, detectMachineDetails=true, privateAddresses=[172.168.10.1], polls={org.apache.brooklyn.feed.AbstractCommandFeed$CommandPollIdentifier@f2ebe89b=[ssh[uptime->machine.loadAverage]], org.apache.brooklyn.feed.AbstractCommandFeed$CommandPollIdentifier@16dc7ddc=[ssh[ps -A -o pcpu->machine.cpu]], org.apache.brooklyn.feed.AbstractCommandFeed$CommandPollIdentifier@f956448c=[ssh[free | grep Mem:->machine.memory.used], ssh[free | grep Mem:->machine.memory.free], ssh[free | grep Mem:->machine.memory.total]], org.apache.brooklyn.feed.AbstractCommandFeed$CommandPollIdentifier@5a4b89c7=[ssh[cat /proc/uptime->machine.uptime]]}, machine=null, execAsCommand=false, feed.onlyIfServiceUp=false}, props={err=org.apache.brooklyn.util.stream.LoggingOutputStream@2484dbb7, machine=null, execAsCommand=false, polls={org.apache.brooklyn.feed.AbstractCommandFeed$CommandPollIdentifier@f2ebe89b=[ssh[uptime->machine.loadAverage]], org.apache.brooklyn.feed.AbstractCommandFeed$CommandPollIdentifier@16dc7ddc=[ssh[ps -A -o pcpu->machine.cpu]], org.apache.brooklyn.feed.AbstractCommandFeed$CommandPollIdentifier@f956448c=[ssh[free | grep Mem:->machine.memory.used], ssh[free | grep Mem:->machine.memory.free], ssh[free | grep Mem:->machine.memory.total]], org.apache.brooklyn.feed.AbstractCommandFeed$CommandPollIdentifier@5a4b89c7=[ssh[cat /proc/uptime->machine.uptime]]}, feed.onlyIfServiceUp=false, noExtraOutput=true, out=org.apache.brooklyn.util.stream.LoggingOutputStream@111cba40, summary=ssh-feed}}, ExecCmd{summaryForLogging=, commands=[free | grep Mem:], env={}, constructorProps={user=root, host=173.194.32.1, sshToolClass=org.apache.brooklyn.util.core.internal.ssh.RecordingSshTool, password=JXhGBz94BAj1, spec.original=jclouds:aws-ec2:us-east-1, spec.named.name=jclouds:aws-ec2:us-east-1, spec.final=jclouds:aws-ec2:us-east-1, privateKeyData=null, port=22, detectMachineDetails=true, privateAddresses=[172.168.10.1], polls={org.apache.brooklyn.feed.AbstractCommandFeed$CommandPollIdentifier@f2ebe89b=[ssh[uptime->machine.loadAverage]], org.apache.brooklyn.feed.AbstractCommandFeed$CommandPollIdentifier@16dc7ddc=[ssh[ps -A -o pcpu->machine.cpu]], org.apache.brooklyn.feed.AbstractCommandFeed$CommandPollIdentifier@f956448c=[ssh[free | grep Mem:->machine.memory.used], ssh[free | grep Mem:->machine.memory.free], ssh[free | grep Mem:->machine.memory.total]], org.apache.brooklyn.feed.AbstractCommandFeed$CommandPollIdentifier@5a4b89c7=[ssh[cat /proc/uptime->machine.uptime]]}, machine=null, execAsCommand=false, feed.onlyIfServiceUp=false}, props={err=org.apache.brooklyn.util.stream.LoggingOutputStream@48e41b5d, machine=null, execAsCommand=false, polls={org.apache.brooklyn.feed.AbstractCommandFeed$CommandPollIdentifier@f2ebe89b=[ssh[uptime->machine.loadAverage]], org.apache.brooklyn.feed.AbstractCommandFeed$CommandPollIdentifier@16dc7ddc=[ssh[ps -A -o pcpu->machine.cpu]], org.apache.brooklyn.feed.AbstractCommandFeed$CommandPollIdentifier@f956448c=[ssh[free | grep Mem:->machine.memory.used], ssh[free | grep Mem:->machine.memory.free], ssh[free | grep Mem:->machine.memory.total]], org.apache.brooklyn.feed.AbstractCommandFeed$CommandPollIdentifier@5a4b89c7=[ssh[cat /proc/uptime->machine.uptime]]}, feed.onlyIfServiceUp=false, noExtraOutput=true, out=org.apache.brooklyn.util.stream.LoggingOutputStream@51e8d066, summary=ssh-feed}}, ExecCmd{summaryForLogging=, commands=[uptime], env={}, constructorProps={user=root, host=173.194.32.1, sshToolClass=org.apache.brooklyn.util.core.internal.ssh.RecordingSshTool, password=JXhGBz94BAj1, spec.original=jclouds:aws-ec2:us-east-1, spec.named.name=jclouds:aws-ec2:us-east-1, spec.final=jclouds:aws-ec2:us-east-1, privateKeyData=null, port=22, detectMachineDetails=true, privateAddresses=[172.168.10.1], polls={org.apache.brooklyn.feed.AbstractCommandFeed$CommandPollIdentifier@f2ebe89b=[ssh[uptime->machine.loadAverage]], org.apache.brooklyn.feed.AbstractCommandFeed$CommandPollIdentifier@16dc7ddc=[ssh[ps -A -o pcpu->machine.cpu]], org.apache.brooklyn.feed.AbstractCommandFeed$CommandPollIdentifier@f956448c=[ssh[free | grep Mem:->machine.memory.used], ssh[free | grep Mem:->machine.memory.free], ssh[free | grep Mem:->machine.memory.total]], org.apache.brooklyn.feed.AbstractCommandFeed$CommandPollIdentifier@5a4b89c7=[ssh[cat /proc/uptime->machine.uptime]]}, machine=null, execAsCommand=false, feed.onlyIfServiceUp=false}, props={err=org.apache.brooklyn.util.stream.LoggingOutputStream@5333f08f, machine=null, execAsCommand=false, polls={org.apache.brooklyn.feed.AbstractCommandFeed$CommandPollIdentifier@f2ebe89b=[ssh[uptime->machine.loadAverage]], org.apache.brooklyn.feed.AbstractCommandFeed$CommandPollIdentifier@16dc7ddc=[ssh[ps -A -o pcpu->machine.cpu]], org.apache.brooklyn.feed.AbstractCommandFeed$CommandPollIdentifier@f956448c=[ssh[free | grep Mem:->machine.memory.used], ssh[free | grep Mem:->machine.memory.free], ssh[free | grep Mem:->machine.memory.total]], org.apache.brooklyn.feed.AbstractCommandFeed$CommandPollIdentifier@5a4b89c7=[ssh[cat /proc/uptime->machine.uptime]]}, feed.onlyIfServiceUp=false, noExtraOutput=true, out=org.apache.brooklyn.util.stream.LoggingOutputStream@27898e13, summary=ssh-feed}}, ExecCmd{summaryForLogging=, commands=[ps -A -o pcpu], env={}, constructorProps={user=root, host=173.194.32.1, sshToolClass=org.apache.brooklyn.util.core.internal.ssh.RecordingSshTool, password=JXhGBz94BAj1, spec.original=jclouds:aws-ec2:us-east-1, spec.named.name=jclouds:aws-ec2:us-east-1, spec.final=jclouds:aws-ec2:us-east-1, privateKeyData=null, port=22, detectMachineDetails=true, privateAddresses=[172.168.10.1], polls={org.apache.brooklyn.feed.AbstractCommandFeed$CommandPollIdentifier@f2ebe89b=[ssh[uptime->machine.loadAverage]], org.apache.brooklyn.feed.AbstractCommandFeed$CommandPollIdentifier@16dc7ddc=[ssh[ps -A -o pcpu->machine.cpu]], org.apache.brooklyn.feed.AbstractCommandFeed$CommandPollIdentifier@f956448c=[ssh[free | grep Mem:->machine.memory.used], ssh[free | grep Mem:->machine.memory.free], ssh[free | grep Mem:->machine.memory.total]], org.apache.brooklyn.feed.AbstractCommandFeed$CommandPollIdentifier@5a4b89c7=[ssh[cat /proc/uptime->machine.uptime]]}, machine=null, execAsCommand=false, feed.onlyIfServiceUp=false}, props={err=org.apache.brooklyn.util.stream.LoggingOutputStream@4f5f474c, machine=null, execAsCommand=false, polls={org.apache.brooklyn.feed.AbstractCommandFeed$CommandPollIdentifier@f2ebe89b=[ssh[uptime->machine.loadAverage]], org.apache.brooklyn.feed.AbstractCommandFeed$CommandPollIdentifier@16dc7ddc=[ssh[ps -A -o pcpu->machine.cpu]], org.apache.brooklyn.feed.AbstractCommandFeed$CommandPollIdentifier@f956448c=[ssh[free | grep Mem:->machine.memory.used], ssh[free | grep Mem:->machine.memory.free], ssh[free | grep Mem:->machine.memory.total]], org.apache.brooklyn.feed.AbstractCommandFeed$CommandPollIdentifier@5a4b89c7=[ssh[cat /proc/uptime->machine.uptime]]}, feed.onlyIfServiceUp=false, noExtraOutput=true, out=org.apache.brooklyn.util.stream.LoggingOutputStream@58a3d521, summary=ssh-feed}}]
	at org.apache.brooklyn.entity.machine.MachineEntityJcloudsRebindTest.assertRecordedSshCmdContainsEventually(MachineEntityJcloudsRebindTest.java:117)
	at org.apache.brooklyn.entity.machine.MachineEntityJcloudsRebindTest.testRebind(MachineEntityJcloudsRebindTest.java:103)
Caused by: java.lang.AssertionError: Commands (/etc/os-release) not contain in [ExecCmd{summaryForLogging=, commands=[cat /proc/uptime], env={}, constructorProps={user=root, host=173.194.32.1, sshToolClass=org.apache.brooklyn.util.core.internal.ssh.RecordingSshTool, password=JXhGBz94BAj1, spec.original=jclouds:aws-ec2:us-east-1, spec.named.name=jclouds:aws-ec2:us-east-1, spec.final=jclouds:aws-ec2:us-east-1, privateKeyData=null, port=22, detectMachineDetails=true, privateAddresses=[172.168.10.1], polls={org.apache.brooklyn.feed.AbstractCommandFeed$CommandPollIdentifier@f2ebe89b=[ssh[uptime->machine.loadAverage]], org.apache.brooklyn.feed.AbstractCommandFeed$CommandPollIdentifier@16dc7ddc=[ssh[ps -A -o pcpu->machine.cpu]], org.apache.brooklyn.feed.AbstractCommandFeed$CommandPollIdentifier@f956448c=[ssh[free | grep Mem:->machine.memory.used], ssh[free | grep Mem:->machine.memory.free], ssh[free | grep Mem:->machine.memory.total]], org.apache.brooklyn.feed.AbstractCommandFeed$CommandPollIdentifier@5a4b89c7=[ssh[cat /proc/uptime->machine.uptime]]}, machine=null, execAsCommand=false, feed.onlyIfServiceUp=false}, props={err=org.apache.brooklyn.util.stream.LoggingOutputStream@2484dbb7, machine=null, execAsCommand=false, polls={org.apache.brooklyn.feed.AbstractCommandFeed$CommandPollIdentifier@f2ebe89b=[ssh[uptime->machine.loadAverage]], org.apache.brooklyn.feed.AbstractCommandFeed$CommandPollIdentifier@16dc7ddc=[ssh[ps -A -o pcpu->machine.cpu]], org.apache.brooklyn.feed.AbstractCommandFeed$CommandPollIdentifier@f956448c=[ssh[free | grep Mem:->machine.memory.used], ssh[free | grep Mem:->machine.memory.free], ssh[free | grep Mem:->machine.memory.total]], org.apache.brooklyn.feed.AbstractCommandFeed$CommandPollIdentifier@5a4b89c7=[ssh[cat /proc/uptime->machine.uptime]]}, feed.onlyIfServiceUp=false, noExtraOutput=true, out=org.apache.brooklyn.util.stream.LoggingOutputStream@111cba40, summary=ssh-feed}}, ExecCmd{summaryForLogging=, commands=[free | grep Mem:], env={}, constructorProps={user=root, host=173.194.32.1, sshToolClass=org.apache.brooklyn.util.core.internal.ssh.RecordingSshTool, password=JXhGBz94BAj1, spec.original=jclouds:aws-ec2:us-east-1, spec.named.name=jclouds:aws-ec2:us-east-1, spec.final=jclouds:aws-ec2:us-east-1, privateKeyData=null, port=22, detectMachineDetails=true, privateAddresses=[172.168.10.1], polls={org.apache.brooklyn.feed.AbstractCommandFeed$CommandPollIdentifier@f2ebe89b=[ssh[uptime->machine.loadAverage]], org.apache.brooklyn.feed.AbstractCommandFeed$CommandPollIdentifier@16dc7ddc=[ssh[ps -A -o pcpu->machine.cpu]], org.apache.brooklyn.feed.AbstractCommandFeed$CommandPollIdentifier@f956448c=[ssh[free | grep Mem:->machine.memory.used], ssh[free | grep Mem:->machine.memory.free], ssh[free | grep Mem:->machine.memory.total]], org.apache.brooklyn.feed.AbstractCommandFeed$CommandPollIdentifier@5a4b89c7=[ssh[cat /proc/uptime->machine.uptime]]}, machine=null, execAsCommand=false, feed.onlyIfServiceUp=false}, props={err=org.apache.brooklyn.util.stream.LoggingOutputStream@48e41b5d, machine=null, execAsCommand=false, polls={org.apache.brooklyn.feed.AbstractCommandFeed$CommandPollIdentifier@f2ebe89b=[ssh[uptime->machine.loadAverage]], org.apache.brooklyn.feed.AbstractCommandFeed$CommandPollIdentifier@16dc7ddc=[ssh[ps -A -o pcpu->machine.cpu]], org.apache.brooklyn.feed.AbstractCommandFeed$CommandPollIdentifier@f956448c=[ssh[free | grep Mem:->machine.memory.used], ssh[free | grep Mem:->machine.memory.free], ssh[free | grep Mem:->machine.memory.total]], org.apache.brooklyn.feed.AbstractCommandFeed$CommandPollIdentifier@5a4b89c7=[ssh[cat /proc/uptime->machine.uptime]]}, feed.onlyIfServiceUp=false, noExtraOutput=true, out=org.apache.brooklyn.util.stream.LoggingOutputStream@51e8d066, summary=ssh-feed}}, ExecCmd{summaryForLogging=, commands=[uptime], env={}, constructorProps={user=root, host=173.194.32.1, sshToolClass=org.apache.brooklyn.util.core.internal.ssh.RecordingSshTool, password=JXhGBz94BAj1, spec.original=jclouds:aws-ec2:us-east-1, spec.named.name=jclouds:aws-ec2:us-east-1, spec.final=jclouds:aws-ec2:us-east-1, privateKeyData=null, port=22, detectMachineDetails=true, privateAddresses=[172.168.10.1], polls={org.apache.brooklyn.feed.AbstractCommandFeed$CommandPollIdentifier@f2ebe89b=[ssh[uptime->machine.loadAverage]], org.apache.brooklyn.feed.AbstractCommandFeed$CommandPollIdentifier@16dc7ddc=[ssh[ps -A -o pcpu->machine.cpu]], org.apache.brooklyn.feed.AbstractCommandFeed$CommandPollIdentifier@f956448c=[ssh[free | grep Mem:->machine.memory.used], ssh[free | grep Mem:->machine.memory.free], ssh[free | grep Mem:->machine.memory.total]], org.apache.brooklyn.feed.AbstractCommandFeed$CommandPollIdentifier@5a4b89c7=[ssh[cat /proc/uptime->machine.uptime]]}, machine=null, execAsCommand=false, feed.onlyIfServiceUp=false}, props={err=org.apache.brooklyn.util.stream.LoggingOutputStream@5333f08f, machine=null, execAsCommand=false, polls={org.apache.brooklyn.feed.AbstractCommandFeed$CommandPollIdentifier@f2ebe89b=[ssh[uptime->machine.loadAverage]], org.apache.brooklyn.feed.AbstractCommandFeed$CommandPollIdentifier@16dc7ddc=[ssh[ps -A -o pcpu->machine.cpu]], org.apache.brooklyn.feed.AbstractCommandFeed$CommandPollIdentifier@f956448c=[ssh[free | grep Mem:->machine.memory.used], ssh[free | grep Mem:->machine.memory.free], ssh[free | grep Mem:->machine.memory.total]], org.apache.brooklyn.feed.AbstractCommandFeed$CommandPollIdentifier@5a4b89c7=[ssh[cat /proc/uptime->machine.uptime]]}, feed.onlyIfServiceUp=false, noExtraOutput=true, out=org.apache.brooklyn.util.stream.LoggingOutputStream@27898e13, summary=ssh-feed}}, ExecCmd{summaryForLogging=, commands=[ps -A -o pcpu], env={}, constructorProps={user=root, host=173.194.32.1, sshToolClass=org.apache.brooklyn.util.core.internal.ssh.RecordingSshTool, password=JXhGBz94BAj1, spec.original=jclouds:aws-ec2:us-east-1, spec.named.name=jclouds:aws-ec2:us-east-1, spec.final=jclouds:aws-ec2:us-east-1, privateKeyData=null, port=22, detectMachineDetails=true, privateAddresses=[172.168.10.1], polls={org.apache.brooklyn.feed.AbstractCommandFeed$CommandPollIdentifier@f2ebe89b=[ssh[uptime->machine.loadAverage]], org.apache.brooklyn.feed.AbstractCommandFeed$CommandPollIdentifier@16dc7ddc=[ssh[ps -A -o pcpu->machine.cpu]], org.apache.brooklyn.feed.AbstractCommandFeed$CommandPollIdentifier@f956448c=[ssh[free | grep Mem:->machine.memory.used], ssh[free | grep Mem:->machine.memory.free], ssh[free | grep Mem:->machine.memory.total]], org.apache.brooklyn.feed.AbstractCommandFeed$CommandPollIdentifier@5a4b89c7=[ssh[cat /proc/uptime->machine.uptime]]}, machine=null, execAsCommand=false, feed.onlyIfServiceUp=false}, props={err=org.apache.brooklyn.util.stream.LoggingOutputStream@4f5f474c, machine=null, execAsCommand=false, polls={org.apache.brooklyn.feed.AbstractCommandFeed$CommandPollIdentifier@f2ebe89b=[ssh[uptime->machine.loadAverage]], org.apache.brooklyn.feed.AbstractCommandFeed$CommandPollIdentifier@16dc7ddc=[ssh[ps -A -o pcpu->machine.cpu]], org.apache.brooklyn.feed.AbstractCommandFeed$CommandPollIdentifier@f956448c=[ssh[free | grep Mem:->machine.memory.used], ssh[free | grep Mem:->machine.memory.free], ssh[free | grep Mem:->machine.memory.total]], org.apache.brooklyn.feed.AbstractCommandFeed$CommandPollIdentifier@5a4b89c7=[ssh[cat /proc/uptime->machine.uptime]]}, feed.onlyIfServiceUp=false, noExtraOutput=true, out=org.apache.brooklyn.util.stream.LoggingOutputStream@58a3d521, summary=ssh-feed}}]
	at org.apache.brooklyn.entity.machine.MachineEntityJcloudsRebindTest.assertRecordedSshCmdContainsEventually(MachineEntityJcloudsRebindTest.java:117)
	at org.apache.brooklyn.entity.machine.MachineEntityJcloudsRebindTest.testRebind(MachineEntityJcloudsRebindTest.java:103)


Results :

Failed tests: 
  MachineEntityJcloudsRebindTest.testRebind:103->assertRecordedSshCmdContainsEventually:117 failed succeeds-eventually, 75 attempts, 30002ms elapsed: AssertionError: Commands (/etc/os-release) not contain in [ExecCmd{summaryForLogging=, commands=[cat /proc/uptime], env={}, constructorProps={user=root, host=173.194.32.1, sshToolClass=org.apache.brooklyn.util.core.internal.ssh.RecordingSshTool, password=JXhGBz94BAj1, spec.original=jclouds:aws-ec2:us-east-1, spec.named.name=jclouds:aws-ec2:us-east-1, spec.final=jclouds:aws-ec2:us-east-1, privateKeyData=null, port=22, detectMachineDetails=true, privateAddresses=[172.168.10.1], polls={org.apache.brooklyn.feed.AbstractCommandFeed$CommandPollIdentifier@f2ebe89b=[ssh[uptime->machine.loadAverage]], org.apache.brooklyn.feed.AbstractCommandFeed$CommandPollIdentifier@16dc7ddc=[ssh[ps -A -o pcpu->machine.cpu]], org.apache.brooklyn.feed.AbstractCommandFeed$CommandPollIdentifier@f956448c=[ssh[free | grep Mem:->machine.memory.used], ssh[free | grep Mem:->machine.memory.free], ssh[free | grep Mem:->machine.memory.total]], org.apache.brooklyn.feed.AbstractCommandFeed$CommandPollIdentifier@5a4b89c7=[ssh[cat /proc/uptime->machine.uptime]]}, machine=null, execAsCommand=false, feed.onlyIfServiceUp=false}, props={err=org.apache.brooklyn.util.stream.LoggingOutputStream@2484dbb7, machine=null, execAsCommand=false, polls={org.apache.brooklyn.feed.AbstractCommandFeed$CommandPollIdentifier@f2ebe89b=[ssh[uptime->machine.loadAverage]], org.apache.brooklyn.feed.AbstractCommandFeed$CommandPollIdentifier@16dc7ddc=[ssh[ps -A -o pcpu->machine.cpu]], org.apache.brooklyn.feed.AbstractCommandFeed$CommandPollIdentifier@f956448c=[ssh[free | grep Mem:->machine.memory.used], ssh[free | grep Mem:->machine.memory.free], ssh[free | grep Mem:->machine.memory.total]], org.apache.brooklyn.feed.AbstractCommandFeed$CommandPollIdentifier@5a4b89c7=[ssh[cat /proc/uptime->machine.uptime]]}, feed.onlyIfServiceUp=false, noExtraOutput=true, out=org.apache.brooklyn.util.stream.LoggingOutputStream@111cba40, summary=ssh-feed}}, ExecCmd{summaryForLogging=, commands=[free | grep Mem:], env={}, constructorProps={user=root, host=173.194.32.1, sshToolClass=org.apache.brooklyn.util.core.internal.ssh.RecordingSshTool, password=JXhGBz94BAj1, spec.original=jclouds:aws-ec2:us-east-1, spec.named.name=jclouds:aws-ec2:us-east-1, spec.final=jclouds:aws-ec2:us-east-1, privateKeyData=null, port=22, detectMachineDetails=true, privateAddresses=[172.168.10.1], polls={org.apache.brooklyn.feed.AbstractCommandFeed$CommandPollIdentifier@f2ebe89b=[ssh[uptime->machine.loadAverage]], org.apache.brooklyn.feed.AbstractCommandFeed$CommandPollIdentifier@16dc7ddc=[ssh[ps -A -o pcpu->machine.cpu]], org.apache.brooklyn.feed.AbstractCommandFeed$CommandPollIdentifier@f956448c=[ssh[free | grep Mem:->machine.memory.used], ssh[free | grep Mem:->machine.memory.free], ssh[free | grep Mem:->machine.memory.total]], org.apache.brooklyn.feed.AbstractCommandFeed$CommandPollIdentifier@5a4b89c7=[ssh[cat /proc/uptime->machine.uptime]]}, machine=null, execAsCommand=false, feed.onlyIfServiceUp=false}, props={err=org.apache.brooklyn.util.stream.LoggingOutputStream@48e41b5d, machine=null, execAsCommand=false, polls={org.apache.brooklyn.feed.AbstractCommandFeed$CommandPollIdentifier@f2ebe89b=[ssh[uptime->machine.loadAverage]], org.apache.brooklyn.feed.AbstractCommandFeed$CommandPollIdentifier@16dc7ddc=[ssh[ps -A -o pcpu->machine.cpu]], org.apache.brooklyn.feed.AbstractCommandFeed$CommandPollIdentifier@f956448c=[ssh[free | grep Mem:->machine.memory.used], ssh[free | grep Mem:->machine.memory.free], ssh[free | grep Mem:->machine.memory.total]], org.apache.brooklyn.feed.AbstractCommandFeed$CommandPollIdentifier@5a4b89c7=[ssh[cat /proc/uptime->machine.uptime]]}, feed.onlyIfServiceUp=false, noExtraOutput=true, out=org.apache.brooklyn.util.stream.LoggingOutputStream@51e8d066, summary=ssh-feed}}, ExecCmd{summaryForLogging=, commands=[uptime], env={}, constructorProps={user=root, host=173.194.32.1, sshToolClass=org.apache.brooklyn.util.core.internal.ssh.RecordingSshTool, password=JXhGBz94BAj1, spec.original=jclouds:aws-ec2:us-east-1, spec.named.name=jclouds:aws-ec2:us-east-1, spec.final=jclouds:aws-ec2:us-east-1, privateKeyData=null, port=22, detectMachineDetails=true, privateAddresses=[172.168.10.1], polls={org.apache.brooklyn.feed.AbstractCommandFeed$CommandPollIdentifier@f2ebe89b=[ssh[uptime->machine.loadAverage]], org.apache.brooklyn.feed.AbstractCommandFeed$CommandPollIdentifier@16dc7ddc=[ssh[ps -A -o pcpu->machine.cpu]], org.apache.brooklyn.feed.AbstractCommandFeed$CommandPollIdentifier@f956448c=[ssh[free | grep Mem:->machine.memory.used], ssh[free | grep Mem:->machine.memory.free], ssh[free | grep Mem:->machine.memory.total]], org.apache.brooklyn.feed.AbstractCommandFeed$CommandPollIdentifier@5a4b89c7=[ssh[cat /proc/uptime->machine.uptime]]}, machine=null, execAsCommand=false, feed.onlyIfServiceUp=false}, props={err=org.apache.brooklyn.util.stream.LoggingOutputStream@5333f08f, machine=null, execAsCommand=false, polls={org.apache.brooklyn.feed.AbstractCommandFeed$CommandPollIdentifier@f2ebe89b=[ssh[uptime->machine.loadAverage]], org.apache.brooklyn.feed.AbstractCommandFeed$CommandPollIdentifier@16dc7ddc=[ssh[ps -A -o pcpu->machine.cpu]], org.apache.brooklyn.feed.AbstractCommandFeed$CommandPollIdentifier@f956448c=[ssh[free | grep Mem:->machine.memory.used], ssh[free | grep Mem:->machine.memory.free], ssh[free | grep Mem:->machine.memory.total]], org.apache.brooklyn.feed.AbstractCommandFeed$CommandPollIdentifier@5a4b89c7=[ssh[cat /proc/uptime->machine.uptime]]}, feed.onlyIfServiceUp=false, noExtraOutput=true, out=org.apache.brooklyn.util.stream.LoggingOutputStream@27898e13, summary=ssh-feed}}, ExecCmd{summaryForLogging=, commands=[ps -A -o pcpu], env={}, constructorProps={user=root, host=173.194.32.1, sshToolClass=org.apache.brooklyn.util.core.internal.ssh.RecordingSshTool, password=JXhGBz94BAj1, spec.original=jclouds:aws-ec2:us-east-1, spec.named.name=jclouds:aws-ec2:us-east-1, spec.final=jclouds:aws-ec2:us-east-1, privateKeyData=null, port=22, detectMachineDetails=true, privateAddresses=[172.168.10.1], polls={org.apache.brooklyn.feed.AbstractCommandFeed$CommandPollIdentifier@f2ebe89b=[ssh[uptime->machine.loadAverage]], org.apache.brooklyn.feed.AbstractCommandFeed$CommandPollIdentifier@16dc7ddc=[ssh[ps -A -o pcpu->machine.cpu]], org.apache.brooklyn.feed.AbstractCommandFeed$CommandPollIdentifier@f956448c=[ssh[free | grep Mem:->machine.memory.used], ssh[free | grep Mem:->machine.memory.free], ssh[free | grep Mem:->machine.memory.total]], org.apache.brooklyn.feed.AbstractCommandFeed$CommandPollIdentifier@5a4b89c7=[ssh[cat /proc/uptime->machine.uptime]]}, machine=null, execAsCommand=false, feed.onlyIfServiceUp=false}, props={err=org.apache.brooklyn.util.stream.LoggingOutputStream@4f5f474c, machine=null, execAsCommand=false, polls={org.apache.brooklyn.feed.AbstractCommandFeed$CommandPollIdentifier@f2ebe89b=[ssh[uptime->machine.loadAverage]], org.apache.brooklyn.feed.AbstractCommandFeed$CommandPollIdentifier@16dc7ddc=[ssh[ps -A -o pcpu->machine.cpu]], org.apache.brooklyn.feed.AbstractCommandFeed$CommandPollIdentifier@f956448c=[ssh[free | grep Mem:->machine.memory.used], ssh[free | grep Mem:->machine.memory.free], ssh[free | grep Mem:->machine.memory.total]], org.apache.brooklyn.feed.AbstractCommandFeed$CommandPollIdentifier@5a4b89c7=[ssh[cat /proc/uptime->machine.uptime]]}, feed.onlyIfServiceUp=false, noExtraOutput=true, out=org.apache.brooklyn.util.stream.LoggingOutputStream@58a3d521, summary=ssh-feed}}]

Tests run: 232, Failures: 1, Errors: 0, Skipped: 0

[INFO] ------------------------------------------------------------------------
[INFO] Reactor Summary:
[INFO] 
[INFO] Brooklyn Server Root ............................... SUCCESS [  0.998 s]
[INFO] Brooklyn Parent Project ............................ SUCCESS [  3.925 s]
[INFO] Brooklyn Test Support Utilities .................... SUCCESS [  6.879 s]
[INFO] Brooklyn Logback Includable Configuration .......... SUCCESS [  0.377 s]
[INFO] Brooklyn Common Utilities .......................... SUCCESS [ 25.265 s]
[INFO] Brooklyn API ....................................... SUCCESS [  1.504 s]
[INFO] CAMP Server Parent Project ......................... SUCCESS [  0.111 s]
[INFO] CAMP Base .......................................... SUCCESS [  3.171 s]
[INFO] Brooklyn Test Support .............................. SUCCESS [  0.790 s]
[INFO] Brooklyn REST Swagger Apidoc Utilities ............. SUCCESS [  6.891 s]
[INFO] Brooklyn Logback Configuration ..................... SUCCESS [  0.186 s]
[INFO] CAMP Server ........................................ SUCCESS [  8.904 s]
[INFO] Brooklyn Felix Runtime ............................. SUCCESS [  3.100 s]
[INFO] Brooklyn Groovy Utilities .......................... SUCCESS [  2.066 s]
[INFO] Brooklyn Core ...................................... SUCCESS [03:45 min]
[INFO] Brooklyn Policies .................................. SUCCESS [ 32.213 s]
[INFO] Brooklyn WinRM Software Entities ................... SUCCESS [ 14.663 s]
[INFO] Brooklyn Secure JMXMP Agent ........................ SUCCESS [  9.401 s]
[INFO] Brooklyn JMX RMI Agent ............................. SUCCESS [  0.371 s]
[INFO] Brooklyn Jclouds Location Targets .................. SUCCESS [ 55.299 s]
[INFO] Brooklyn Software Base ............................. FAILURE [01:51 min]
[INFO] Brooklyn CAMP ...................................... SKIPPED
[INFO] Brooklyn Launcher Common ........................... SKIPPED
[INFO] Brooklyn REST API .................................. SKIPPED
[INFO] Brooklyn REST Resources ............................ SKIPPED
[INFO] Brooklyn REST Server ............................... SKIPPED
[INFO] Brooklyn Launcher .................................. SKIPPED
[INFO] Brooklyn Container Location Targets ................ SKIPPED
[INFO] Brooklyn Command Line Interface .................... SKIPPED
[INFO] Brooklyn Test Framework ............................ SKIPPED
[INFO] Brooklyn OSGi init ................................. SKIPPED
[INFO] Brooklyn OSGi start ................................ SKIPPED
[INFO] Brooklyn Karaf ..................................... SKIPPED
[INFO] Jetty config fragment .............................. SKIPPED
[INFO] Apache Http Component extension .................... SKIPPED
[INFO] Brooklyn Karaf Features ............................ SKIPPED
[INFO] Brooklyn Karaf Shell Commands ...................... SKIPPED
[INFO] ------------------------------------------------------------------------
[INFO] BUILD FAILURE
[INFO] ------------------------------------------------------------------------
[INFO] Total time: 08:37 min
[INFO] Finished at: 2017-11-17T16:36:21Z
[INFO] Final Memory: 102M/798M
[INFO] ------------------------------------------------------------------------
[ERROR] Failed to execute goal org.apache.maven.plugins:maven-surefire-plugin:2.19.1:test (default-test) on project brooklyn-software-base: There are test failures.
[ERROR] 
[ERROR] Please refer to /usr/build/software/base/target/surefire-reports for the individual test results.
[ERROR] -> [Help 1]
[ERROR] 
[ERROR] To see the full stack trace of the errors, re-run Maven with the -e switch.
[ERROR] Re-run Maven using the -X switch to enable full debug logging.
[ERROR] 
[ERROR] For more information about the errors and possible solutions, please read the following articles:
[ERROR] [Help 1] http://cwiki.apache.org/confluence/display/MAVEN/MojoFailureException
[ERROR] 
[ERROR] After correcting the problems, you can resume the build with the command
[ERROR]   mvn <goals> -rf :brooklyn-software-base
Build step 'Execute shell' marked build as failure
Recording test results
TestNG Reports Processing: START
Looking for TestNG results report in workspace using pattern: **/testng-results.xml
Saving reports...
Processing '/x1/jenkins/jenkins-home/jobs/brooklyn-server-master-docker/builds/4/testng/testng-results-1.xml'
Processing '/x1/jenkins/jenkins-home/jobs/brooklyn-server-master-docker/builds/4/testng/testng-results-10.xml'
Processing '/x1/jenkins/jenkins-home/jobs/brooklyn-server-master-docker/builds/4/testng/testng-results-2.xml'
Processing '/x1/jenkins/jenkins-home/jobs/brooklyn-server-master-docker/builds/4/testng/testng-results-3.xml'
Processing '/x1/jenkins/jenkins-home/jobs/brooklyn-server-master-docker/builds/4/testng/testng-results-4.xml'
Processing '/x1/jenkins/jenkins-home/jobs/brooklyn-server-master-docker/builds/4/testng/testng-results-5.xml'
Processing '/x1/jenkins/jenkins-home/jobs/brooklyn-server-master-docker/builds/4/testng/testng-results-6.xml'
Processing '/x1/jenkins/jenkins-home/jobs/brooklyn-server-master-docker/builds/4/testng/testng-results-7.xml'
Processing '/x1/jenkins/jenkins-home/jobs/brooklyn-server-master-docker/builds/4/testng/testng-results-8.xml'
Processing '/x1/jenkins/jenkins-home/jobs/brooklyn-server-master-docker/builds/4/testng/testng-results-9.xml'
Processing '/x1/jenkins/jenkins-home/jobs/brooklyn-server-master-docker/builds/4/testng/testng-results.xml'
0.028752% of tests failed, which exceeded threshold of 0%. Marking build as UNSTABLE
TestNG Reports Processing: FINISH

Mime
View raw message