brooklyn-dev mailing list archives

Site index · List index
Message view « Date » · « Thread »
Top « Date » · « Thread »
From Apache Jenkins Server <jenk...@builds.apache.org>
Subject Build failed in Jenkins: brooklyn-server-master #763
Date Fri, 06 Oct 2017 13:32:51 GMT
See <https://builds.apache.org/job/brooklyn-server-master/763/display/redirect?page=changes>

Changes:

[duncan.godwin] Change version to 1.0.0-SNAPSHOT

------------------------------------------
[...truncated 3.69 MB...]
	at org.apache.brooklyn.core.mgmt.osgi.OsgiVersionMoreEntityTest.addItemFromCatalog(OsgiVersionMoreEntityTest.java:172)
	at org.apache.brooklyn.core.mgmt.osgi.OsgiVersionMoreEntityTest.addItemFromCatalog(OsgiVersionMoreEntityTest.java:167)
	at org.apache.brooklyn.core.mgmt.osgi.OsgiVersionMoreEntityTest.testMoreEntitiesV2ThenV1GivesV1(OsgiVersionMoreEntityTest.java:355)
Caused by: java.lang.IllegalStateException: Error in definition of org.apache.brooklyn.test.osgi.entities.more.MoreEntity:0.1.0:
Unable to load org.apache.brooklyn.test.osgi.entities.more.MoreEntity from [OSGi:org.apache.brooklyn.test.osgi.entities.more.MoreEntity:0.1.0[[CatalogBundleDto{symbolicName=null,
version=null, url=classpath:/brooklyn/osgi/brooklyn-test-osgi-more-entities_0.1.0.jar}]]]:
Unable to resolve class org.apache.brooklyn.test.osgi.entities.more.MoreEntity in CatalogBundleDto{symbolicName=null,
version=null, url=classpath:/brooklyn/osgi/brooklyn-test-osgi-more-entities_0.1.0.jar}: ClassNotFoundException:
org.apache.brooklyn.test.osgi.entities.more.MoreEntity: BundleException: Unable to resolve
org.apache.brooklyn.test.resources.osgi.brooklyn-test-osgi-more-entities [76](R 76.0): missing
requirement [org.apache.brooklyn.test.resources.osgi.brooklyn-test-osgi-more-entities [76](R
76.0)] osgi.wiring.package; (&(osgi.wiring.package=org.apache.brooklyn.api.effector)(version>=0.12.0)(!(version>=1.0.0)))
Unresolved requirements: [[org.apache.brooklyn.test.resources.osgi.brooklyn-test-osgi-more-entities
[76](R 76.0)] osgi.wiring.package; (&(osgi.wiring.package=org.apache.brooklyn.api.effector)(version>=0.12.0)(!(version>=1.0.0)))]:
ClassNotFoundException: org.apache.brooklyn.test.osgi.entities.more.MoreEntity
	at org.apache.brooklyn.core.mgmt.osgi.OsgiVersionMoreEntityTest.addItemFromCatalog(OsgiVersionMoreEntityTest.java:172)
	at org.apache.brooklyn.core.mgmt.osgi.OsgiVersionMoreEntityTest.addItemFromCatalog(OsgiVersionMoreEntityTest.java:167)
	at org.apache.brooklyn.core.mgmt.osgi.OsgiVersionMoreEntityTest.testMoreEntitiesV2ThenV1GivesV1(OsgiVersionMoreEntityTest.java:355)
Caused by: org.apache.brooklyn.util.exceptions.PropagatedRuntimeException: 
	at org.apache.brooklyn.core.mgmt.osgi.OsgiVersionMoreEntityTest.addItemFromCatalog(OsgiVersionMoreEntityTest.java:172)
	at org.apache.brooklyn.core.mgmt.osgi.OsgiVersionMoreEntityTest.addItemFromCatalog(OsgiVersionMoreEntityTest.java:167)
	at org.apache.brooklyn.core.mgmt.osgi.OsgiVersionMoreEntityTest.testMoreEntitiesV2ThenV1GivesV1(OsgiVersionMoreEntityTest.java:355)
Caused by: org.apache.brooklyn.util.exceptions.PropagatedRuntimeException: Error in definition
of org.apache.brooklyn.test.osgi.entities.more.MoreEntity:0.1.0: Unable to load org.apache.brooklyn.test.osgi.entities.more.MoreEntity
from [OSGi:org.apache.brooklyn.test.osgi.entities.more.MoreEntity:0.1.0[[CatalogBundleDto{symbolicName=null,
version=null, url=classpath:/brooklyn/osgi/brooklyn-test-osgi-more-entities_0.1.0.jar}]]]:
Unable to resolve class org.apache.brooklyn.test.osgi.entities.more.MoreEntity in CatalogBundleDto{symbolicName=null,
version=null, url=classpath:/brooklyn/osgi/brooklyn-test-osgi-more-entities_0.1.0.jar}: ClassNotFoundException:
org.apache.brooklyn.test.osgi.entities.more.MoreEntity: BundleException: Unable to resolve
org.apache.brooklyn.test.resources.osgi.brooklyn-test-osgi-more-entities [76](R 76.0): missing
requirement [org.apache.brooklyn.test.resources.osgi.brooklyn-test-osgi-more-entities [76](R
76.0)] osgi.wiring.package; (&(osgi.wiring.package=org.apache.brooklyn.api.effector)(version>=0.12.0)(!(version>=1.0.0)))
Unresolved requirements: [[org.apache.brooklyn.test.resources.osgi.brooklyn-test-osgi-more-entities
[76](R 76.0)] osgi.wiring.package; (&(osgi.wiring.package=org.apache.brooklyn.api.effector)(version>=0.12.0)(!(version>=1.0.0)))]:
ClassNotFoundException: org.apache.brooklyn.test.osgi.entities.more.MoreEntity
	at org.apache.brooklyn.core.mgmt.osgi.OsgiVersionMoreEntityTest.addItemFromCatalog(OsgiVersionMoreEntityTest.java:172)
	at org.apache.brooklyn.core.mgmt.osgi.OsgiVersionMoreEntityTest.addItemFromCatalog(OsgiVersionMoreEntityTest.java:167)
	at org.apache.brooklyn.core.mgmt.osgi.OsgiVersionMoreEntityTest.testMoreEntitiesV2ThenV1GivesV1(OsgiVersionMoreEntityTest.java:355)
Caused by: java.lang.IllegalStateException: Unable to load org.apache.brooklyn.test.osgi.entities.more.MoreEntity
from [OSGi:org.apache.brooklyn.test.osgi.entities.more.MoreEntity:0.1.0[[CatalogBundleDto{symbolicName=null,
version=null, url=classpath:/brooklyn/osgi/brooklyn-test-osgi-more-entities_0.1.0.jar}]]]:
Unable to resolve class org.apache.brooklyn.test.osgi.entities.more.MoreEntity in CatalogBundleDto{symbolicName=null,
version=null, url=classpath:/brooklyn/osgi/brooklyn-test-osgi-more-entities_0.1.0.jar}: ClassNotFoundException:
org.apache.brooklyn.test.osgi.entities.more.MoreEntity: BundleException: Unable to resolve
org.apache.brooklyn.test.resources.osgi.brooklyn-test-osgi-more-entities [76](R 76.0): missing
requirement [org.apache.brooklyn.test.resources.osgi.brooklyn-test-osgi-more-entities [76](R
76.0)] osgi.wiring.package; (&(osgi.wiring.package=org.apache.brooklyn.api.effector)(version>=0.12.0)(!(version>=1.0.0)))
Unresolved requirements: [[org.apache.brooklyn.test.resources.osgi.brooklyn-test-osgi-more-entities
[76](R 76.0)] osgi.wiring.package; (&(osgi.wiring.package=org.apache.brooklyn.api.effector)(version>=0.12.0)(!(version>=1.0.0)))]:
ClassNotFoundException: org.apache.brooklyn.test.osgi.entities.more.MoreEntity
	at org.apache.brooklyn.core.mgmt.osgi.OsgiVersionMoreEntityTest.addItemFromCatalog(OsgiVersionMoreEntityTest.java:172)
	at org.apache.brooklyn.core.mgmt.osgi.OsgiVersionMoreEntityTest.addItemFromCatalog(OsgiVersionMoreEntityTest.java:167)
	at org.apache.brooklyn.core.mgmt.osgi.OsgiVersionMoreEntityTest.testMoreEntitiesV2ThenV1GivesV1(OsgiVersionMoreEntityTest.java:355)
Caused by: org.apache.brooklyn.util.exceptions.PropagatedRuntimeException: Unable to load
org.apache.brooklyn.test.osgi.entities.more.MoreEntity from [OSGi:org.apache.brooklyn.test.osgi.entities.more.MoreEntity:0.1.0[[CatalogBundleDto{symbolicName=null,
version=null, url=classpath:/brooklyn/osgi/brooklyn-test-osgi-more-entities_0.1.0.jar}]]]:
Unable to resolve class org.apache.brooklyn.test.osgi.entities.more.MoreEntity in CatalogBundleDto{symbolicName=null,
version=null, url=classpath:/brooklyn/osgi/brooklyn-test-osgi-more-entities_0.1.0.jar}: ClassNotFoundException:
org.apache.brooklyn.test.osgi.entities.more.MoreEntity: BundleException: Unable to resolve
org.apache.brooklyn.test.resources.osgi.brooklyn-test-osgi-more-entities [76](R 76.0): missing
requirement [org.apache.brooklyn.test.resources.osgi.brooklyn-test-osgi-more-entities [76](R
76.0)] osgi.wiring.package; (&(osgi.wiring.package=org.apache.brooklyn.api.effector)(version>=0.12.0)(!(version>=1.0.0)))
Unresolved requirements: [[org.apache.brooklyn.test.resources.osgi.brooklyn-test-osgi-more-entities
[76](R 76.0)] osgi.wiring.package; (&(osgi.wiring.package=org.apache.brooklyn.api.effector)(version>=0.12.0)(!(version>=1.0.0)))]:
ClassNotFoundException: org.apache.brooklyn.test.osgi.entities.more.MoreEntity
	at org.apache.brooklyn.core.mgmt.osgi.OsgiVersionMoreEntityTest.addItemFromCatalog(OsgiVersionMoreEntityTest.java:172)
	at org.apache.brooklyn.core.mgmt.osgi.OsgiVersionMoreEntityTest.addItemFromCatalog(OsgiVersionMoreEntityTest.java:167)
	at org.apache.brooklyn.core.mgmt.osgi.OsgiVersionMoreEntityTest.testMoreEntitiesV2ThenV1GivesV1(OsgiVersionMoreEntityTest.java:355)
Caused by: java.lang.IllegalStateException: Unable to resolve class org.apache.brooklyn.test.osgi.entities.more.MoreEntity
in CatalogBundleDto{symbolicName=null, version=null, url=classpath:/brooklyn/osgi/brooklyn-test-osgi-more-entities_0.1.0.jar}
	at org.apache.brooklyn.core.mgmt.osgi.OsgiVersionMoreEntityTest.addItemFromCatalog(OsgiVersionMoreEntityTest.java:172)
	at org.apache.brooklyn.core.mgmt.osgi.OsgiVersionMoreEntityTest.addItemFromCatalog(OsgiVersionMoreEntityTest.java:167)
	at org.apache.brooklyn.core.mgmt.osgi.OsgiVersionMoreEntityTest.testMoreEntitiesV2ThenV1GivesV1(OsgiVersionMoreEntityTest.java:355)
Caused by: org.apache.brooklyn.util.exceptions.PropagatedRuntimeException: ClassNotFoundException:
org.apache.brooklyn.test.osgi.entities.more.MoreEntity: BundleException: Unable to resolve
org.apache.brooklyn.test.resources.osgi.brooklyn-test-osgi-more-entities [76](R 76.0): missing
requirement [org.apache.brooklyn.test.resources.osgi.brooklyn-test-osgi-more-entities [76](R
76.0)] osgi.wiring.package; (&(osgi.wiring.package=org.apache.brooklyn.api.effector)(version>=0.12.0)(!(version>=1.0.0)))
Unresolved requirements: [[org.apache.brooklyn.test.resources.osgi.brooklyn-test-osgi-more-entities
[76](R 76.0)] osgi.wiring.package; (&(osgi.wiring.package=org.apache.brooklyn.api.effector)(version>=0.12.0)(!(version>=1.0.0)))]
	at org.apache.brooklyn.core.mgmt.osgi.OsgiVersionMoreEntityTest.addItemFromCatalog(OsgiVersionMoreEntityTest.java:172)
	at org.apache.brooklyn.core.mgmt.osgi.OsgiVersionMoreEntityTest.addItemFromCatalog(OsgiVersionMoreEntityTest.java:167)
	at org.apache.brooklyn.core.mgmt.osgi.OsgiVersionMoreEntityTest.testMoreEntitiesV2ThenV1GivesV1(OsgiVersionMoreEntityTest.java:355)
Caused by: java.lang.ClassNotFoundException: org.apache.brooklyn.test.osgi.entities.more.MoreEntity
	at org.apache.brooklyn.core.mgmt.osgi.OsgiVersionMoreEntityTest.addItemFromCatalog(OsgiVersionMoreEntityTest.java:172)
	at org.apache.brooklyn.core.mgmt.osgi.OsgiVersionMoreEntityTest.addItemFromCatalog(OsgiVersionMoreEntityTest.java:167)
	at org.apache.brooklyn.core.mgmt.osgi.OsgiVersionMoreEntityTest.testMoreEntitiesV2ThenV1GivesV1(OsgiVersionMoreEntityTest.java:355)
Caused by: org.osgi.framework.BundleException: Unable to resolve org.apache.brooklyn.test.resources.osgi.brooklyn-test-osgi-more-entities
[76](R 76.0): missing requirement [org.apache.brooklyn.test.resources.osgi.brooklyn-test-osgi-more-entities
[76](R 76.0)] osgi.wiring.package; (&(osgi.wiring.package=org.apache.brooklyn.api.effector)(version>=0.12.0)(!(version>=1.0.0)))
Unresolved requirements: [[org.apache.brooklyn.test.resources.osgi.brooklyn-test-osgi-more-entities
[76](R 76.0)] osgi.wiring.package; (&(osgi.wiring.package=org.apache.brooklyn.api.effector)(version>=0.12.0)(!(version>=1.0.0)))]
	at org.apache.brooklyn.core.mgmt.osgi.OsgiVersionMoreEntityTest.addItemFromCatalog(OsgiVersionMoreEntityTest.java:172)
	at org.apache.brooklyn.core.mgmt.osgi.OsgiVersionMoreEntityTest.addItemFromCatalog(OsgiVersionMoreEntityTest.java:167)
	at org.apache.brooklyn.core.mgmt.osgi.OsgiVersionMoreEntityTest.testMoreEntitiesV2ThenV1GivesV1(OsgiVersionMoreEntityTest.java:355)

testUnfazedByMoreEntitiesV1AndV2AndV2EvilTwin(org.apache.brooklyn.core.mgmt.osgi.OsgiVersionMoreEntityTest)
 Time elapsed: 0.039 sec  <<< FAILURE!
org.apache.brooklyn.util.exceptions.CompoundRuntimeException: Unable to instantiate v2; 2
errors including: Error in definition of v2:0.1.0: Unable to load org.apache.brooklyn.test.osgi.entities.more.MoreEntity
from [OSGi:v2:0.1.0[[CatalogBundleDto{symbolicName=null, version=null, url=classpath:/brooklyn/osgi/brooklyn-test-osgi-more-entities_0.2.0.jar},
CatalogBundleDto{symbolicName=null, version=null, url=classpath:/brooklyn/osgi/brooklyn-test-osgi-entities.jar}]]]:
Unable to resolve class org.apache.brooklyn.test.osgi.entities.more.MoreEntity: {CatalogBundleDto{symbolicName=null,
version=null, url=classpath:/brooklyn/osgi/brooklyn-test-osgi-more-entities_0.2.0.jar}=java.lang.ClassNotFoundException:
org.apache.brooklyn.test.osgi.entities.more.MoreEntity, CatalogBundleDto{symbolicName=null,
version=null, url=classpath:/brooklyn/osgi/brooklyn-test-osgi-entities.jar}=java.lang.ClassNotFoundException:
org.apache.brooklyn.test.osgi.entities.more.MoreEntity}; 2 errors including: ClassNotFoundException:
org.apache.brooklyn.test.osgi.entities.more.MoreEntity
	at org.apache.brooklyn.core.mgmt.osgi.OsgiVersionMoreEntityTest.addItemFromCatalog(OsgiVersionMoreEntityTest.java:172)
	at org.apache.brooklyn.core.mgmt.osgi.OsgiVersionMoreEntityTest.addItemFromCatalog(OsgiVersionMoreEntityTest.java:167)
	at org.apache.brooklyn.core.mgmt.osgi.OsgiVersionMoreEntityTest.testUnfazedByMoreEntitiesV1AndV2AndV2EvilTwin(OsgiVersionMoreEntityTest.java:437)
Caused by: java.lang.IllegalStateException: Error in definition of v2:0.1.0: Unable to load
org.apache.brooklyn.test.osgi.entities.more.MoreEntity from [OSGi:v2:0.1.0[[CatalogBundleDto{symbolicName=null,
version=null, url=classpath:/brooklyn/osgi/brooklyn-test-osgi-more-entities_0.2.0.jar}, CatalogBundleDto{symbolicName=null,
version=null, url=classpath:/brooklyn/osgi/brooklyn-test-osgi-entities.jar}]]]: Unable to
resolve class org.apache.brooklyn.test.osgi.entities.more.MoreEntity: {CatalogBundleDto{symbolicName=null,
version=null, url=classpath:/brooklyn/osgi/brooklyn-test-osgi-more-entities_0.2.0.jar}=java.lang.ClassNotFoundException:
org.apache.brooklyn.test.osgi.entities.more.MoreEntity, CatalogBundleDto{symbolicName=null,
version=null, url=classpath:/brooklyn/osgi/brooklyn-test-osgi-entities.jar}=java.lang.ClassNotFoundException:
org.apache.brooklyn.test.osgi.entities.more.MoreEntity}; 2 errors including: ClassNotFoundException:
org.apache.brooklyn.test.osgi.entities.more.MoreEntity
	at org.apache.brooklyn.core.mgmt.osgi.OsgiVersionMoreEntityTest.addItemFromCatalog(OsgiVersionMoreEntityTest.java:172)
	at org.apache.brooklyn.core.mgmt.osgi.OsgiVersionMoreEntityTest.addItemFromCatalog(OsgiVersionMoreEntityTest.java:167)
	at org.apache.brooklyn.core.mgmt.osgi.OsgiVersionMoreEntityTest.testUnfazedByMoreEntitiesV1AndV2AndV2EvilTwin(OsgiVersionMoreEntityTest.java:437)
Caused by: org.apache.brooklyn.util.exceptions.PropagatedRuntimeException: 
	at org.apache.brooklyn.core.mgmt.osgi.OsgiVersionMoreEntityTest.addItemFromCatalog(OsgiVersionMoreEntityTest.java:172)
	at org.apache.brooklyn.core.mgmt.osgi.OsgiVersionMoreEntityTest.addItemFromCatalog(OsgiVersionMoreEntityTest.java:167)
	at org.apache.brooklyn.core.mgmt.osgi.OsgiVersionMoreEntityTest.testUnfazedByMoreEntitiesV1AndV2AndV2EvilTwin(OsgiVersionMoreEntityTest.java:437)
Caused by: org.apache.brooklyn.util.exceptions.PropagatedRuntimeException: Error in definition
of v2:0.1.0: Unable to load org.apache.brooklyn.test.osgi.entities.more.MoreEntity from [OSGi:v2:0.1.0[[CatalogBundleDto{symbolicName=null,
version=null, url=classpath:/brooklyn/osgi/brooklyn-test-osgi-more-entities_0.2.0.jar}, CatalogBundleDto{symbolicName=null,
version=null, url=classpath:/brooklyn/osgi/brooklyn-test-osgi-entities.jar}]]]: Unable to
resolve class org.apache.brooklyn.test.osgi.entities.more.MoreEntity: {CatalogBundleDto{symbolicName=null,
version=null, url=classpath:/brooklyn/osgi/brooklyn-test-osgi-more-entities_0.2.0.jar}=java.lang.ClassNotFoundException:
org.apache.brooklyn.test.osgi.entities.more.MoreEntity, CatalogBundleDto{symbolicName=null,
version=null, url=classpath:/brooklyn/osgi/brooklyn-test-osgi-entities.jar}=java.lang.ClassNotFoundException:
org.apache.brooklyn.test.osgi.entities.more.MoreEntity}; 2 errors including: ClassNotFoundException:
org.apache.brooklyn.test.osgi.entities.more.MoreEntity
	at org.apache.brooklyn.core.mgmt.osgi.OsgiVersionMoreEntityTest.addItemFromCatalog(OsgiVersionMoreEntityTest.java:172)
	at org.apache.brooklyn.core.mgmt.osgi.OsgiVersionMoreEntityTest.addItemFromCatalog(OsgiVersionMoreEntityTest.java:167)
	at org.apache.brooklyn.core.mgmt.osgi.OsgiVersionMoreEntityTest.testUnfazedByMoreEntitiesV1AndV2AndV2EvilTwin(OsgiVersionMoreEntityTest.java:437)
Caused by: java.lang.IllegalStateException: Unable to load org.apache.brooklyn.test.osgi.entities.more.MoreEntity
from [OSGi:v2:0.1.0[[CatalogBundleDto{symbolicName=null, version=null, url=classpath:/brooklyn/osgi/brooklyn-test-osgi-more-entities_0.2.0.jar},
CatalogBundleDto{symbolicName=null, version=null, url=classpath:/brooklyn/osgi/brooklyn-test-osgi-entities.jar}]]]:
Unable to resolve class org.apache.brooklyn.test.osgi.entities.more.MoreEntity: {CatalogBundleDto{symbolicName=null,
version=null, url=classpath:/brooklyn/osgi/brooklyn-test-osgi-more-entities_0.2.0.jar}=java.lang.ClassNotFoundException:
org.apache.brooklyn.test.osgi.entities.more.MoreEntity, CatalogBundleDto{symbolicName=null,
version=null, url=classpath:/brooklyn/osgi/brooklyn-test-osgi-entities.jar}=java.lang.ClassNotFoundException:
org.apache.brooklyn.test.osgi.entities.more.MoreEntity}; 2 errors including: ClassNotFoundException:
org.apache.brooklyn.test.osgi.entities.more.MoreEntity
	at org.apache.brooklyn.core.mgmt.osgi.OsgiVersionMoreEntityTest.addItemFromCatalog(OsgiVersionMoreEntityTest.java:172)
	at org.apache.brooklyn.core.mgmt.osgi.OsgiVersionMoreEntityTest.addItemFromCatalog(OsgiVersionMoreEntityTest.java:167)
	at org.apache.brooklyn.core.mgmt.osgi.OsgiVersionMoreEntityTest.testUnfazedByMoreEntitiesV1AndV2AndV2EvilTwin(OsgiVersionMoreEntityTest.java:437)
Caused by: org.apache.brooklyn.util.exceptions.PropagatedRuntimeException: Unable to load
org.apache.brooklyn.test.osgi.entities.more.MoreEntity from [OSGi:v2:0.1.0[[CatalogBundleDto{symbolicName=null,
version=null, url=classpath:/brooklyn/osgi/brooklyn-test-osgi-more-entities_0.2.0.jar}, CatalogBundleDto{symbolicName=null,
version=null, url=classpath:/brooklyn/osgi/brooklyn-test-osgi-entities.jar}]]]: Unable to
resolve class org.apache.brooklyn.test.osgi.entities.more.MoreEntity: {CatalogBundleDto{symbolicName=null,
version=null, url=classpath:/brooklyn/osgi/brooklyn-test-osgi-more-entities_0.2.0.jar}=java.lang.ClassNotFoundException:
org.apache.brooklyn.test.osgi.entities.more.MoreEntity, CatalogBundleDto{symbolicName=null,
version=null, url=classpath:/brooklyn/osgi/brooklyn-test-osgi-entities.jar}=java.lang.ClassNotFoundException:
org.apache.brooklyn.test.osgi.entities.more.MoreEntity}; 2 errors including: ClassNotFoundException:
org.apache.brooklyn.test.osgi.entities.more.MoreEntity
	at org.apache.brooklyn.core.mgmt.osgi.OsgiVersionMoreEntityTest.addItemFromCatalog(OsgiVersionMoreEntityTest.java:172)
	at org.apache.brooklyn.core.mgmt.osgi.OsgiVersionMoreEntityTest.addItemFromCatalog(OsgiVersionMoreEntityTest.java:167)
	at org.apache.brooklyn.core.mgmt.osgi.OsgiVersionMoreEntityTest.testUnfazedByMoreEntitiesV1AndV2AndV2EvilTwin(OsgiVersionMoreEntityTest.java:437)
Caused by: java.lang.IllegalStateException: Unable to resolve class org.apache.brooklyn.test.osgi.entities.more.MoreEntity:
{CatalogBundleDto{symbolicName=null, version=null, url=classpath:/brooklyn/osgi/brooklyn-test-osgi-more-entities_0.2.0.jar}=java.lang.ClassNotFoundException:
org.apache.brooklyn.test.osgi.entities.more.MoreEntity, CatalogBundleDto{symbolicName=null,
version=null, url=classpath:/brooklyn/osgi/brooklyn-test-osgi-entities.jar}=java.lang.ClassNotFoundException:
org.apache.brooklyn.test.osgi.entities.more.MoreEntity}; 2 errors including: ClassNotFoundException:
org.apache.brooklyn.test.osgi.entities.more.MoreEntity
	at org.apache.brooklyn.core.mgmt.osgi.OsgiVersionMoreEntityTest.addItemFromCatalog(OsgiVersionMoreEntityTest.java:172)
	at org.apache.brooklyn.core.mgmt.osgi.OsgiVersionMoreEntityTest.addItemFromCatalog(OsgiVersionMoreEntityTest.java:167)
	at org.apache.brooklyn.core.mgmt.osgi.OsgiVersionMoreEntityTest.testUnfazedByMoreEntitiesV1AndV2AndV2EvilTwin(OsgiVersionMoreEntityTest.java:437)
Caused by: org.apache.brooklyn.util.exceptions.CompoundRuntimeException: Unable to resolve
class org.apache.brooklyn.test.osgi.entities.more.MoreEntity: {CatalogBundleDto{symbolicName=null,
version=null, url=classpath:/brooklyn/osgi/brooklyn-test-osgi-more-entities_0.2.0.jar}=java.lang.ClassNotFoundException:
org.apache.brooklyn.test.osgi.entities.more.MoreEntity, CatalogBundleDto{symbolicName=null,
version=null, url=classpath:/brooklyn/osgi/brooklyn-test-osgi-entities.jar}=java.lang.ClassNotFoundException:
org.apache.brooklyn.test.osgi.entities.more.MoreEntity}; 2 errors including: ClassNotFoundException:
org.apache.brooklyn.test.osgi.entities.more.MoreEntity
	at org.apache.brooklyn.core.mgmt.osgi.OsgiVersionMoreEntityTest.addItemFromCatalog(OsgiVersionMoreEntityTest.java:172)
	at org.apache.brooklyn.core.mgmt.osgi.OsgiVersionMoreEntityTest.addItemFromCatalog(OsgiVersionMoreEntityTest.java:167)
	at org.apache.brooklyn.core.mgmt.osgi.OsgiVersionMoreEntityTest.testUnfazedByMoreEntitiesV1AndV2AndV2EvilTwin(OsgiVersionMoreEntityTest.java:437)
Caused by: java.lang.ClassNotFoundException: org.apache.brooklyn.test.osgi.entities.more.MoreEntity
	at org.apache.brooklyn.core.mgmt.osgi.OsgiVersionMoreEntityTest.addItemFromCatalog(OsgiVersionMoreEntityTest.java:172)
	at org.apache.brooklyn.core.mgmt.osgi.OsgiVersionMoreEntityTest.addItemFromCatalog(OsgiVersionMoreEntityTest.java:167)
	at org.apache.brooklyn.core.mgmt.osgi.OsgiVersionMoreEntityTest.testUnfazedByMoreEntitiesV1AndV2AndV2EvilTwin(OsgiVersionMoreEntityTest.java:437)
Caused by: org.osgi.framework.BundleException: Unable to resolve org.apache.brooklyn.test.resources.osgi.brooklyn-test-osgi-more-entities
[72](R 72.0): missing requirement [org.apache.brooklyn.test.resources.osgi.brooklyn-test-osgi-more-entities
[72](R 72.0)] osgi.wiring.package; (&(osgi.wiring.package=org.apache.brooklyn.api.catalog)(version>=0.12.0)(!(version>=1.0.0)))
Unresolved requirements: [[org.apache.brooklyn.test.resources.osgi.brooklyn-test-osgi-more-entities
[72](R 72.0)] osgi.wiring.package; (&(osgi.wiring.package=org.apache.brooklyn.api.catalog)(version>=0.12.0)(!(version>=1.0.0)))]
	at org.apache.brooklyn.core.mgmt.osgi.OsgiVersionMoreEntityTest.addItemFromCatalog(OsgiVersionMoreEntityTest.java:172)
	at org.apache.brooklyn.core.mgmt.osgi.OsgiVersionMoreEntityTest.addItemFromCatalog(OsgiVersionMoreEntityTest.java:167)
	at org.apache.brooklyn.core.mgmt.osgi.OsgiVersionMoreEntityTest.testUnfazedByMoreEntitiesV1AndV2AndV2EvilTwin(OsgiVersionMoreEntityTest.java:437)

2017-10-06 13:31:17,672 INFO  Brooklyn shutdown: stopping entities [TestEntityImpl{id=kb211vl5e6},
TestEntityImpl{id=jvps21dbm0}, BlockingEntityImpl{id=nmp40rqw4x}]

Results :

Failed tests: 
  ClassLoaderFromStackOfBrooklynClassLoadingContextTest.testLoadClassFromBundle:74->assertLoads:123
» ClassNotFound
  OsgiStandaloneTest.testBootBundle:65 » ClassNotFound org.apache.brooklyn.test....
  OsgiStandaloneTest.testLoadOsgiBundleDependencies:152 » ClassNotFound org.apac...
  OsgiVersionMoreEntityTest.testEntityProxy:115 » ClassNotFound org.apache.brook...
  OsgiVersionMoreEntityTest.testMoreEntitiesV1:228->addItemFromCatalog:167->addItemFromCatalog:172
» CompoundRuntime
  OsgiVersionMoreEntityTest.testMoreEntitiesV1Policy:255->addItemFromCatalog:167->addItemFromCatalog:172
» CompoundRuntime
  OsgiVersionMoreEntityTest.testMoreEntitiesV1ThenV2GivesV2:333->addItemFromCatalog:167->addItemFromCatalog:172
» CompoundRuntime
  OsgiVersionMoreEntityTest.testMoreEntitiesV2:305->addItemFromCatalog:167->addItemFromCatalog:172
» CompoundRuntime
  OsgiVersionMoreEntityTest.testMoreEntitiesV2ThenV1GivesV1:355->addItemFromCatalog:167->addItemFromCatalog:172
» CompoundRuntime
  OsgiVersionMoreEntityTest.testUnfazedByMoreEntitiesV1AndV2AndV2EvilTwin:437->addItemFromCatalog:167->addItemFromCatalog:172
» CompoundRuntime
  XmlMementoSerializerTest.testEntitySpecFromOsgi:385 » CompoundRuntime Unable t...
  XmlMementoSerializerTest.testNoRenameOsgiClass:456 » ClassNotFound com.example...
  XmlMementoSerializerTest.testOsgiBundleNamePrefixIncluded:419 » ClassNotFound ...
  XmlMementoSerializerTest.testRenamedOsgiClassMovedBundle:486 » ClassNotFound c...
  XmlMementoSerializerTest.testRenamedOsgiClassWithoutBundlePrefixInRename:517 » ClassNotFound
  ActivePartialRebindVersionTest.testSwitchingVersions:57 » CompoundRuntime Unab...
  ActivePartialRebindVersionTest.testSwitchingVersionsInCluster:96 » CompoundRuntime
  ClassLoaderUtilsTest.testLoadClassInOsgi:113 » ClassNotFound org.apache.brookl...
  ClassLoaderUtilsTest.testLoadClassInOsgiWhiteListWithInvalidBundlePresent:197 » ClassNotFound
  ClassLoaderUtilsTest.testLoadJustOneClassInOsgiWhiteList:137 » ClassNotFound o...
  ClassLoaderUtilsTest.testVariousLoadersLoadClassInOsgiWhiteList:161 » ClassNotFound

Tests run: 2252, Failures: 21, Errors: 0, Skipped: 0

[JENKINS] Recording test results
[INFO] ------------------------------------------------------------------------
[INFO] Reactor Summary:
[INFO] 
[INFO] Brooklyn Server Root ............................... SUCCESS [  4.587 s]
[INFO] Brooklyn Parent Project ............................ SUCCESS [  4.784 s]
[INFO] Brooklyn Test Support Utilities .................... SUCCESS [  8.693 s]
[INFO] Brooklyn Logback Includable Configuration .......... SUCCESS [  3.794 s]
[INFO] Brooklyn Common Utilities .......................... SUCCESS [ 35.613 s]
[INFO] Brooklyn API ....................................... SUCCESS [  4.960 s]
[INFO] CAMP Server Parent Project ......................... SUCCESS [  2.259 s]
[INFO] CAMP Base .......................................... SUCCESS [  6.487 s]
[INFO] Brooklyn Test Support .............................. SUCCESS [  4.483 s]
[INFO] Brooklyn REST Swagger Apidoc Utilities ............. SUCCESS [  4.438 s]
[INFO] Brooklyn Logback Configuration ..................... SUCCESS [  3.621 s]
[INFO] CAMP Server ........................................ SUCCESS [  8.989 s]
[INFO] Brooklyn Felix Runtime ............................. SUCCESS [ 19.937 s]
[INFO] Brooklyn Groovy Utilities .......................... SUCCESS [  6.590 s]
[INFO] Brooklyn Core ...................................... FAILURE [03:54 min]
[INFO] Brooklyn Policies .................................. SKIPPED
[INFO] Brooklyn WinRM Software Entities ................... SKIPPED
[INFO] Brooklyn Secure JMXMP Agent ........................ SKIPPED
[INFO] Brooklyn JMX RMI Agent ............................. SKIPPED
[INFO] Brooklyn Jclouds Location Targets .................. SKIPPED
[INFO] Brooklyn Software Base ............................. SKIPPED
[INFO] Brooklyn CAMP ...................................... SKIPPED
[INFO] Brooklyn Launcher Common ........................... SKIPPED
[INFO] Brooklyn REST API .................................. SKIPPED
[INFO] Brooklyn REST Resources ............................ SKIPPED
[INFO] Brooklyn REST Server ............................... SKIPPED
[INFO] Brooklyn Launcher .................................. SKIPPED
[INFO] Brooklyn Container Location Targets ................ SKIPPED
[INFO] Brooklyn Command Line Interface .................... SKIPPED
[INFO] Brooklyn Test Framework ............................ SKIPPED
[INFO] Brooklyn OSGi init ................................. SKIPPED
[INFO] Brooklyn OSGi start ................................ SKIPPED
[INFO] Brooklyn Karaf ..................................... SKIPPED
[INFO] Jetty config fragment .............................. SKIPPED
[INFO] Apache Http Component extension .................... SKIPPED
[INFO] Brooklyn Karaf Features ............................ SKIPPED
[INFO] Brooklyn Karaf Shell Commands ...................... SKIPPED
[INFO] ------------------------------------------------------------------------
[INFO] BUILD FAILURE
[INFO] ------------------------------------------------------------------------
[INFO] Total time: 07:04 min
[INFO] Finished at: 2017-10-06T13:31:56+00:00
[INFO] Final Memory: 79M/770M
[INFO] ------------------------------------------------------------------------
[ERROR] Failed to execute goal org.apache.maven.plugins:maven-surefire-plugin:2.19.1:test
(default-test) on project brooklyn-core: There are test failures.
[ERROR] 
[ERROR] Please refer to <https://builds.apache.org/job/brooklyn-server-master/ws/core/target/surefire-reports>
for the individual test results.
[ERROR] -> [Help 1]
[ERROR] 
[ERROR] To see the full stack trace of the errors, re-run Maven with the -e switch.
[ERROR] Re-run Maven using the -X switch to enable full debug logging.
[ERROR] 
[ERROR] For more information about the errors and possible solutions, please read the following
articles:
[ERROR] [Help 1] http://cwiki.apache.org/confluence/display/MAVEN/MojoFailureException
[ERROR] 
[ERROR] After correcting the problems, you can resume the build with the command
[ERROR]   mvn <goals> -rf :brooklyn-core
[JENKINS] Archiving <https://builds.apache.org/job/brooklyn-server-master/ws/camp/pom.xml>
to org.apache.brooklyn.camp/camp-parent/1.0.0-SNAPSHOT/camp-parent-1.0.0-SNAPSHOT.pom
[JENKINS] Archiving <https://builds.apache.org/job/brooklyn-server-master/ws/utils/rt-felix/pom.xml>
to org.apache.brooklyn/brooklyn-rt-felix/1.0.0-SNAPSHOT/brooklyn-rt-felix-1.0.0-SNAPSHOT.pom
[JENKINS] Archiving <https://builds.apache.org/job/brooklyn-server-master/ws/utils/rt-felix/target/brooklyn-rt-felix-1.0.0-SNAPSHOT.jar>
to org.apache.brooklyn/brooklyn-rt-felix/1.0.0-SNAPSHOT/brooklyn-rt-felix-1.0.0-SNAPSHOT.jar
[JENKINS] Archiving <https://builds.apache.org/job/brooklyn-server-master/ws/utils/rt-felix/target/brooklyn-rt-felix-1.0.0-SNAPSHOT-tests.jar>
to org.apache.brooklyn/brooklyn-rt-felix/1.0.0-SNAPSHOT/brooklyn-rt-felix-1.0.0-SNAPSHOT-tests.jar
[JENKINS] Archiving <https://builds.apache.org/job/brooklyn-server-master/ws/utils/rt-felix/target/brooklyn-rt-felix-1.0.0-SNAPSHOT-sources.jar>
to org.apache.brooklyn/brooklyn-rt-felix/1.0.0-SNAPSHOT/brooklyn-rt-felix-1.0.0-SNAPSHOT-sources.jar
[JENKINS] Archiving <https://builds.apache.org/job/brooklyn-server-master/ws/utils/rt-felix/target/brooklyn-rt-felix-1.0.0-SNAPSHOT-test-sources.jar>
to org.apache.brooklyn/brooklyn-rt-felix/1.0.0-SNAPSHOT/brooklyn-rt-felix-1.0.0-SNAPSHOT-test-sources.jar
[JENKINS] Archiving <https://builds.apache.org/job/brooklyn-server-master/ws/test-framework/pom.xml>
to org.apache.brooklyn/brooklyn-test-framework/1.0.0-SNAPSHOT/brooklyn-test-framework-1.0.0-SNAPSHOT.pom
[JENKINS] Archiving <https://builds.apache.org/job/brooklyn-server-master/ws/core/pom.xml>
to org.apache.brooklyn/brooklyn-core/1.0.0-SNAPSHOT/brooklyn-core-1.0.0-SNAPSHOT.pom
[JENKINS] Archiving <https://builds.apache.org/job/brooklyn-server-master/ws/camp/camp-server/pom.xml>
to org.apache.brooklyn.camp/camp-server/1.0.0-SNAPSHOT/camp-server-1.0.0-SNAPSHOT.pom
[JENKINS] Archiving <https://builds.apache.org/job/brooklyn-server-master/ws/camp/camp-server/target/camp-server-1.0.0-SNAPSHOT.jar>
to org.apache.brooklyn.camp/camp-server/1.0.0-SNAPSHOT/camp-server-1.0.0-SNAPSHOT.jar
[JENKINS] Archiving <https://builds.apache.org/job/brooklyn-server-master/ws/camp/camp-server/target/camp-server-1.0.0-SNAPSHOT-tests.jar>
to org.apache.brooklyn.camp/camp-server/1.0.0-SNAPSHOT/camp-server-1.0.0-SNAPSHOT-tests.jar
[JENKINS] Archiving <https://builds.apache.org/job/brooklyn-server-master/ws/camp/camp-server/target/camp-server-1.0.0-SNAPSHOT-sources.jar>
to org.apache.brooklyn.camp/camp-server/1.0.0-SNAPSHOT/camp-server-1.0.0-SNAPSHOT-sources.jar
[JENKINS] Archiving <https://builds.apache.org/job/brooklyn-server-master/ws/camp/camp-server/target/camp-server-1.0.0-SNAPSHOT-test-sources.jar>
to org.apache.brooklyn.camp/camp-server/1.0.0-SNAPSHOT/camp-server-1.0.0-SNAPSHOT-test-sources.jar
[JENKINS] Archiving <https://builds.apache.org/job/brooklyn-server-master/ws/launcher/pom.xml>
to org.apache.brooklyn/brooklyn-launcher/1.0.0-SNAPSHOT/brooklyn-launcher-1.0.0-SNAPSHOT.pom
[JENKINS] Archiving <https://builds.apache.org/job/brooklyn-server-master/ws/karaf/pom.xml>
to org.apache.brooklyn/brooklyn-karaf/1.0.0-SNAPSHOT/brooklyn-karaf-1.0.0-SNAPSHOT.pom
[JENKINS] Archiving <https://builds.apache.org/job/brooklyn-server-master/ws/karaf/httpcomponent-extension/pom.xml>
to org.apache.brooklyn/brooklyn-karaf-httpcomponents-extension/1.0.0-SNAPSHOT/brooklyn-karaf-httpcomponents-extension-1.0.0-SNAPSHOT.pom
[JENKINS] Archiving <https://builds.apache.org/job/brooklyn-server-master/ws/locations/container/pom.xml>
to org.apache.brooklyn/brooklyn-locations-container/1.0.0-SNAPSHOT/brooklyn-locations-container-1.0.0-SNAPSHOT.pom
[JENKINS] Archiving <https://builds.apache.org/job/brooklyn-server-master/ws/utils/test-support/pom.xml>
to org.apache.brooklyn/brooklyn-utils-test-support/1.0.0-SNAPSHOT/brooklyn-utils-test-support-1.0.0-SNAPSHOT.pom
[JENKINS] Archiving <https://builds.apache.org/job/brooklyn-server-master/ws/utils/test-support/target/brooklyn-utils-test-support-1.0.0-SNAPSHOT.jar>
to org.apache.brooklyn/brooklyn-utils-test-support/1.0.0-SNAPSHOT/brooklyn-utils-test-support-1.0.0-SNAPSHOT.jar
[JENKINS] Archiving <https://builds.apache.org/job/brooklyn-server-master/ws/utils/test-support/target/brooklyn-utils-test-support-1.0.0-SNAPSHOT-sources.jar>
to org.apache.brooklyn/brooklyn-utils-test-support/1.0.0-SNAPSHOT/brooklyn-utils-test-support-1.0.0-SNAPSHOT-sources.jar
[JENKINS] Archiving <https://builds.apache.org/job/brooklyn-server-master/ws/utils/test-support/target/brooklyn-utils-test-support-1.0.0-SNAPSHOT-test-sources.jar>
to org.apache.brooklyn/brooklyn-utils-test-support/1.0.0-SNAPSHOT/brooklyn-utils-test-support-1.0.0-SNAPSHOT-test-sources.jar
[JENKINS] Archiving <https://builds.apache.org/job/brooklyn-server-master/ws/software/base/pom.xml>
to org.apache.brooklyn/brooklyn-software-base/1.0.0-SNAPSHOT/brooklyn-software-base-1.0.0-SNAPSHOT.pom
[JENKINS] Archiving <https://builds.apache.org/job/brooklyn-server-master/ws/utils/groovy/pom.xml>
to org.apache.brooklyn/brooklyn-utils-groovy/1.0.0-SNAPSHOT/brooklyn-utils-groovy-1.0.0-SNAPSHOT.pom
[JENKINS] Archiving <https://builds.apache.org/job/brooklyn-server-master/ws/utils/groovy/target/brooklyn-utils-groovy-1.0.0-SNAPSHOT.jar>
to org.apache.brooklyn/brooklyn-utils-groovy/1.0.0-SNAPSHOT/brooklyn-utils-groovy-1.0.0-SNAPSHOT.jar
[JENKINS] Archiving <https://builds.apache.org/job/brooklyn-server-master/ws/utils/groovy/target/brooklyn-utils-groovy-1.0.0-SNAPSHOT-tests.jar>
to org.apache.brooklyn/brooklyn-utils-groovy/1.0.0-SNAPSHOT/brooklyn-utils-groovy-1.0.0-SNAPSHOT-tests.jar
[JENKINS] Archiving <https://builds.apache.org/job/brooklyn-server-master/ws/utils/groovy/target/brooklyn-utils-groovy-1.0.0-SNAPSHOT-sources.jar>
to org.apache.brooklyn/brooklyn-utils-groovy/1.0.0-SNAPSHOT/brooklyn-utils-groovy-1.0.0-SNAPSHOT-sources.jar
[JENKINS] Archiving <https://builds.apache.org/job/brooklyn-server-master/ws/utils/groovy/target/brooklyn-utils-groovy-1.0.0-SNAPSHOT-test-sources.jar>
to org.apache.brooklyn/brooklyn-utils-groovy/1.0.0-SNAPSHOT/brooklyn-utils-groovy-1.0.0-SNAPSHOT-test-sources.jar
[JENKINS] Archiving <https://builds.apache.org/job/brooklyn-server-master/ws/utils/rest-swagger/pom.xml>
to org.apache.brooklyn/brooklyn-utils-rest-swagger/1.0.0-SNAPSHOT/brooklyn-utils-rest-swagger-1.0.0-SNAPSHOT.pom
[JENKINS] Archiving <https://builds.apache.org/job/brooklyn-server-master/ws/utils/rest-swagger/target/brooklyn-utils-rest-swagger-1.0.0-SNAPSHOT.jar>
to org.apache.brooklyn/brooklyn-utils-rest-swagger/1.0.0-SNAPSHOT/brooklyn-utils-rest-swagger-1.0.0-SNAPSHOT.jar
[JENKINS] Archiving <https://builds.apache.org/job/brooklyn-server-master/ws/utils/rest-swagger/target/brooklyn-utils-rest-swagger-1.0.0-SNAPSHOT-sources.jar>
to org.apache.brooklyn/brooklyn-utils-rest-swagger/1.0.0-SNAPSHOT/brooklyn-utils-rest-swagger-1.0.0-SNAPSHOT-sources.jar
[JENKINS] Archiving <https://builds.apache.org/job/brooklyn-server-master/ws/utils/rest-swagger/target/brooklyn-utils-rest-swagger-1.0.0-SNAPSHOT-test-sources.jar>
to org.apache.brooklyn/brooklyn-utils-rest-swagger/1.0.0-SNAPSHOT/brooklyn-utils-rest-swagger-1.0.0-SNAPSHOT-test-sources.jar
[JENKINS] Archiving <https://builds.apache.org/job/brooklyn-server-master/ws/launcher-common/pom.xml>
to org.apache.brooklyn/brooklyn-launcher-common/1.0.0-SNAPSHOT/brooklyn-launcher-common-1.0.0-SNAPSHOT.pom
[JENKINS] Archiving <https://builds.apache.org/job/brooklyn-server-master/ws/camp/camp-base/pom.xml>
to org.apache.brooklyn.camp/camp-base/1.0.0-SNAPSHOT/camp-base-1.0.0-SNAPSHOT.pom
[JENKINS] Archiving <https://builds.apache.org/job/brooklyn-server-master/ws/camp/camp-base/target/camp-base-1.0.0-SNAPSHOT.jar>
to org.apache.brooklyn.camp/camp-base/1.0.0-SNAPSHOT/camp-base-1.0.0-SNAPSHOT.jar
[JENKINS] Archiving <https://builds.apache.org/job/brooklyn-server-master/ws/camp/camp-base/target/camp-base-1.0.0-SNAPSHOT-tests.jar>
to org.apache.brooklyn.camp/camp-base/1.0.0-SNAPSHOT/camp-base-1.0.0-SNAPSHOT-tests.jar
[JENKINS] Archiving <https://builds.apache.org/job/brooklyn-server-master/ws/camp/camp-base/target/camp-base-1.0.0-SNAPSHOT-sources.jar>
to org.apache.brooklyn.camp/camp-base/1.0.0-SNAPSHOT/camp-base-1.0.0-SNAPSHOT-sources.jar
[JENKINS] Archiving <https://builds.apache.org/job/brooklyn-server-master/ws/camp/camp-base/target/camp-base-1.0.0-SNAPSHOT-test-sources.jar>
to org.apache.brooklyn.camp/camp-base/1.0.0-SNAPSHOT/camp-base-1.0.0-SNAPSHOT-test-sources.jar
[JENKINS] Archiving <https://builds.apache.org/job/brooklyn-server-master/ws/camp/camp-brooklyn/pom.xml>
to org.apache.brooklyn/brooklyn-camp/1.0.0-SNAPSHOT/brooklyn-camp-1.0.0-SNAPSHOT.pom
[JENKINS] Archiving <https://builds.apache.org/job/brooklyn-server-master/ws/karaf/jetty-config/pom.xml>
to org.apache.brooklyn/brooklyn-karaf-jetty-config/1.0.0-SNAPSHOT/brooklyn-karaf-jetty-config-1.0.0-SNAPSHOT.pom
[JENKINS] Archiving <https://builds.apache.org/job/brooklyn-server-master/ws/server-cli/pom.xml>
to org.apache.brooklyn/brooklyn-cli/1.0.0-SNAPSHOT/brooklyn-cli-1.0.0-SNAPSHOT.pom
[JENKINS] Archiving <https://builds.apache.org/job/brooklyn-server-master/ws/logging/logback-xml/pom.xml>
to org.apache.brooklyn/brooklyn-logback-xml/1.0.0-SNAPSHOT/brooklyn-logback-xml-1.0.0-SNAPSHOT.pom
[JENKINS] Archiving <https://builds.apache.org/job/brooklyn-server-master/ws/logging/logback-xml/target/brooklyn-logback-xml-1.0.0-SNAPSHOT.jar>
to org.apache.brooklyn/brooklyn-logback-xml/1.0.0-SNAPSHOT/brooklyn-logback-xml-1.0.0-SNAPSHOT.jar
[JENKINS] Archiving <https://builds.apache.org/job/brooklyn-server-master/ws/logging/logback-xml/target/brooklyn-logback-xml-1.0.0-SNAPSHOT-sources.jar>
to org.apache.brooklyn/brooklyn-logback-xml/1.0.0-SNAPSHOT/brooklyn-logback-xml-1.0.0-SNAPSHOT-sources.jar
[JENKINS] Archiving <https://builds.apache.org/job/brooklyn-server-master/ws/logging/logback-xml/target/brooklyn-logback-xml-1.0.0-SNAPSHOT-test-sources.jar>
to org.apache.brooklyn/brooklyn-logback-xml/1.0.0-SNAPSHOT/brooklyn-logback-xml-1.0.0-SNAPSHOT-test-sources.jar
[JENKINS] Archiving <https://builds.apache.org/job/brooklyn-server-master/ws/test-support/pom.xml>
to org.apache.brooklyn/brooklyn-test-support/1.0.0-SNAPSHOT/brooklyn-test-support-1.0.0-SNAPSHOT.pom
[JENKINS] Archiving <https://builds.apache.org/job/brooklyn-server-master/ws/test-support/target/brooklyn-test-support-1.0.0-SNAPSHOT.jar>
to org.apache.brooklyn/brooklyn-test-support/1.0.0-SNAPSHOT/brooklyn-test-support-1.0.0-SNAPSHOT.jar
[JENKINS] Archiving <https://builds.apache.org/job/brooklyn-server-master/ws/test-support/target/brooklyn-test-support-1.0.0-SNAPSHOT-sources.jar>
to org.apache.brooklyn/brooklyn-test-support/1.0.0-SNAPSHOT/brooklyn-test-support-1.0.0-SNAPSHOT-sources.jar
[JENKINS] Archiving <https://builds.apache.org/job/brooklyn-server-master/ws/test-support/target/brooklyn-test-support-1.0.0-SNAPSHOT-test-sources.jar>
to org.apache.brooklyn/brooklyn-test-support/1.0.0-SNAPSHOT/brooklyn-test-support-1.0.0-SNAPSHOT-test-sources.jar
[JENKINS] Archiving <https://builds.apache.org/job/brooklyn-server-master/ws/rest/rest-server/pom.xml>
to org.apache.brooklyn/brooklyn-rest-server/1.0.0-SNAPSHOT/brooklyn-rest-server-1.0.0-SNAPSHOT.pom
[JENKINS] Archiving <https://builds.apache.org/job/brooklyn-server-master/ws/api/pom.xml>
to org.apache.brooklyn/brooklyn-api/1.0.0-SNAPSHOT/brooklyn-api-1.0.0-SNAPSHOT.pom
[JENKINS] Archiving <https://builds.apache.org/job/brooklyn-server-master/ws/api/target/brooklyn-api-1.0.0-SNAPSHOT.jar>
to org.apache.brooklyn/brooklyn-api/1.0.0-SNAPSHOT/brooklyn-api-1.0.0-SNAPSHOT.jar
[JENKINS] Archiving <https://builds.apache.org/job/brooklyn-server-master/ws/api/target/brooklyn-api-1.0.0-SNAPSHOT-sources.jar>
to org.apache.brooklyn/brooklyn-api/1.0.0-SNAPSHOT/brooklyn-api-1.0.0-SNAPSHOT-sources.jar
[JENKINS] Archiving <https://builds.apache.org/job/brooklyn-server-master/ws/api/target/brooklyn-api-1.0.0-SNAPSHOT-test-sources.jar>
to org.apache.brooklyn/brooklyn-api/1.0.0-SNAPSHOT/brooklyn-api-1.0.0-SNAPSHOT-test-sources.jar
[JENKINS] Archiving <https://builds.apache.org/job/brooklyn-server-master/ws/pom.xml>
to org.apache.brooklyn/brooklyn-server/1.0.0-SNAPSHOT/brooklyn-server-1.0.0-SNAPSHOT.pom
[JENKINS] Archiving <https://builds.apache.org/job/brooklyn-server-master/ws/locations/jclouds/pom.xml>
to org.apache.brooklyn/brooklyn-locations-jclouds/1.0.0-SNAPSHOT/brooklyn-locations-jclouds-1.0.0-SNAPSHOT.pom
[JENKINS] Archiving <https://builds.apache.org/job/brooklyn-server-master/ws/utils/common/pom.xml>
to org.apache.brooklyn/brooklyn-utils-common/1.0.0-SNAPSHOT/brooklyn-utils-common-1.0.0-SNAPSHOT.pom
[JENKINS] Archiving <https://builds.apache.org/job/brooklyn-server-master/ws/utils/common/target/brooklyn-utils-common-1.0.0-SNAPSHOT.jar>
to org.apache.brooklyn/brooklyn-utils-common/1.0.0-SNAPSHOT/brooklyn-utils-common-1.0.0-SNAPSHOT.jar
[JENKINS] Archiving <https://builds.apache.org/job/brooklyn-server-master/ws/utils/common/target/brooklyn-utils-common-1.0.0-SNAPSHOT-tests.jar>
to org.apache.brooklyn/brooklyn-utils-common/1.0.0-SNAPSHOT/brooklyn-utils-common-1.0.0-SNAPSHOT-tests.jar
[JENKINS] Archiving <https://builds.apache.org/job/brooklyn-server-master/ws/utils/common/target/brooklyn-utils-common-1.0.0-SNAPSHOT-sources.jar>
to org.apache.brooklyn/brooklyn-utils-common/1.0.0-SNAPSHOT/brooklyn-utils-common-1.0.0-SNAPSHOT-sources.jar
[JENKINS] Archiving <https://builds.apache.org/job/brooklyn-server-master/ws/utils/common/target/brooklyn-utils-common-1.0.0-SNAPSHOT-test-sources.jar>
to org.apache.brooklyn/brooklyn-utils-common/1.0.0-SNAPSHOT/brooklyn-utils-common-1.0.0-SNAPSHOT-test-sources.jar
[JENKINS] Archiving <https://builds.apache.org/job/brooklyn-server-master/ws/karaf/features/pom.xml>
to org.apache.brooklyn/brooklyn-features/1.0.0-SNAPSHOT/brooklyn-features-1.0.0-SNAPSHOT.pom
[JENKINS] Archiving <https://builds.apache.org/job/brooklyn-server-master/ws/rest/rest-api/pom.xml>
to org.apache.brooklyn/brooklyn-rest-api/1.0.0-SNAPSHOT/brooklyn-rest-api-1.0.0-SNAPSHOT.pom
[JENKINS] Archiving <https://builds.apache.org/job/brooklyn-server-master/ws/utils/jmx/jmxrmi-agent/pom.xml>
to org.apache.brooklyn/brooklyn-jmxrmi-agent/1.0.0-SNAPSHOT/brooklyn-jmxrmi-agent-1.0.0-SNAPSHOT.pom
[JENKINS] Archiving <https://builds.apache.org/job/brooklyn-server-master/ws/karaf/start/pom.xml>
to org.apache.brooklyn/brooklyn-karaf-start/1.0.0-SNAPSHOT/brooklyn-karaf-start-1.0.0-SNAPSHOT.pom
[JENKINS] Archiving <https://builds.apache.org/job/brooklyn-server-master/ws/policy/pom.xml>
to org.apache.brooklyn/brooklyn-policy/1.0.0-SNAPSHOT/brooklyn-policy-1.0.0-SNAPSHOT.pom
[JENKINS] Archiving <https://builds.apache.org/job/brooklyn-server-master/ws/karaf/init/pom.xml>
to org.apache.brooklyn/brooklyn-karaf-init/1.0.0-SNAPSHOT/brooklyn-karaf-init-1.0.0-SNAPSHOT.pom
[JENKINS] Archiving <https://builds.apache.org/job/brooklyn-server-master/ws/karaf/commands/pom.xml>
to org.apache.brooklyn/brooklyn-commands/1.0.0-SNAPSHOT/brooklyn-commands-1.0.0-SNAPSHOT.pom
[JENKINS] Archiving <https://builds.apache.org/job/brooklyn-server-master/ws/logging/logback-includes/pom.xml>
to org.apache.brooklyn/brooklyn-logback-includes/1.0.0-SNAPSHOT/brooklyn-logback-includes-1.0.0-SNAPSHOT.pom
[JENKINS] Archiving <https://builds.apache.org/job/brooklyn-server-master/ws/logging/logback-includes/target/brooklyn-logback-includes-1.0.0-SNAPSHOT.jar>
to org.apache.brooklyn/brooklyn-logback-includes/1.0.0-SNAPSHOT/brooklyn-logback-includes-1.0.0-SNAPSHOT.jar
[JENKINS] Archiving <https://builds.apache.org/job/brooklyn-server-master/ws/logging/logback-includes/target/brooklyn-logback-includes-1.0.0-SNAPSHOT-sources.jar>
to org.apache.brooklyn/brooklyn-logback-includes/1.0.0-SNAPSHOT/brooklyn-logback-includes-1.0.0-SNAPSHOT-sources.jar
[JENKINS] Archiving <https://builds.apache.org/job/brooklyn-server-master/ws/logging/logback-includes/target/brooklyn-logback-includes-1.0.0-SNAPSHOT-test-sources.jar>
to org.apache.brooklyn/brooklyn-logback-includes/1.0.0-SNAPSHOT/brooklyn-logback-includes-1.0.0-SNAPSHOT-test-sources.jar
[JENKINS] Archiving <https://builds.apache.org/job/brooklyn-server-master/ws/rest/rest-resources/pom.xml>
to org.apache.brooklyn/brooklyn-rest-resources/1.0.0-SNAPSHOT/brooklyn-rest-resources-1.0.0-SNAPSHOT.pom
[JENKINS] Archiving <https://builds.apache.org/job/brooklyn-server-master/ws/utils/jmx/jmxmp-ssl-agent/pom.xml>
to org.apache.brooklyn/brooklyn-jmxmp-agent/1.0.0-SNAPSHOT/brooklyn-jmxmp-agent-1.0.0-SNAPSHOT.pom
[JENKINS] Archiving <https://builds.apache.org/job/brooklyn-server-master/ws/parent/pom.xml>
to org.apache.brooklyn/brooklyn-parent/1.0.0-SNAPSHOT/brooklyn-parent-1.0.0-SNAPSHOT.pom
[Fast Archiver] Compressed 81.60 KB of artifacts by 39.2% relative to #762
[JENKINS] Archiving <https://builds.apache.org/job/brooklyn-server-master/ws/software/winrm/pom.xml>
to org.apache.brooklyn/brooklyn-software-winrm/1.0.0-SNAPSHOT/brooklyn-software-winrm-1.0.0-SNAPSHOT.pom
channel stopped

Mime
View raw message