brooklyn-dev mailing list archives

Site index · List index
Message view « Date » · « Thread »
Top « Date » · « Thread »
From Apache Jenkins Server <jenk...@builds.apache.org>
Subject Build failed in Jenkins: brooklyn-server-master #748
Date Thu, 28 Sep 2017 13:13:31 GMT
See <https://builds.apache.org/job/brooklyn-server-master/748/display/redirect?page=changes>

Changes:

[graeme.miller] Fix BasicBrooklynCatalog create Spec

------------------------------------------
[...truncated 3.57 MB...]
2017-09-28 13:12:55,119 INFO  in-mem-test-iS4b requesting list nodes -->6; totals: out=224
B in=28 B
2017-09-28 13:12:55,119 INFO  in-mem-test-iS4b receiving list nodes <--2; totals: out=224
B in=30 B
2017-09-28 13:12:55,209 INFO  TESTNG PASSED CONFIGURATION: "Surefire test" - @BeforeMethod
org.apache.brooklyn.core.mgmt.persist.BrooklynMementoPersisterTestFixture.setUp() finished
in 132 ms
2017-09-28 13:12:55,209 INFO  TESTNG INVOKING: "Surefire test" - org.apache.brooklyn.core.mgmt.persist.BrooklynMementoPersisterTestFixture.testLoadAndCheckpointRawMemento()
2017-09-28 13:12:55,221 INFO  in-mem-test-iS4b requesting planeId -->7; totals: out=231
B in=30 B
2017-09-28 13:12:55,221 INFO  in-mem-test-iS4b reading planeId <--0; totals: out=231 B
in=30 B
2017-09-28 13:12:55,221 INFO  in-mem-test-iS4b writing planeId -->8; totals: out=239 B
in=30 B
2017-09-28 13:12:55,236 INFO  in-mem-test-iS4b writing entities/d7dgkiw2ps -->3076; totals:
out=3.31 kB in=30 B
2017-09-28 13:12:55,243 INFO  in-mem-test-iS4b writing entities/c44x8atiwt -->533; totals:
out=3.85 kB in=30 B
2017-09-28 13:12:55,259 INFO  in-mem-test-iS4b writing locations/x4viybocfg -->989; totals:
out=4.84 kB in=30 B
2017-09-28 13:12:55,267 INFO  in-mem-test-iS4b writing policies/powecp0ggy -->378; totals:
out=5.21 kB in=30 B
2017-09-28 13:12:55,283 INFO  in-mem-test-iS4b writing enrichers/i5tne7nhkm -->3307; totals:
out=8.52 kB in=30 B
2017-09-28 13:12:55,295 INFO  in-mem-test-iS4b writing enrichers/z6l103z378 -->1788; totals:
out=10.3 kB in=30 B
2017-09-28 13:12:55,306 INFO  in-mem-test-iS4b writing enrichers/h5gzx0x98x -->3307; totals:
out=13.6 kB in=30 B
2017-09-28 13:12:55,313 INFO  in-mem-test-iS4b writing enrichers/o3lj9i75pb -->699; totals:
out=14.3 kB in=30 B
2017-09-28 13:12:55,321 INFO  in-mem-test-iS4b writing enrichers/b2yfbc4qz0 -->554; totals:
out=14.9 kB in=30 B
2017-09-28 13:12:55,321 INFO  in-mem-test-iS4b writing enrichers/bz8cmppnjz -->554; totals:
out=15.4 kB in=30 B
2017-09-28 13:12:55,322 INFO  in-mem-test-iS4b requesting list entities -->9; totals: out=15.4
kB in=30 B
2017-09-28 13:12:55,322 INFO  in-mem-test-iS4b receiving list entities <--42; totals: out=15.4
kB in=72 B
2017-09-28 13:12:55,322 INFO  in-mem-test-iS4b requesting list locations -->10; totals:
out=15.4 kB in=72 B
2017-09-28 13:12:55,322 INFO  in-mem-test-iS4b receiving list locations <--22; totals:
out=15.4 kB in=94 B
2017-09-28 13:12:55,322 INFO  in-mem-test-iS4b requesting list policies -->9; totals: out=15.5
kB in=94 B
2017-09-28 13:12:55,322 INFO  in-mem-test-iS4b receiving list policies <--21; totals: out=15.5
kB in=115 B
2017-09-28 13:12:55,322 INFO  in-mem-test-iS4b requesting list enrichers -->10; totals:
out=15.5 kB in=115 B
2017-09-28 13:12:55,322 INFO  in-mem-test-iS4b receiving list enrichers <--132; totals:
out=15.5 kB in=247 B
2017-09-28 13:12:55,322 INFO  in-mem-test-iS4b requesting list feeds -->6; totals: out=15.5
kB in=247 B
2017-09-28 13:12:55,322 INFO  in-mem-test-iS4b receiving list feeds <--2; totals: out=15.5
kB in=249 B
2017-09-28 13:12:55,322 INFO  in-mem-test-iS4b requesting list catalog -->8; totals: out=15.5
kB in=249 B
2017-09-28 13:12:55,322 INFO  in-mem-test-iS4b receiving list catalog <--2; totals: out=15.5
kB in=251 B
2017-09-28 13:12:55,322 INFO  in-mem-test-iS4b requesting list bundles -->8; totals: out=15.5
kB in=251 B
2017-09-28 13:12:55,322 INFO  in-mem-test-iS4b receiving list bundles <--2; totals: out=15.5
kB in=253 B
2017-09-28 13:12:55,322 INFO  in-mem-test-iS4b requesting planeId -->7; totals: out=15.5
kB in=253 B
2017-09-28 13:12:55,322 INFO  in-mem-test-iS4b reading planeId <--8; totals: out=15.5 kB
in=261 B
2017-09-28 13:12:55,322 INFO  in-mem-test-iS4b requesting entities/d7dgkiw2ps -->19; totals:
out=15.5 kB in=261 B
2017-09-28 13:12:55,322 INFO  in-mem-test-iS4b reading entities/d7dgkiw2ps <--3076; totals:
out=15.5 kB in=3.34 kB
2017-09-28 13:12:55,323 INFO  in-mem-test-iS4b requesting entities/c44x8atiwt -->19; totals:
out=15.5 kB in=3.34 kB
2017-09-28 13:12:55,323 INFO  in-mem-test-iS4b reading entities/c44x8atiwt <--533; totals:
out=15.5 kB in=3.87 kB
2017-09-28 13:12:55,324 INFO  in-mem-test-iS4b requesting locations/x4viybocfg -->20; totals:
out=15.5 kB in=3.87 kB
2017-09-28 13:12:55,324 INFO  in-mem-test-iS4b requesting policies/powecp0ggy -->19; totals:
out=15.6 kB in=3.87 kB
2017-09-28 13:12:55,324 INFO  in-mem-test-iS4b reading locations/x4viybocfg <--989; totals:
out=15.6 kB in=4.86 kB
2017-09-28 13:12:55,324 INFO  in-mem-test-iS4b reading policies/powecp0ggy <--378; totals:
out=15.6 kB in=5.24 kB
2017-09-28 13:12:55,324 INFO  in-mem-test-iS4b requesting enrichers/i5tne7nhkm -->20; totals:
out=15.6 kB in=5.24 kB
2017-09-28 13:12:55,324 INFO  in-mem-test-iS4b reading enrichers/i5tne7nhkm <--3307; totals:
out=15.6 kB in=8.54 kB
2017-09-28 13:12:55,324 INFO  in-mem-test-iS4b requesting enrichers/h5gzx0x98x -->20; totals:
out=15.6 kB in=8.54 kB
2017-09-28 13:12:55,325 INFO  in-mem-test-iS4b reading enrichers/h5gzx0x98x <--3307; totals:
out=15.6 kB in=11.9 kB
2017-09-28 13:12:55,325 INFO  in-mem-test-iS4b requesting enrichers/bz8cmppnjz -->20; totals:
out=15.6 kB in=11.9 kB
2017-09-28 13:12:55,325 INFO  in-mem-test-iS4b reading enrichers/bz8cmppnjz <--554; totals:
out=15.6 kB in=12.4 kB
2017-09-28 13:12:55,325 INFO  in-mem-test-iS4b requesting enrichers/z6l103z378 -->20; totals:
out=15.6 kB in=12.4 kB
2017-09-28 13:12:55,325 INFO  in-mem-test-iS4b reading enrichers/z6l103z378 <--1788; totals:
out=15.6 kB in=14.2 kB
2017-09-28 13:12:55,326 INFO  in-mem-test-iS4b requesting enrichers/o3lj9i75pb -->20; totals:
out=15.7 kB in=14.2 kB
2017-09-28 13:12:55,326 INFO  in-mem-test-iS4b requesting enrichers/b2yfbc4qz0 -->20; totals:
out=15.7 kB in=14.2 kB
2017-09-28 13:12:55,326 INFO  in-mem-test-iS4b reading enrichers/o3lj9i75pb <--699; totals:
out=15.7 kB in=14.9 kB
2017-09-28 13:12:55,326 INFO  in-mem-test-iS4b reading enrichers/b2yfbc4qz0 <--554; totals:
out=15.7 kB in=15.4 kB
2017-09-28 13:12:55,326 INFO  in-mem-test-iS4b requesting planeId -->7; totals: out=15.7
kB in=15.4 kB
2017-09-28 13:12:55,327 INFO  in-mem-test-iS4b writing policies/powecp0ggy -->378; totals:
out=20.7 kB in=15.4 kB
2017-09-28 13:12:55,327 INFO  in-mem-test-iS4b writing enrichers/i5tne7nhkm -->3307; totals:
out=24.0 kB in=15.4 kB
2017-09-28 13:12:55,327 INFO  in-mem-test-iS4b writing enrichers/h5gzx0x98x -->3307; totals:
out=27.3 kB in=15.4 kB
2017-09-28 13:12:55,327 INFO  in-mem-test-iS4b writing enrichers/bz8cmppnjz -->554; totals:
out=27.8 kB in=15.4 kB
2017-09-28 13:12:55,327 INFO  in-mem-test-iS4b writing enrichers/z6l103z378 -->1788; totals:
out=29.6 kB in=15.4 kB
2017-09-28 13:12:55,327 INFO  in-mem-test-iS4b writing enrichers/o3lj9i75pb -->699; totals:
out=30.3 kB in=15.4 kB
2017-09-28 13:12:55,327 INFO  in-mem-test-iS4b writing locations/x4viybocfg -->989; totals:
out=20.3 kB in=15.4 kB
2017-09-28 13:12:55,327 INFO  in-mem-test-iS4b writing enrichers/b2yfbc4qz0 -->554; totals:
out=30.9 kB in=15.4 kB
2017-09-28 13:12:55,327 INFO  in-mem-test-iS4b writing entities/d7dgkiw2ps -->3076; totals:
out=19.3 kB in=15.4 kB
2017-09-28 13:12:55,326 INFO  in-mem-test-iS4b writing entities/c44x8atiwt -->533; totals:
out=16.2 kB in=15.4 kB
2017-09-28 13:12:55,328 INFO  in-mem-test-iS4b reading planeId <--8; totals: out=30.9 kB
in=15.5 kB
2017-09-28 13:12:55,328 INFO  TESTNG PASSED: "Surefire test" - org.apache.brooklyn.core.mgmt.persist.BrooklynMementoPersisterTestFixture.testLoadAndCheckpointRawMemento()
finished in 119 ms
2017-09-28 13:12:55,328 INFO  TESTNG INVOKING CONFIGURATION: "Surefire test" - @AfterMethod
org.apache.brooklyn.core.mgmt.persist.BrooklynMementoPersisterTestFixture.tearDown()
2017-09-28 13:12:55,334 INFO  in-mem-test-iS4b deleting entities/d7dgkiw2ps -->19; totals:
out=30.9 kB in=15.5 kB
2017-09-28 13:12:55,334 INFO  in-mem-test-iS4b deleting entities/c44x8atiwt -->19; totals:
out=30.9 kB in=15.5 kB
2017-09-28 13:12:55,334 INFO  in-mem-test-iS4b deleting locations/x4viybocfg -->20; totals:
out=30.9 kB in=15.5 kB
2017-09-28 13:12:55,334 INFO  in-mem-test-iS4b deleting policies/powecp0ggy -->19; totals:
out=31.0 kB in=15.5 kB
2017-09-28 13:12:55,334 INFO  in-mem-test-iS4b deleting enrichers/i5tne7nhkm -->20; totals:
out=31.0 kB in=15.5 kB
2017-09-28 13:12:55,334 INFO  in-mem-test-iS4b deleting enrichers/bz8cmppnjz -->20; totals:
out=31.0 kB in=15.5 kB
2017-09-28 13:12:55,334 INFO  in-mem-test-iS4b deleting enrichers/z6l103z378 -->20; totals:
out=31.0 kB in=15.5 kB
2017-09-28 13:12:55,334 INFO  in-mem-test-iS4b deleting enrichers/o3lj9i75pb -->20; totals:
out=31.0 kB in=15.5 kB
2017-09-28 13:12:55,334 INFO  in-mem-test-iS4b deleting enrichers/h5gzx0x98x -->20; totals:
out=31.1 kB in=15.5 kB
2017-09-28 13:12:55,335 INFO  in-mem-test-iS4b deleting enrichers/b2yfbc4qz0 -->20; totals:
out=31.1 kB in=15.5 kB
2017-09-28 13:12:55,336 WARN  Entities.destroyAll invoked on non-deployment NonDeploymentManagementContext{entity=d7dgkiw2ps,
mode=MANAGEMENT_STOPPED} - not likely to have much effect! (This usually means the mgmt context
has been taken from an entity that has been destroyed. To destroy other things on the management
context ensure you keep a handle to the context before the entity is destroyed, such as by
creating the management context first.)
2017-09-28 13:12:55,336 INFO  in-mem-test-X8lO deleting completely -->1; totals: out=42.3
kB in=30 B
2017-09-28 13:12:55,336 INFO  TESTNG PASSED CONFIGURATION: "Surefire test" - @AfterMethod
org.apache.brooklyn.core.mgmt.persist.BrooklynMementoPersisterTestFixture.tearDown() finished
in 8 ms
2017-09-28 13:12:55,336 INFO  TESTNG INVOKING: "Surefire test" - org.apache.brooklyn.core.mgmt.persist.DeserializingClassRenamesProviderTest.testRename()
2017-09-28 13:12:55,336 INFO  TESTNG PASSED: "Surefire test" - org.apache.brooklyn.core.mgmt.persist.DeserializingClassRenamesProviderTest.testRename()
finished in 0 ms
2017-09-28 13:12:55,336 INFO  TESTNG INVOKING: "Surefire test" - org.apache.brooklyn.core.mgmt.persist.DeserializingClassRenamesProviderTest.testRenameInnerClass()
2017-09-28 13:12:55,337 INFO  TESTNG PASSED: "Surefire test" - org.apache.brooklyn.core.mgmt.persist.DeserializingClassRenamesProviderTest.testRenameInnerClass()
finished in 1 ms
2017-09-28 13:12:55,337 INFO  TESTNG INVOKING: "Surefire test" - org.apache.brooklyn.core.mgmt.persist.DeserializingClassRenamesProviderTest.testRenameNoopIfNotInProperties()
2017-09-28 13:12:55,337 INFO  TESTNG PASSED: "Surefire test" - org.apache.brooklyn.core.mgmt.persist.DeserializingClassRenamesProviderTest.testRenameNoopIfNotInProperties()
finished in 0 ms
2017-09-28 13:12:55,649 INFO  TESTNG 
===============================================
    Surefire test
    Tests run: 2237, Failures: 1, Skips: 0
===============================================
[GC (Allocation Failure)  442053K->203671K(775168K), 0.0278869 secs]
[GC (Allocation Failure)  443287K->202207K(775680K), 0.0414703 secs]
[GC (Allocation Failure)  442847K->202385K(765440K), 0.0457103 secs]
[GC (Allocation Failure)  443025K->202465K(775168K), 0.0153508 secs]
[GC (Allocation Failure)  442081K->202289K(775168K), 0.0086678 secs]
Tests run: 2237, Failures: 1, Errors: 0, Skipped: 0, Time elapsed: 187.914 sec <<<
FAILURE! - in TestSuite
testManuallySettingIndicatorsOnApplications(org.apache.brooklyn.core.entity.lifecycle.ServiceStateLogicTest)
 Time elapsed: 0.549 sec  <<< FAILURE!
java.lang.AssertionError: entity=TestEntityImpl{id=swysi64jcs}; attribute=Sensor: service.state
(org.apache.brooklyn.core.entity.lifecycle.Lifecycle) expected [running] but found [on-fire]
	at org.apache.brooklyn.core.entity.lifecycle.ServiceStateLogicTest.assertAttributeEquals(ServiceStateLogicTest.java:356)
	at org.apache.brooklyn.core.entity.lifecycle.ServiceStateLogicTest.testManuallySettingIndicatorsOnApplications(ServiceStateLogicTest.java:271)

2017-09-28 13:12:58,542 INFO  Brooklyn shutdown: stopping entities [TestEntityImpl{id=hxlqqj1g6k},
TestEntityImpl{id=zzapn6clk5}, BlockingEntityImpl{id=wxpdkayr1n}]

Results :

Failed tests: 
  ServiceStateLogicTest.testManuallySettingIndicatorsOnApplications:271->assertAttributeEquals:356
entity=TestEntityImpl{id=swysi64jcs}; attribute=Sensor: service.state (org.apache.brooklyn.core.entity.lifecycle.Lifecycle)
expected [running] but found [on-fire]

Tests run: 2237, Failures: 1, Errors: 0, Skipped: 0

[JENKINS] Recording test results
[INFO] ------------------------------------------------------------------------
[INFO] Reactor Summary:
[INFO] 
[INFO] Brooklyn Server Root ............................... SUCCESS [  1.825 s]
[INFO] Brooklyn Parent Project ............................ SUCCESS [  4.306 s]
[INFO] Brooklyn Test Support Utilities .................... SUCCESS [  6.241 s]
[INFO] Brooklyn Logback Includable Configuration .......... SUCCESS [  1.787 s]
[INFO] Brooklyn Common Utilities .......................... SUCCESS [ 24.580 s]
[INFO] Brooklyn API ....................................... SUCCESS [  3.441 s]
[INFO] CAMP Server Parent Project ......................... SUCCESS [  1.262 s]
[INFO] CAMP Base .......................................... SUCCESS [  3.576 s]
[INFO] Brooklyn Test Support .............................. SUCCESS [  2.499 s]
[INFO] Brooklyn REST Swagger Apidoc Utilities ............. SUCCESS [  2.594 s]
[INFO] Brooklyn Logback Configuration ..................... SUCCESS [  1.451 s]
[INFO] CAMP Server ........................................ SUCCESS [  7.119 s]
[INFO] Brooklyn Felix Runtime ............................. SUCCESS [  3.622 s]
[INFO] Brooklyn Groovy Utilities .......................... SUCCESS [  3.083 s]
[INFO] Brooklyn Core ...................................... FAILURE [03:49 min]
[INFO] Brooklyn Policies .................................. SKIPPED
[INFO] Brooklyn WinRM Software Entities ................... SKIPPED
[INFO] Brooklyn Secure JMXMP Agent ........................ SKIPPED
[INFO] Brooklyn JMX RMI Agent ............................. SKIPPED
[INFO] Brooklyn Jclouds Location Targets .................. SKIPPED
[INFO] Brooklyn Software Base ............................. SKIPPED
[INFO] Brooklyn CAMP ...................................... SKIPPED
[INFO] Brooklyn Launcher Common ........................... SKIPPED
[INFO] Brooklyn REST API .................................. SKIPPED
[INFO] Brooklyn REST Resources ............................ SKIPPED
[INFO] Brooklyn REST Server ............................... SKIPPED
[INFO] Brooklyn Launcher .................................. SKIPPED
[INFO] Brooklyn Container Location Targets ................ SKIPPED
[INFO] Brooklyn Command Line Interface .................... SKIPPED
[INFO] Brooklyn Test Framework ............................ SKIPPED
[INFO] Brooklyn OSGi init ................................. SKIPPED
[INFO] Brooklyn OSGi start ................................ SKIPPED
[INFO] Brooklyn Karaf ..................................... SKIPPED
[INFO] Jetty config fragment .............................. SKIPPED
[INFO] Apache Http Component extension .................... SKIPPED
[INFO] Brooklyn Karaf Features ............................ SKIPPED
[INFO] Brooklyn Karaf Shell Commands ...................... SKIPPED
[INFO] ------------------------------------------------------------------------
[INFO] BUILD FAILURE
[INFO] ------------------------------------------------------------------------
[INFO] Total time: 05:20 min
[INFO] Finished at: 2017-09-28T13:13:06+00:00
[INFO] Final Memory: 79M/723M
[INFO] ------------------------------------------------------------------------
[ERROR] Failed to execute goal org.apache.maven.plugins:maven-surefire-plugin:2.19.1:test
(default-test) on project brooklyn-core: There are test failures.
[ERROR] 
[ERROR] Please refer to <https://builds.apache.org/job/brooklyn-server-master/ws/core/target/surefire-reports>
for the individual test results.
[ERROR] -> [Help 1]
[ERROR] 
[ERROR] To see the full stack trace of the errors, re-run Maven with the -e switch.
[ERROR] Re-run Maven using the -X switch to enable full debug logging.
[ERROR] 
[ERROR] For more information about the errors and possible solutions, please read the following
articles:
[ERROR] [Help 1] http://cwiki.apache.org/confluence/display/MAVEN/MojoFailureException
[ERROR] 
[ERROR] After correcting the problems, you can resume the build with the command
[ERROR]   mvn <goals> -rf :brooklyn-core
[JENKINS] Archiving <https://builds.apache.org/job/brooklyn-server-master/ws/camp/pom.xml>
to org.apache.brooklyn.camp/camp-parent/0.13.0-SNAPSHOT/camp-parent-0.13.0-SNAPSHOT.pom
[JENKINS] Archiving <https://builds.apache.org/job/brooklyn-server-master/ws/utils/rt-felix/pom.xml>
to org.apache.brooklyn/brooklyn-rt-felix/0.13.0-SNAPSHOT/brooklyn-rt-felix-0.13.0-SNAPSHOT.pom
[JENKINS] Archiving <https://builds.apache.org/job/brooklyn-server-master/ws/utils/rt-felix/target/brooklyn-rt-felix-0.13.0-SNAPSHOT.jar>
to org.apache.brooklyn/brooklyn-rt-felix/0.13.0-SNAPSHOT/brooklyn-rt-felix-0.13.0-SNAPSHOT.jar
[JENKINS] Archiving <https://builds.apache.org/job/brooklyn-server-master/ws/utils/rt-felix/target/brooklyn-rt-felix-0.13.0-SNAPSHOT-tests.jar>
to org.apache.brooklyn/brooklyn-rt-felix/0.13.0-SNAPSHOT/brooklyn-rt-felix-0.13.0-SNAPSHOT-tests.jar
[JENKINS] Archiving <https://builds.apache.org/job/brooklyn-server-master/ws/utils/rt-felix/target/brooklyn-rt-felix-0.13.0-SNAPSHOT-sources.jar>
to org.apache.brooklyn/brooklyn-rt-felix/0.13.0-SNAPSHOT/brooklyn-rt-felix-0.13.0-SNAPSHOT-sources.jar
[JENKINS] Archiving <https://builds.apache.org/job/brooklyn-server-master/ws/utils/rt-felix/target/brooklyn-rt-felix-0.13.0-SNAPSHOT-test-sources.jar>
to org.apache.brooklyn/brooklyn-rt-felix/0.13.0-SNAPSHOT/brooklyn-rt-felix-0.13.0-SNAPSHOT-test-sources.jar
[JENKINS] Archiving <https://builds.apache.org/job/brooklyn-server-master/ws/test-framework/pom.xml>
to org.apache.brooklyn/brooklyn-test-framework/0.13.0-SNAPSHOT/brooklyn-test-framework-0.13.0-SNAPSHOT.pom
[JENKINS] Archiving <https://builds.apache.org/job/brooklyn-server-master/ws/core/pom.xml>
to org.apache.brooklyn/brooklyn-core/0.13.0-SNAPSHOT/brooklyn-core-0.13.0-SNAPSHOT.pom
[JENKINS] Archiving <https://builds.apache.org/job/brooklyn-server-master/ws/camp/camp-server/pom.xml>
to org.apache.brooklyn.camp/camp-server/0.13.0-SNAPSHOT/camp-server-0.13.0-SNAPSHOT.pom
[JENKINS] Archiving <https://builds.apache.org/job/brooklyn-server-master/ws/camp/camp-server/target/camp-server-0.13.0-SNAPSHOT.jar>
to org.apache.brooklyn.camp/camp-server/0.13.0-SNAPSHOT/camp-server-0.13.0-SNAPSHOT.jar
[JENKINS] Archiving <https://builds.apache.org/job/brooklyn-server-master/ws/camp/camp-server/target/camp-server-0.13.0-SNAPSHOT-tests.jar>
to org.apache.brooklyn.camp/camp-server/0.13.0-SNAPSHOT/camp-server-0.13.0-SNAPSHOT-tests.jar
[JENKINS] Archiving <https://builds.apache.org/job/brooklyn-server-master/ws/camp/camp-server/target/camp-server-0.13.0-SNAPSHOT-sources.jar>
to org.apache.brooklyn.camp/camp-server/0.13.0-SNAPSHOT/camp-server-0.13.0-SNAPSHOT-sources.jar
[JENKINS] Archiving <https://builds.apache.org/job/brooklyn-server-master/ws/camp/camp-server/target/camp-server-0.13.0-SNAPSHOT-test-sources.jar>
to org.apache.brooklyn.camp/camp-server/0.13.0-SNAPSHOT/camp-server-0.13.0-SNAPSHOT-test-sources.jar
[JENKINS] Archiving <https://builds.apache.org/job/brooklyn-server-master/ws/launcher/pom.xml>
to org.apache.brooklyn/brooklyn-launcher/0.13.0-SNAPSHOT/brooklyn-launcher-0.13.0-SNAPSHOT.pom
[JENKINS] Archiving <https://builds.apache.org/job/brooklyn-server-master/ws/karaf/pom.xml>
to org.apache.brooklyn/brooklyn-karaf/0.13.0-SNAPSHOT/brooklyn-karaf-0.13.0-SNAPSHOT.pom
[JENKINS] Archiving <https://builds.apache.org/job/brooklyn-server-master/ws/karaf/httpcomponent-extension/pom.xml>
to org.apache.brooklyn/brooklyn-karaf-httpcomponents-extension/0.13.0-SNAPSHOT/brooklyn-karaf-httpcomponents-extension-0.13.0-SNAPSHOT.pom
[JENKINS] Archiving <https://builds.apache.org/job/brooklyn-server-master/ws/locations/container/pom.xml>
to org.apache.brooklyn/brooklyn-locations-container/0.13.0-SNAPSHOT/brooklyn-locations-container-0.13.0-SNAPSHOT.pom
[JENKINS] Archiving <https://builds.apache.org/job/brooklyn-server-master/ws/utils/test-support/pom.xml>
to org.apache.brooklyn/brooklyn-utils-test-support/0.13.0-SNAPSHOT/brooklyn-utils-test-support-0.13.0-SNAPSHOT.pom
[JENKINS] Archiving <https://builds.apache.org/job/brooklyn-server-master/ws/utils/test-support/target/brooklyn-utils-test-support-0.13.0-SNAPSHOT.jar>
to org.apache.brooklyn/brooklyn-utils-test-support/0.13.0-SNAPSHOT/brooklyn-utils-test-support-0.13.0-SNAPSHOT.jar
[JENKINS] Archiving <https://builds.apache.org/job/brooklyn-server-master/ws/utils/test-support/target/brooklyn-utils-test-support-0.13.0-SNAPSHOT-sources.jar>
to org.apache.brooklyn/brooklyn-utils-test-support/0.13.0-SNAPSHOT/brooklyn-utils-test-support-0.13.0-SNAPSHOT-sources.jar
[JENKINS] Archiving <https://builds.apache.org/job/brooklyn-server-master/ws/utils/test-support/target/brooklyn-utils-test-support-0.13.0-SNAPSHOT-test-sources.jar>
to org.apache.brooklyn/brooklyn-utils-test-support/0.13.0-SNAPSHOT/brooklyn-utils-test-support-0.13.0-SNAPSHOT-test-sources.jar
[JENKINS] Archiving <https://builds.apache.org/job/brooklyn-server-master/ws/software/base/pom.xml>
to org.apache.brooklyn/brooklyn-software-base/0.13.0-SNAPSHOT/brooklyn-software-base-0.13.0-SNAPSHOT.pom
[JENKINS] Archiving <https://builds.apache.org/job/brooklyn-server-master/ws/utils/groovy/pom.xml>
to org.apache.brooklyn/brooklyn-utils-groovy/0.13.0-SNAPSHOT/brooklyn-utils-groovy-0.13.0-SNAPSHOT.pom
[JENKINS] Archiving <https://builds.apache.org/job/brooklyn-server-master/ws/utils/groovy/target/brooklyn-utils-groovy-0.13.0-SNAPSHOT.jar>
to org.apache.brooklyn/brooklyn-utils-groovy/0.13.0-SNAPSHOT/brooklyn-utils-groovy-0.13.0-SNAPSHOT.jar
[JENKINS] Archiving <https://builds.apache.org/job/brooklyn-server-master/ws/utils/groovy/target/brooklyn-utils-groovy-0.13.0-SNAPSHOT-tests.jar>
to org.apache.brooklyn/brooklyn-utils-groovy/0.13.0-SNAPSHOT/brooklyn-utils-groovy-0.13.0-SNAPSHOT-tests.jar
[JENKINS] Archiving <https://builds.apache.org/job/brooklyn-server-master/ws/utils/groovy/target/brooklyn-utils-groovy-0.13.0-SNAPSHOT-sources.jar>
to org.apache.brooklyn/brooklyn-utils-groovy/0.13.0-SNAPSHOT/brooklyn-utils-groovy-0.13.0-SNAPSHOT-sources.jar
[JENKINS] Archiving <https://builds.apache.org/job/brooklyn-server-master/ws/utils/groovy/target/brooklyn-utils-groovy-0.13.0-SNAPSHOT-test-sources.jar>
to org.apache.brooklyn/brooklyn-utils-groovy/0.13.0-SNAPSHOT/brooklyn-utils-groovy-0.13.0-SNAPSHOT-test-sources.jar
[JENKINS] Archiving <https://builds.apache.org/job/brooklyn-server-master/ws/utils/rest-swagger/pom.xml>
to org.apache.brooklyn/brooklyn-utils-rest-swagger/0.13.0-SNAPSHOT/brooklyn-utils-rest-swagger-0.13.0-SNAPSHOT.pom
[JENKINS] Archiving <https://builds.apache.org/job/brooklyn-server-master/ws/utils/rest-swagger/target/brooklyn-utils-rest-swagger-0.13.0-SNAPSHOT.jar>
to org.apache.brooklyn/brooklyn-utils-rest-swagger/0.13.0-SNAPSHOT/brooklyn-utils-rest-swagger-0.13.0-SNAPSHOT.jar
[JENKINS] Archiving <https://builds.apache.org/job/brooklyn-server-master/ws/utils/rest-swagger/target/brooklyn-utils-rest-swagger-0.13.0-SNAPSHOT-sources.jar>
to org.apache.brooklyn/brooklyn-utils-rest-swagger/0.13.0-SNAPSHOT/brooklyn-utils-rest-swagger-0.13.0-SNAPSHOT-sources.jar
[JENKINS] Archiving <https://builds.apache.org/job/brooklyn-server-master/ws/utils/rest-swagger/target/brooklyn-utils-rest-swagger-0.13.0-SNAPSHOT-test-sources.jar>
to org.apache.brooklyn/brooklyn-utils-rest-swagger/0.13.0-SNAPSHOT/brooklyn-utils-rest-swagger-0.13.0-SNAPSHOT-test-sources.jar
[JENKINS] Archiving <https://builds.apache.org/job/brooklyn-server-master/ws/launcher-common/pom.xml>
to org.apache.brooklyn/brooklyn-launcher-common/0.13.0-SNAPSHOT/brooklyn-launcher-common-0.13.0-SNAPSHOT.pom
[JENKINS] Archiving <https://builds.apache.org/job/brooklyn-server-master/ws/camp/camp-base/pom.xml>
to org.apache.brooklyn.camp/camp-base/0.13.0-SNAPSHOT/camp-base-0.13.0-SNAPSHOT.pom
[JENKINS] Archiving <https://builds.apache.org/job/brooklyn-server-master/ws/camp/camp-base/target/camp-base-0.13.0-SNAPSHOT.jar>
to org.apache.brooklyn.camp/camp-base/0.13.0-SNAPSHOT/camp-base-0.13.0-SNAPSHOT.jar
[JENKINS] Archiving <https://builds.apache.org/job/brooklyn-server-master/ws/camp/camp-base/target/camp-base-0.13.0-SNAPSHOT-tests.jar>
to org.apache.brooklyn.camp/camp-base/0.13.0-SNAPSHOT/camp-base-0.13.0-SNAPSHOT-tests.jar
[JENKINS] Archiving <https://builds.apache.org/job/brooklyn-server-master/ws/camp/camp-base/target/camp-base-0.13.0-SNAPSHOT-sources.jar>
to org.apache.brooklyn.camp/camp-base/0.13.0-SNAPSHOT/camp-base-0.13.0-SNAPSHOT-sources.jar
[JENKINS] Archiving <https://builds.apache.org/job/brooklyn-server-master/ws/camp/camp-base/target/camp-base-0.13.0-SNAPSHOT-test-sources.jar>
to org.apache.brooklyn.camp/camp-base/0.13.0-SNAPSHOT/camp-base-0.13.0-SNAPSHOT-test-sources.jar
[JENKINS] Archiving <https://builds.apache.org/job/brooklyn-server-master/ws/camp/camp-brooklyn/pom.xml>
to org.apache.brooklyn/brooklyn-camp/0.13.0-SNAPSHOT/brooklyn-camp-0.13.0-SNAPSHOT.pom
[JENKINS] Archiving <https://builds.apache.org/job/brooklyn-server-master/ws/karaf/jetty-config/pom.xml>
to org.apache.brooklyn/brooklyn-karaf-jetty-config/0.13.0-SNAPSHOT/brooklyn-karaf-jetty-config-0.13.0-SNAPSHOT.pom
[JENKINS] Archiving <https://builds.apache.org/job/brooklyn-server-master/ws/server-cli/pom.xml>
to org.apache.brooklyn/brooklyn-cli/0.13.0-SNAPSHOT/brooklyn-cli-0.13.0-SNAPSHOT.pom
[JENKINS] Archiving <https://builds.apache.org/job/brooklyn-server-master/ws/logging/logback-xml/pom.xml>
to org.apache.brooklyn/brooklyn-logback-xml/0.13.0-SNAPSHOT/brooklyn-logback-xml-0.13.0-SNAPSHOT.pom
[JENKINS] Archiving <https://builds.apache.org/job/brooklyn-server-master/ws/logging/logback-xml/target/brooklyn-logback-xml-0.13.0-SNAPSHOT.jar>
to org.apache.brooklyn/brooklyn-logback-xml/0.13.0-SNAPSHOT/brooklyn-logback-xml-0.13.0-SNAPSHOT.jar
[JENKINS] Archiving <https://builds.apache.org/job/brooklyn-server-master/ws/logging/logback-xml/target/brooklyn-logback-xml-0.13.0-SNAPSHOT-sources.jar>
to org.apache.brooklyn/brooklyn-logback-xml/0.13.0-SNAPSHOT/brooklyn-logback-xml-0.13.0-SNAPSHOT-sources.jar
[JENKINS] Archiving <https://builds.apache.org/job/brooklyn-server-master/ws/logging/logback-xml/target/brooklyn-logback-xml-0.13.0-SNAPSHOT-test-sources.jar>
to org.apache.brooklyn/brooklyn-logback-xml/0.13.0-SNAPSHOT/brooklyn-logback-xml-0.13.0-SNAPSHOT-test-sources.jar
[JENKINS] Archiving <https://builds.apache.org/job/brooklyn-server-master/ws/test-support/pom.xml>
to org.apache.brooklyn/brooklyn-test-support/0.13.0-SNAPSHOT/brooklyn-test-support-0.13.0-SNAPSHOT.pom
[JENKINS] Archiving <https://builds.apache.org/job/brooklyn-server-master/ws/test-support/target/brooklyn-test-support-0.13.0-SNAPSHOT.jar>
to org.apache.brooklyn/brooklyn-test-support/0.13.0-SNAPSHOT/brooklyn-test-support-0.13.0-SNAPSHOT.jar
[JENKINS] Archiving <https://builds.apache.org/job/brooklyn-server-master/ws/test-support/target/brooklyn-test-support-0.13.0-SNAPSHOT-sources.jar>
to org.apache.brooklyn/brooklyn-test-support/0.13.0-SNAPSHOT/brooklyn-test-support-0.13.0-SNAPSHOT-sources.jar
[JENKINS] Archiving <https://builds.apache.org/job/brooklyn-server-master/ws/test-support/target/brooklyn-test-support-0.13.0-SNAPSHOT-test-sources.jar>
to org.apache.brooklyn/brooklyn-test-support/0.13.0-SNAPSHOT/brooklyn-test-support-0.13.0-SNAPSHOT-test-sources.jar
[JENKINS] Archiving <https://builds.apache.org/job/brooklyn-server-master/ws/rest/rest-server/pom.xml>
to org.apache.brooklyn/brooklyn-rest-server/0.13.0-SNAPSHOT/brooklyn-rest-server-0.13.0-SNAPSHOT.pom
[JENKINS] Archiving <https://builds.apache.org/job/brooklyn-server-master/ws/api/pom.xml>
to org.apache.brooklyn/brooklyn-api/0.13.0-SNAPSHOT/brooklyn-api-0.13.0-SNAPSHOT.pom
[JENKINS] Archiving <https://builds.apache.org/job/brooklyn-server-master/ws/api/target/brooklyn-api-0.13.0-SNAPSHOT.jar>
to org.apache.brooklyn/brooklyn-api/0.13.0-SNAPSHOT/brooklyn-api-0.13.0-SNAPSHOT.jar
[JENKINS] Archiving <https://builds.apache.org/job/brooklyn-server-master/ws/api/target/brooklyn-api-0.13.0-SNAPSHOT-sources.jar>
to org.apache.brooklyn/brooklyn-api/0.13.0-SNAPSHOT/brooklyn-api-0.13.0-SNAPSHOT-sources.jar
[JENKINS] Archiving <https://builds.apache.org/job/brooklyn-server-master/ws/api/target/brooklyn-api-0.13.0-SNAPSHOT-test-sources.jar>
to org.apache.brooklyn/brooklyn-api/0.13.0-SNAPSHOT/brooklyn-api-0.13.0-SNAPSHOT-test-sources.jar
[JENKINS] Archiving <https://builds.apache.org/job/brooklyn-server-master/ws/pom.xml>
to org.apache.brooklyn/brooklyn-server/0.13.0-SNAPSHOT/brooklyn-server-0.13.0-SNAPSHOT.pom
[JENKINS] Archiving <https://builds.apache.org/job/brooklyn-server-master/ws/locations/jclouds/pom.xml>
to org.apache.brooklyn/brooklyn-locations-jclouds/0.13.0-SNAPSHOT/brooklyn-locations-jclouds-0.13.0-SNAPSHOT.pom
[JENKINS] Archiving <https://builds.apache.org/job/brooklyn-server-master/ws/utils/common/pom.xml>
to org.apache.brooklyn/brooklyn-utils-common/0.13.0-SNAPSHOT/brooklyn-utils-common-0.13.0-SNAPSHOT.pom
[JENKINS] Archiving <https://builds.apache.org/job/brooklyn-server-master/ws/utils/common/target/brooklyn-utils-common-0.13.0-SNAPSHOT.jar>
to org.apache.brooklyn/brooklyn-utils-common/0.13.0-SNAPSHOT/brooklyn-utils-common-0.13.0-SNAPSHOT.jar
[JENKINS] Archiving <https://builds.apache.org/job/brooklyn-server-master/ws/utils/common/target/brooklyn-utils-common-0.13.0-SNAPSHOT-tests.jar>
to org.apache.brooklyn/brooklyn-utils-common/0.13.0-SNAPSHOT/brooklyn-utils-common-0.13.0-SNAPSHOT-tests.jar
[JENKINS] Archiving <https://builds.apache.org/job/brooklyn-server-master/ws/utils/common/target/brooklyn-utils-common-0.13.0-SNAPSHOT-sources.jar>
to org.apache.brooklyn/brooklyn-utils-common/0.13.0-SNAPSHOT/brooklyn-utils-common-0.13.0-SNAPSHOT-sources.jar
[JENKINS] Archiving <https://builds.apache.org/job/brooklyn-server-master/ws/utils/common/target/brooklyn-utils-common-0.13.0-SNAPSHOT-test-sources.jar>
to org.apache.brooklyn/brooklyn-utils-common/0.13.0-SNAPSHOT/brooklyn-utils-common-0.13.0-SNAPSHOT-test-sources.jar
[JENKINS] Archiving <https://builds.apache.org/job/brooklyn-server-master/ws/karaf/features/pom.xml>
to org.apache.brooklyn/brooklyn-features/0.13.0-SNAPSHOT/brooklyn-features-0.13.0-SNAPSHOT.pom
[JENKINS] Archiving <https://builds.apache.org/job/brooklyn-server-master/ws/rest/rest-api/pom.xml>
to org.apache.brooklyn/brooklyn-rest-api/0.13.0-SNAPSHOT/brooklyn-rest-api-0.13.0-SNAPSHOT.pom
[JENKINS] Archiving <https://builds.apache.org/job/brooklyn-server-master/ws/utils/jmx/jmxrmi-agent/pom.xml>
to org.apache.brooklyn/brooklyn-jmxrmi-agent/0.13.0-SNAPSHOT/brooklyn-jmxrmi-agent-0.13.0-SNAPSHOT.pom
[JENKINS] Archiving <https://builds.apache.org/job/brooklyn-server-master/ws/karaf/start/pom.xml>
to org.apache.brooklyn/brooklyn-karaf-start/0.13.0-SNAPSHOT/brooklyn-karaf-start-0.13.0-SNAPSHOT.pom
[JENKINS] Archiving <https://builds.apache.org/job/brooklyn-server-master/ws/policy/pom.xml>
to org.apache.brooklyn/brooklyn-policy/0.13.0-SNAPSHOT/brooklyn-policy-0.13.0-SNAPSHOT.pom
[JENKINS] Archiving <https://builds.apache.org/job/brooklyn-server-master/ws/karaf/init/pom.xml>
to org.apache.brooklyn/brooklyn-karaf-init/0.13.0-SNAPSHOT/brooklyn-karaf-init-0.13.0-SNAPSHOT.pom
[JENKINS] Archiving <https://builds.apache.org/job/brooklyn-server-master/ws/karaf/commands/pom.xml>
to org.apache.brooklyn/brooklyn-commands/0.13.0-SNAPSHOT/brooklyn-commands-0.13.0-SNAPSHOT.pom
[JENKINS] Archiving <https://builds.apache.org/job/brooklyn-server-master/ws/logging/logback-includes/pom.xml>
to org.apache.brooklyn/brooklyn-logback-includes/0.13.0-SNAPSHOT/brooklyn-logback-includes-0.13.0-SNAPSHOT.pom
[JENKINS] Archiving <https://builds.apache.org/job/brooklyn-server-master/ws/logging/logback-includes/target/brooklyn-logback-includes-0.13.0-SNAPSHOT.jar>
to org.apache.brooklyn/brooklyn-logback-includes/0.13.0-SNAPSHOT/brooklyn-logback-includes-0.13.0-SNAPSHOT.jar
[JENKINS] Archiving <https://builds.apache.org/job/brooklyn-server-master/ws/logging/logback-includes/target/brooklyn-logback-includes-0.13.0-SNAPSHOT-sources.jar>
to org.apache.brooklyn/brooklyn-logback-includes/0.13.0-SNAPSHOT/brooklyn-logback-includes-0.13.0-SNAPSHOT-sources.jar
[JENKINS] Archiving <https://builds.apache.org/job/brooklyn-server-master/ws/logging/logback-includes/target/brooklyn-logback-includes-0.13.0-SNAPSHOT-test-sources.jar>
to org.apache.brooklyn/brooklyn-logback-includes/0.13.0-SNAPSHOT/brooklyn-logback-includes-0.13.0-SNAPSHOT-test-sources.jar
[JENKINS] Archiving <https://builds.apache.org/job/brooklyn-server-master/ws/rest/rest-resources/pom.xml>
to org.apache.brooklyn/brooklyn-rest-resources/0.13.0-SNAPSHOT/brooklyn-rest-resources-0.13.0-SNAPSHOT.pom
[JENKINS] Archiving <https://builds.apache.org/job/brooklyn-server-master/ws/utils/jmx/jmxmp-ssl-agent/pom.xml>
to org.apache.brooklyn/brooklyn-jmxmp-agent/0.13.0-SNAPSHOT/brooklyn-jmxmp-agent-0.13.0-SNAPSHOT.pom
[JENKINS] Archiving <https://builds.apache.org/job/brooklyn-server-master/ws/parent/pom.xml>
to org.apache.brooklyn/brooklyn-parent/0.13.0-SNAPSHOT/brooklyn-parent-0.13.0-SNAPSHOT.pom
[Fast Archiver] Compressed 81.60 KB of artifacts by 78.4% relative to #747
[JENKINS] Archiving <https://builds.apache.org/job/brooklyn-server-master/ws/software/winrm/pom.xml>
to org.apache.brooklyn/brooklyn-software-winrm/0.13.0-SNAPSHOT/brooklyn-software-winrm-0.13.0-SNAPSHOT.pom
channel stopped

Mime
View raw message