brooklyn-dev mailing list archives

Site index · List index
Message view « Date » · « Thread »
Top « Date » · « Thread »
From Apache Jenkins Server <jenk...@builds.apache.org>
Subject Build failed in Jenkins: brooklyn-server-master #563
Date Wed, 03 May 2017 10:40:16 GMT
See <https://builds.apache.org/job/brooklyn-server-master/563/display/redirect?page=changes>

Changes:

[alex.heneveld] fix but where osgi classpaths didn't load when using embedded framework

[alex.heneveld] fix getResources() so it dedupes URLs, fixing test

[alex.heneveld] fix bug where entity's search path isn't used when retrieving icon url's

[alex.heneveld] change handling of icon url storage

------------------------------------------
[...truncated 4.57 MB...]
java.lang.IllegalStateException: Cannot establish ssh connection to jenkins @ SshMachineLocation[LocalhostMachine:gbcg:jenkins@asf921.gq1.ygridcore.net/67.195.81.141:22(id=gbcg277oj0)]
(Exhausted available authentication methods). 
Ensure that passwordless and passphraseless ssh access is enabled using standard keys from
~/.ssh or as configured in brooklyn.properties. Check that the target host is accessible,
that credentials are correct (location and permissions if using a key), that the SFTP subsystem
is available on the remote side, and that there is sufficient random noise in /dev/random
on both ends. To debug less common causes, see the original error in the trace or log, and/or
enable 'net.schmizz' (sshj) logging.
Caused by: java.lang.IllegalStateException: 
Cannot establish ssh connection to jenkins @ SshMachineLocation[LocalhostMachine:gbcg:jenkins@asf921.gq1.ygridcore.net/67.195.81.141:22(id=gbcg277oj0)]
(Exhausted available authentication methods). 
Ensure that passwordless and passphraseless ssh access is enabled using standard keys from
~/.ssh or as configured in brooklyn.properties. Check that the target host is accessible,
that credentials are correct (location and permissions if using a key), that the SFTP subsystem
is available on the remote side, and that there is sufficient random noise in /dev/random
on both ends. To debug less common causes, see the original error in the trace or log, and/or
enable 'net.schmizz' (sshj) logging.
Caused by: org.apache.brooklyn.util.core.internal.ssh.SshException: (jenkins@asf921.gq1.ygridcore.net:22)
failed to connect: (jenkins@asf921.gq1.ygridcore.net:22) (jenkins@asf921.gq1.ygridcore.net:22)
error acquiring {hostAndPort=asf921.gq1.ygridcore.net:22, user=jenkins, ssh=941272259, password=null,
privateKeyFile=null, privateKey=null, connectTimeout=0, sessionTimeout=0} (attempt 4/4, in
time 1.13s/2m); out of retries: Exhausted available authentication methods
Caused by: org.apache.brooklyn.util.core.internal.ssh.SshException: (jenkins@asf921.gq1.ygridcore.net:22)
(jenkins@asf921.gq1.ygridcore.net:22) error acquiring {hostAndPort=asf921.gq1.ygridcore.net:22,
user=jenkins, ssh=941272259, password=null, privateKeyFile=null, privateKey=null, connectTimeout=0,
sessionTimeout=0} (attempt 4/4, in time 1.13s/2m); out of retries: Exhausted available authentication
methods
Caused by: net.schmizz.sshj.userauth.UserAuthException: Exhausted available authentication
methods

testRuntimePhase(org.apache.brooklyn.entity.software.base.lifecycle.SoftwareProcessDriverCopyResourcesTest)
 Time elapsed: 142.788 sec  <<< FAILURE!
org.apache.brooklyn.util.exceptions.PropagatedRuntimeException: 
	at org.apache.brooklyn.entity.software.base.lifecycle.SoftwareProcessDriverCopyResourcesTest.testPhase(SoftwareProcessDriverCopyResourcesTest.java:116)
	at org.apache.brooklyn.entity.software.base.lifecycle.SoftwareProcessDriverCopyResourcesTest.testRuntimePhase(SoftwareProcessDriverCopyResourcesTest.java:98)
Caused by: java.util.concurrent.ExecutionException: 
org.apache.brooklyn.core.mgmt.internal.EffectorUtils$EffectorCallPropagatedRuntimeException:
Error invoking start at Application[llbo1qst]: ProblemStartingChildrenException: org.apache.brooklyn.util.exceptions.PropagatedRuntimeException:
Error invoking start at EmptySoftwareProcessImpl{id=br7xu2djm6}: Cannot establish ssh connection
to jenkins @ SshMachineLocation[LocalhostMachine:gss8:jenkins@asf921.gq1.ygridcore.net/67.195.81.141:22(id=gss8k614an)]
(Exhausted available authentication methods). 
Ensure that passwordless and passphraseless ssh access is enabled using standard keys from
~/.ssh or as configured in brooklyn.properties. Check that the target host is accessible,
that credentials are correct (location and permissions if using a key), that the SFTP subsystem
is available on the remote side, and that there is sufficient random noise in /dev/random
on both ends. To debug less common causes, see the original error in the trace or log, and/or
enable 'net.schmizz' (sshj) logging.: SshException: (jenkins@asf921.gq1.ygridcore.net:22)
failed to connect: (jenkins@asf921.gq1.ygridcore.net:22) (jenkins@asf921.gq1.ygridcore.net:22)
error acquiring {hostAndPort=asf921.gq1.ygridcore.net:22, user=jenkins, ssh=279264643, password=null,
privateKeyFile=null, privateKey=null, connectTimeout=0, sessionTimeout=0} (attempt 4/4, in
time 2m 22s/2m); out of retries: Exhausted available authentication methods
	at org.apache.brooklyn.entity.software.base.lifecycle.SoftwareProcessDriverCopyResourcesTest.testPhase(SoftwareProcessDriverCopyResourcesTest.java:116)
	at org.apache.brooklyn.entity.software.base.lifecycle.SoftwareProcessDriverCopyResourcesTest.testRuntimePhase(SoftwareProcessDriverCopyResourcesTest.java:98)
Caused by: org.apache.brooklyn.core.mgmt.internal.EffectorUtils$EffectorCallPropagatedRuntimeException:
Error invoking start at Application[llbo1qst]
Caused by: java.util.concurrent.ExecutionException: 
org.apache.brooklyn.core.entity.AbstractApplication$ProblemStartingChildrenException: org.apache.brooklyn.util.exceptions.PropagatedRuntimeException:
Error invoking start at EmptySoftwareProcessImpl{id=br7xu2djm6}: Cannot establish ssh connection
to jenkins @ SshMachineLocation[LocalhostMachine:gss8:jenkins@asf921.gq1.ygridcore.net/67.195.81.141:22(id=gss8k614an)]
(Exhausted available authentication methods). 
Ensure that passwordless and passphraseless ssh access is enabled using standard keys from
~/.ssh or as configured in brooklyn.properties. Check that the target host is accessible,
that credentials are correct (location and permissions if using a key), that the SFTP subsystem
is available on the remote side, and that there is sufficient random noise in /dev/random
on both ends. To debug less common causes, see the original error in the trace or log, and/or
enable 'net.schmizz' (sshj) logging.: SshException: (jenkins@asf921.gq1.ygridcore.net:22)
failed to connect: (jenkins@asf921.gq1.ygridcore.net:22) (jenkins@asf921.gq1.ygridcore.net:22)
error acquiring {hostAndPort=asf921.gq1.ygridcore.net:22, user=jenkins, ssh=279264643, password=null,
privateKeyFile=null, privateKey=null, connectTimeout=0, sessionTimeout=0} (attempt 4/4, in
time 2m 22s/2m); out of retries: Exhausted available authentication methods
Caused by: org.apache.brooklyn.core.entity.AbstractApplication$ProblemStartingChildrenException:

org.apache.brooklyn.util.exceptions.PropagatedRuntimeException: Error invoking start at EmptySoftwareProcessImpl{id=br7xu2djm6}:
Cannot establish ssh connection to jenkins @ SshMachineLocation[LocalhostMachine:gss8:jenkins@asf921.gq1.ygridcore.net/67.195.81.141:22(id=gss8k614an)]
(Exhausted available authentication methods). 
Ensure that passwordless and passphraseless ssh access is enabled using standard keys from
~/.ssh or as configured in brooklyn.properties. Check that the target host is accessible,
that credentials are correct (location and permissions if using a key), that the SFTP subsystem
is available on the remote side, and that there is sufficient random noise in /dev/random
on both ends. To debug less common causes, see the original error in the trace or log, and/or
enable 'net.schmizz' (sshj) logging.: SshException: (jenkins@asf921.gq1.ygridcore.net:22)
failed to connect: (jenkins@asf921.gq1.ygridcore.net:22) (jenkins@asf921.gq1.ygridcore.net:22)
error acquiring {hostAndPort=asf921.gq1.ygridcore.net:22, user=jenkins, ssh=279264643, password=null,
privateKeyFile=null, privateKey=null, connectTimeout=0, sessionTimeout=0} (attempt 4/4, in
time 2m 22s/2m); out of retries: Exhausted available authentication methods
Caused by: org.apache.brooklyn.util.exceptions.PropagatedRuntimeException: 
Caused by: java.util.concurrent.ExecutionException: 
org.apache.brooklyn.util.exceptions.PropagatedRuntimeException: Error invoking start at EmptySoftwareProcessImpl{id=br7xu2djm6}:
Cannot establish ssh connection to jenkins @ SshMachineLocation[LocalhostMachine:gss8:jenkins@asf921.gq1.ygridcore.net/67.195.81.141:22(id=gss8k614an)]
(Exhausted available authentication methods). 
Ensure that passwordless and passphraseless ssh access is enabled using standard keys from
~/.ssh or as configured in brooklyn.properties. Check that the target host is accessible,
that credentials are correct (location and permissions if using a key), that the SFTP subsystem
is available on the remote side, and that there is sufficient random noise in /dev/random
on both ends. To debug less common causes, see the original error in the trace or log, and/or
enable 'net.schmizz' (sshj) logging.: SshException: (jenkins@asf921.gq1.ygridcore.net:22)
failed to connect: (jenkins@asf921.gq1.ygridcore.net:22) (jenkins@asf921.gq1.ygridcore.net:22)
error acquiring {hostAndPort=asf921.gq1.ygridcore.net:22, user=jenkins, ssh=279264643, password=null,
privateKeyFile=null, privateKey=null, connectTimeout=0, sessionTimeout=0} (attempt 4/4, in
time 2m 22s/2m); out of retries: Exhausted available authentication methods
Caused by: org.apache.brooklyn.util.exceptions.PropagatedRuntimeException: 
Caused by: java.util.concurrent.ExecutionException: 
org.apache.brooklyn.core.mgmt.internal.EffectorUtils$EffectorCallPropagatedRuntimeException:
Error invoking start at EmptySoftwareProcessImpl{id=br7xu2djm6}: Cannot establish ssh connection
to jenkins @ SshMachineLocation[LocalhostMachine:gss8:jenkins@asf921.gq1.ygridcore.net/67.195.81.141:22(id=gss8k614an)]
(Exhausted available authentication methods). 
Ensure that passwordless and passphraseless ssh access is enabled using standard keys from
~/.ssh or as configured in brooklyn.properties. Check that the target host is accessible,
that credentials are correct (location and permissions if using a key), that the SFTP subsystem
is available on the remote side, and that there is sufficient random noise in /dev/random
on both ends. To debug less common causes, see the original error in the trace or log, and/or
enable 'net.schmizz' (sshj) logging.: SshException: (jenkins@asf921.gq1.ygridcore.net:22)
failed to connect: (jenkins@asf921.gq1.ygridcore.net:22) (jenkins@asf921.gq1.ygridcore.net:22)
error acquiring {hostAndPort=asf921.gq1.ygridcore.net:22, user=jenkins, ssh=279264643, password=null,
privateKeyFile=null, privateKey=null, connectTimeout=0, sessionTimeout=0} (attempt 4/4, in
time 2m 22s/2m); out of retries: Exhausted available authentication methods
Caused by: org.apache.brooklyn.core.mgmt.internal.EffectorUtils$EffectorCallPropagatedRuntimeException:
Error invoking start at EmptySoftwareProcessImpl{id=br7xu2djm6}
Caused by: org.apache.brooklyn.util.exceptions.PropagatedRuntimeException: 
Caused by: java.util.concurrent.ExecutionException: 
org.apache.brooklyn.util.exceptions.PropagatedRuntimeException: Cannot establish ssh connection
to jenkins @ SshMachineLocation[LocalhostMachine:gss8:jenkins@asf921.gq1.ygridcore.net/67.195.81.141:22(id=gss8k614an)]
(Exhausted available authentication methods). 
Ensure that passwordless and passphraseless ssh access is enabled using standard keys from
~/.ssh or as configured in brooklyn.properties. Check that the target host is accessible,
that credentials are correct (location and permissions if using a key), that the SFTP subsystem
is available on the remote side, and that there is sufficient random noise in /dev/random
on both ends. To debug less common causes, see the original error in the trace or log, and/or
enable 'net.schmizz' (sshj) logging.: SshException: (jenkins@asf921.gq1.ygridcore.net:22)
failed to connect: (jenkins@asf921.gq1.ygridcore.net:22) (jenkins@asf921.gq1.ygridcore.net:22)
error acquiring {hostAndPort=asf921.gq1.ygridcore.net:22, user=jenkins, ssh=279264643, password=null,
privateKeyFile=null, privateKey=null, connectTimeout=0, sessionTimeout=0} (attempt 4/4, in
time 2m 22s/2m); out of retries: Exhausted available authentication methods
Caused by: org.apache.brooklyn.util.exceptions.PropagatedRuntimeException: 
Caused by: java.util.concurrent.ExecutionException: 
org.apache.brooklyn.util.exceptions.PropagatedRuntimeException: Cannot establish ssh connection
to jenkins @ SshMachineLocation[LocalhostMachine:gss8:jenkins@asf921.gq1.ygridcore.net/67.195.81.141:22(id=gss8k614an)]
(Exhausted available authentication methods). 
Ensure that passwordless and passphraseless ssh access is enabled using standard keys from
~/.ssh or as configured in brooklyn.properties. Check that the target host is accessible,
that credentials are correct (location and permissions if using a key), that the SFTP subsystem
is available on the remote side, and that there is sufficient random noise in /dev/random
on both ends. To debug less common causes, see the original error in the trace or log, and/or
enable 'net.schmizz' (sshj) logging.: SshException: (jenkins@asf921.gq1.ygridcore.net:22)
failed to connect: (jenkins@asf921.gq1.ygridcore.net:22) (jenkins@asf921.gq1.ygridcore.net:22)
error acquiring {hostAndPort=asf921.gq1.ygridcore.net:22, user=jenkins, ssh=279264643, password=null,
privateKeyFile=null, privateKey=null, connectTimeout=0, sessionTimeout=0} (attempt 4/4, in
time 2m 22s/2m); out of retries: Exhausted available authentication methods
Caused by: org.apache.brooklyn.util.exceptions.PropagatedRuntimeException: 
Caused by: java.util.concurrent.ExecutionException: 
org.apache.brooklyn.util.exceptions.PropagatedRuntimeException: Cannot establish ssh connection
to jenkins @ SshMachineLocation[LocalhostMachine:gss8:jenkins@asf921.gq1.ygridcore.net/67.195.81.141:22(id=gss8k614an)]
(Exhausted available authentication methods). 
Ensure that passwordless and passphraseless ssh access is enabled using standard keys from
~/.ssh or as configured in brooklyn.properties. Check that the target host is accessible,
that credentials are correct (location and permissions if using a key), that the SFTP subsystem
is available on the remote side, and that there is sufficient random noise in /dev/random
on both ends. To debug less common causes, see the original error in the trace or log, and/or
enable 'net.schmizz' (sshj) logging.: SshException: (jenkins@asf921.gq1.ygridcore.net:22)
failed to connect: (jenkins@asf921.gq1.ygridcore.net:22) (jenkins@asf921.gq1.ygridcore.net:22)
error acquiring {hostAndPort=asf921.gq1.ygridcore.net:22, user=jenkins, ssh=279264643, password=null,
privateKeyFile=null, privateKey=null, connectTimeout=0, sessionTimeout=0} (attempt 4/4, in
time 2m 22s/2m); out of retries: Exhausted available authentication methods
Caused by: org.apache.brooklyn.util.exceptions.PropagatedRuntimeException: 
Caused by: java.util.concurrent.ExecutionException: 
org.apache.brooklyn.util.exceptions.PropagatedRuntimeException: Cannot establish ssh connection
to jenkins @ SshMachineLocation[LocalhostMachine:gss8:jenkins@asf921.gq1.ygridcore.net/67.195.81.141:22(id=gss8k614an)]
(Exhausted available authentication methods). 
Ensure that passwordless and passphraseless ssh access is enabled using standard keys from
~/.ssh or as configured in brooklyn.properties. Check that the target host is accessible,
that credentials are correct (location and permissions if using a key), that the SFTP subsystem
is available on the remote side, and that there is sufficient random noise in /dev/random
on both ends. To debug less common causes, see the original error in the trace or log, and/or
enable 'net.schmizz' (sshj) logging.: SshException: (jenkins@asf921.gq1.ygridcore.net:22)
failed to connect: (jenkins@asf921.gq1.ygridcore.net:22) (jenkins@asf921.gq1.ygridcore.net:22)
error acquiring {hostAndPort=asf921.gq1.ygridcore.net:22, user=jenkins, ssh=279264643, password=null,
privateKeyFile=null, privateKey=null, connectTimeout=0, sessionTimeout=0} (attempt 4/4, in
time 2m 22s/2m); out of retries: Exhausted available authentication methods
Caused by: org.apache.brooklyn.util.exceptions.PropagatedRuntimeException: 
Caused by: java.util.concurrent.ExecutionException: 
java.lang.IllegalStateException: Cannot establish ssh connection to jenkins @ SshMachineLocation[LocalhostMachine:gss8:jenkins@asf921.gq1.ygridcore.net/67.195.81.141:22(id=gss8k614an)]
(Exhausted available authentication methods). 
Ensure that passwordless and passphraseless ssh access is enabled using standard keys from
~/.ssh or as configured in brooklyn.properties. Check that the target host is accessible,
that credentials are correct (location and permissions if using a key), that the SFTP subsystem
is available on the remote side, and that there is sufficient random noise in /dev/random
on both ends. To debug less common causes, see the original error in the trace or log, and/or
enable 'net.schmizz' (sshj) logging.
Caused by: java.lang.IllegalStateException: 
Cannot establish ssh connection to jenkins @ SshMachineLocation[LocalhostMachine:gss8:jenkins@asf921.gq1.ygridcore.net/67.195.81.141:22(id=gss8k614an)]
(Exhausted available authentication methods). 
Ensure that passwordless and passphraseless ssh access is enabled using standard keys from
~/.ssh or as configured in brooklyn.properties. Check that the target host is accessible,
that credentials are correct (location and permissions if using a key), that the SFTP subsystem
is available on the remote side, and that there is sufficient random noise in /dev/random
on both ends. To debug less common causes, see the original error in the trace or log, and/or
enable 'net.schmizz' (sshj) logging.
Caused by: org.apache.brooklyn.util.core.internal.ssh.SshException: (jenkins@asf921.gq1.ygridcore.net:22)
failed to connect: (jenkins@asf921.gq1.ygridcore.net:22) (jenkins@asf921.gq1.ygridcore.net:22)
error acquiring {hostAndPort=asf921.gq1.ygridcore.net:22, user=jenkins, ssh=279264643, password=null,
privateKeyFile=null, privateKey=null, connectTimeout=0, sessionTimeout=0} (attempt 4/4, in
time 2m 22s/2m); out of retries: Exhausted available authentication methods
Caused by: org.apache.brooklyn.util.core.internal.ssh.SshException: (jenkins@asf921.gq1.ygridcore.net:22)
(jenkins@asf921.gq1.ygridcore.net:22) error acquiring {hostAndPort=asf921.gq1.ygridcore.net:22,
user=jenkins, ssh=279264643, password=null, privateKeyFile=null, privateKey=null, connectTimeout=0,
sessionTimeout=0} (attempt 4/4, in time 2m 22s/2m); out of retries: Exhausted available authentication
methods
Caused by: net.schmizz.sshj.userauth.UserAuthException: Exhausted available authentication
methods


Results :

Failed tests: 
  SoftwareProcessDriverCopyResourcesTest.testCustomisePhase:93->testPhase:116 » PropagatedRuntime
  SoftwareProcessDriverCopyResourcesTest.testInstallPhase:88->testPhase:116 » PropagatedRuntime
  SoftwareProcessDriverCopyResourcesTest.testPreInstallPhase:83->testPhase:116 » PropagatedRuntime
  SoftwareProcessDriverCopyResourcesTest.testRuntimePhase:98->testPhase:116 » PropagatedRuntime

Tests run: 232, Failures: 4, Errors: 0, Skipped: 0

[JENKINS] Recording test results
[INFO] ------------------------------------------------------------------------
[INFO] Reactor Summary:
[INFO] 
[INFO] Brooklyn Server Root ............................... SUCCESS [  7.028 s]
[INFO] Brooklyn Parent Project ............................ SUCCESS [  9.436 s]
[INFO] Brooklyn Test Support Utilities .................... SUCCESS [ 12.400 s]
[INFO] Brooklyn Logback Includable Configuration .......... SUCCESS [  3.324 s]
[INFO] Brooklyn Common Utilities .......................... SUCCESS [ 31.707 s]
[INFO] Brooklyn API ....................................... SUCCESS [  6.565 s]
[INFO] CAMP Server Parent Project ......................... SUCCESS [  7.824 s]
[INFO] CAMP Base .......................................... SUCCESS [ 21.105 s]
[INFO] Brooklyn Test Support .............................. SUCCESS [  4.617 s]
[INFO] Brooklyn REST Swagger Apidoc Utilities ............. SUCCESS [  3.600 s]
[INFO] Brooklyn Logback Configuration ..................... SUCCESS [ 15.916 s]
[INFO] CAMP Server ........................................ SUCCESS [ 21.028 s]
[INFO] Brooklyn Felix Runtime ............................. SUCCESS [ 13.137 s]
[INFO] Brooklyn Groovy Utilities .......................... SUCCESS [ 10.900 s]
[INFO] Brooklyn Core ...................................... SUCCESS [03:45 min]
[INFO] Brooklyn Policies .................................. SUCCESS [01:16 min]
[INFO] Brooklyn WinRM Software Entities ................... SUCCESS [ 20.977 s]
[INFO] Brooklyn Secure JMXMP Agent ........................ SUCCESS [ 29.164 s]
[INFO] Brooklyn JMX RMI Agent ............................. SUCCESS [ 21.894 s]
[INFO] Brooklyn Jclouds Location Targets .................. SUCCESS [ 54.191 s]
[INFO] Brooklyn Software Base ............................. FAILURE [03:48 min]
[INFO] Brooklyn CAMP ...................................... SKIPPED
[INFO] Brooklyn Hazelcast Storage ......................... SKIPPED
[INFO] Brooklyn Launcher Common ........................... SKIPPED
[INFO] Brooklyn REST API .................................. SKIPPED
[INFO] Brooklyn REST Resources ............................ SKIPPED
[INFO] Brooklyn REST Server ............................... SKIPPED
[INFO] Brooklyn Launcher .................................. SKIPPED
[INFO] Brooklyn Command Line Interface .................... SKIPPED
[INFO] Brooklyn Test Framework ............................ SKIPPED
[INFO] Brooklyn OSGi init ................................. SKIPPED
[INFO] Brooklyn Karaf ..................................... SKIPPED
[INFO] Jetty config fragment .............................. SKIPPED
[INFO] Apache Http Component extension .................... SKIPPED
[INFO] Brooklyn Karaf Features ............................ SKIPPED
[INFO] Brooklyn Karaf Shell Commands ...................... SKIPPED
[INFO] Brooklyn Karaf Tests ............................... SKIPPED
[INFO] ------------------------------------------------------------------------
[INFO] BUILD FAILURE
[INFO] ------------------------------------------------------------------------
[INFO] Total time: 17:32 min
[INFO] Finished at: 2017-05-03T10:34:53+00:00
[INFO] Final Memory: 97M/839M
[INFO] ------------------------------------------------------------------------
Waiting for Jenkins to finish collecting data
[ERROR] Failed to execute goal org.apache.maven.plugins:maven-surefire-plugin:2.19.1:test
(default-test) on project brooklyn-software-base: There are test failures.
[ERROR] 
[ERROR] Please refer to <https://builds.apache.org/job/brooklyn-server-master/ws/software/base/target/surefire-reports>
for the individual test results.
[ERROR] -> [Help 1]
[ERROR] 
[ERROR] To see the full stack trace of the errors, re-run Maven with the -e switch.
[ERROR] Re-run Maven using the -X switch to enable full debug logging.
[ERROR] 
[ERROR] For more information about the errors and possible solutions, please read the following
articles:
[ERROR] [Help 1] http://cwiki.apache.org/confluence/display/MAVEN/MojoFailureException
[ERROR] 
[ERROR] After correcting the problems, you can resume the build with the command
[ERROR]   mvn <goals> -rf :brooklyn-software-base
[JENKINS] Archiving <https://builds.apache.org/job/brooklyn-server-master/ws/camp/pom.xml>
to org.apache.brooklyn.camp/camp-parent/0.12.0-SNAPSHOT/camp-parent-0.12.0-SNAPSHOT.pom
No artifacts from brooklyn-server-master » CAMP Server Parent Project #562 to compare, so
performing full copy of artifacts
[JENKINS] Archiving <https://builds.apache.org/job/brooklyn-server-master/ws/utils/rt-felix/pom.xml>
to org.apache.brooklyn/brooklyn-rt-felix/0.12.0-SNAPSHOT/brooklyn-rt-felix-0.12.0-SNAPSHOT.pom
[JENKINS] Archiving <https://builds.apache.org/job/brooklyn-server-master/ws/utils/rt-felix/target/brooklyn-rt-felix-0.12.0-SNAPSHOT.jar>
to org.apache.brooklyn/brooklyn-rt-felix/0.12.0-SNAPSHOT/brooklyn-rt-felix-0.12.0-SNAPSHOT.jar
[JENKINS] Archiving <https://builds.apache.org/job/brooklyn-server-master/ws/utils/rt-felix/target/brooklyn-rt-felix-0.12.0-SNAPSHOT-tests.jar>
to org.apache.brooklyn/brooklyn-rt-felix/0.12.0-SNAPSHOT/brooklyn-rt-felix-0.12.0-SNAPSHOT-tests.jar
[JENKINS] Archiving <https://builds.apache.org/job/brooklyn-server-master/ws/utils/rt-felix/target/brooklyn-rt-felix-0.12.0-SNAPSHOT-sources.jar>
to org.apache.brooklyn/brooklyn-rt-felix/0.12.0-SNAPSHOT/brooklyn-rt-felix-0.12.0-SNAPSHOT-sources.jar
[JENKINS] Archiving <https://builds.apache.org/job/brooklyn-server-master/ws/utils/rt-felix/target/brooklyn-rt-felix-0.12.0-SNAPSHOT-test-sources.jar>
to org.apache.brooklyn/brooklyn-rt-felix/0.12.0-SNAPSHOT/brooklyn-rt-felix-0.12.0-SNAPSHOT-test-sources.jar
No artifacts from brooklyn-server-master » Brooklyn Felix Runtime #562 to compare, so performing
full copy of artifacts
[JENKINS] Archiving <https://builds.apache.org/job/brooklyn-server-master/ws/test-framework/pom.xml>
to org.apache.brooklyn/brooklyn-test-framework/0.12.0-SNAPSHOT/brooklyn-test-framework-0.12.0-SNAPSHOT.pom
[JENKINS] Archiving <https://builds.apache.org/job/brooklyn-server-master/ws/core/pom.xml>
to org.apache.brooklyn/brooklyn-core/0.12.0-SNAPSHOT/brooklyn-core-0.12.0-SNAPSHOT.pom
[JENKINS] Archiving <https://builds.apache.org/job/brooklyn-server-master/ws/core/target/brooklyn-core-0.12.0-SNAPSHOT.jar>
to org.apache.brooklyn/brooklyn-core/0.12.0-SNAPSHOT/brooklyn-core-0.12.0-SNAPSHOT.jar
[JENKINS] Archiving <https://builds.apache.org/job/brooklyn-server-master/ws/core/target/brooklyn-core-0.12.0-SNAPSHOT-tests.jar>
to org.apache.brooklyn/brooklyn-core/0.12.0-SNAPSHOT/brooklyn-core-0.12.0-SNAPSHOT-tests.jar
[JENKINS] Archiving <https://builds.apache.org/job/brooklyn-server-master/ws/core/target/brooklyn-core-0.12.0-SNAPSHOT-sources.jar>
to org.apache.brooklyn/brooklyn-core/0.12.0-SNAPSHOT/brooklyn-core-0.12.0-SNAPSHOT-sources.jar
[JENKINS] Archiving <https://builds.apache.org/job/brooklyn-server-master/ws/core/target/brooklyn-core-0.12.0-SNAPSHOT-test-sources.jar>
to org.apache.brooklyn/brooklyn-core/0.12.0-SNAPSHOT/brooklyn-core-0.12.0-SNAPSHOT-test-sources.jar
[JENKINS] Archiving <https://builds.apache.org/job/brooklyn-server-master/ws/camp/camp-server/pom.xml>
to org.apache.brooklyn.camp/camp-server/0.12.0-SNAPSHOT/camp-server-0.12.0-SNAPSHOT.pom
[JENKINS] Archiving <https://builds.apache.org/job/brooklyn-server-master/ws/camp/camp-server/target/camp-server-0.12.0-SNAPSHOT.jar>
to org.apache.brooklyn.camp/camp-server/0.12.0-SNAPSHOT/camp-server-0.12.0-SNAPSHOT.jar
[JENKINS] Archiving <https://builds.apache.org/job/brooklyn-server-master/ws/camp/camp-server/target/camp-server-0.12.0-SNAPSHOT-tests.jar>
to org.apache.brooklyn.camp/camp-server/0.12.0-SNAPSHOT/camp-server-0.12.0-SNAPSHOT-tests.jar
[JENKINS] Archiving <https://builds.apache.org/job/brooklyn-server-master/ws/camp/camp-server/target/camp-server-0.12.0-SNAPSHOT-sources.jar>
to org.apache.brooklyn.camp/camp-server/0.12.0-SNAPSHOT/camp-server-0.12.0-SNAPSHOT-sources.jar
[JENKINS] Archiving <https://builds.apache.org/job/brooklyn-server-master/ws/camp/camp-server/target/camp-server-0.12.0-SNAPSHOT-test-sources.jar>
to org.apache.brooklyn.camp/camp-server/0.12.0-SNAPSHOT/camp-server-0.12.0-SNAPSHOT-test-sources.jar
No artifacts from brooklyn-server-master » CAMP Server #562 to compare, so performing full
copy of artifacts
[JENKINS] Archiving <https://builds.apache.org/job/brooklyn-server-master/ws/launcher/pom.xml>
to org.apache.brooklyn/brooklyn-launcher/0.12.0-SNAPSHOT/brooklyn-launcher-0.12.0-SNAPSHOT.pom
[JENKINS] Archiving <https://builds.apache.org/job/brooklyn-server-master/ws/karaf/pom.xml>
to org.apache.brooklyn/brooklyn-karaf/0.12.0-SNAPSHOT/brooklyn-karaf-0.12.0-SNAPSHOT.pom
[JENKINS] Archiving <https://builds.apache.org/job/brooklyn-server-master/ws/karaf/httpcomponent-extension/pom.xml>
to org.apache.brooklyn/brooklyn-karaf-httpcomponents-extension/0.12.0-SNAPSHOT/brooklyn-karaf-httpcomponents-extension-0.12.0-SNAPSHOT.pom
[JENKINS] Archiving <https://builds.apache.org/job/brooklyn-server-master/ws/utils/test-support/pom.xml>
to org.apache.brooklyn/brooklyn-utils-test-support/0.12.0-SNAPSHOT/brooklyn-utils-test-support-0.12.0-SNAPSHOT.pom
[JENKINS] Archiving <https://builds.apache.org/job/brooklyn-server-master/ws/utils/test-support/target/brooklyn-utils-test-support-0.12.0-SNAPSHOT.jar>
to org.apache.brooklyn/brooklyn-utils-test-support/0.12.0-SNAPSHOT/brooklyn-utils-test-support-0.12.0-SNAPSHOT.jar
[JENKINS] Archiving <https://builds.apache.org/job/brooklyn-server-master/ws/utils/test-support/target/brooklyn-utils-test-support-0.12.0-SNAPSHOT-sources.jar>
to org.apache.brooklyn/brooklyn-utils-test-support/0.12.0-SNAPSHOT/brooklyn-utils-test-support-0.12.0-SNAPSHOT-sources.jar
[JENKINS] Archiving <https://builds.apache.org/job/brooklyn-server-master/ws/utils/test-support/target/brooklyn-utils-test-support-0.12.0-SNAPSHOT-test-sources.jar>
to org.apache.brooklyn/brooklyn-utils-test-support/0.12.0-SNAPSHOT/brooklyn-utils-test-support-0.12.0-SNAPSHOT-test-sources.jar
No artifacts from brooklyn-server-master » Brooklyn Test Support Utilities #562 to compare,
so performing full copy of artifacts
[JENKINS] Archiving <https://builds.apache.org/job/brooklyn-server-master/ws/software/base/pom.xml>
to org.apache.brooklyn/brooklyn-software-base/0.12.0-SNAPSHOT/brooklyn-software-base-0.12.0-SNAPSHOT.pom
[JENKINS] Archiving <https://builds.apache.org/job/brooklyn-server-master/ws/utils/groovy/pom.xml>
to org.apache.brooklyn/brooklyn-utils-groovy/0.12.0-SNAPSHOT/brooklyn-utils-groovy-0.12.0-SNAPSHOT.pom
[JENKINS] Archiving <https://builds.apache.org/job/brooklyn-server-master/ws/utils/groovy/target/brooklyn-utils-groovy-0.12.0-SNAPSHOT.jar>
to org.apache.brooklyn/brooklyn-utils-groovy/0.12.0-SNAPSHOT/brooklyn-utils-groovy-0.12.0-SNAPSHOT.jar
[JENKINS] Archiving <https://builds.apache.org/job/brooklyn-server-master/ws/utils/groovy/target/brooklyn-utils-groovy-0.12.0-SNAPSHOT-tests.jar>
to org.apache.brooklyn/brooklyn-utils-groovy/0.12.0-SNAPSHOT/brooklyn-utils-groovy-0.12.0-SNAPSHOT-tests.jar
[JENKINS] Archiving <https://builds.apache.org/job/brooklyn-server-master/ws/utils/groovy/target/brooklyn-utils-groovy-0.12.0-SNAPSHOT-sources.jar>
to org.apache.brooklyn/brooklyn-utils-groovy/0.12.0-SNAPSHOT/brooklyn-utils-groovy-0.12.0-SNAPSHOT-sources.jar
[JENKINS] Archiving <https://builds.apache.org/job/brooklyn-server-master/ws/utils/groovy/target/brooklyn-utils-groovy-0.12.0-SNAPSHOT-test-sources.jar>
to org.apache.brooklyn/brooklyn-utils-groovy/0.12.0-SNAPSHOT/brooklyn-utils-groovy-0.12.0-SNAPSHOT-test-sources.jar
No artifacts from brooklyn-server-master » Brooklyn Groovy Utilities #562 to compare, so
performing full copy of artifacts
[JENKINS] Archiving <https://builds.apache.org/job/brooklyn-server-master/ws/utils/rest-swagger/pom.xml>
to org.apache.brooklyn/brooklyn-utils-rest-swagger/0.12.0-SNAPSHOT/brooklyn-utils-rest-swagger-0.12.0-SNAPSHOT.pom
[JENKINS] Archiving <https://builds.apache.org/job/brooklyn-server-master/ws/utils/rest-swagger/target/brooklyn-utils-rest-swagger-0.12.0-SNAPSHOT.jar>
to org.apache.brooklyn/brooklyn-utils-rest-swagger/0.12.0-SNAPSHOT/brooklyn-utils-rest-swagger-0.12.0-SNAPSHOT.jar
[JENKINS] Archiving <https://builds.apache.org/job/brooklyn-server-master/ws/utils/rest-swagger/target/brooklyn-utils-rest-swagger-0.12.0-SNAPSHOT-sources.jar>
to org.apache.brooklyn/brooklyn-utils-rest-swagger/0.12.0-SNAPSHOT/brooklyn-utils-rest-swagger-0.12.0-SNAPSHOT-sources.jar
[JENKINS] Archiving <https://builds.apache.org/job/brooklyn-server-master/ws/utils/rest-swagger/target/brooklyn-utils-rest-swagger-0.12.0-SNAPSHOT-test-sources.jar>
to org.apache.brooklyn/brooklyn-utils-rest-swagger/0.12.0-SNAPSHOT/brooklyn-utils-rest-swagger-0.12.0-SNAPSHOT-test-sources.jar
No artifacts from brooklyn-server-master » Brooklyn REST Swagger Apidoc Utilities #562 to
compare, so performing full copy of artifacts
[JENKINS] Archiving <https://builds.apache.org/job/brooklyn-server-master/ws/launcher-common/pom.xml>
to org.apache.brooklyn/brooklyn-launcher-common/0.12.0-SNAPSHOT/brooklyn-launcher-common-0.12.0-SNAPSHOT.pom
[JENKINS] Archiving <https://builds.apache.org/job/brooklyn-server-master/ws/camp/camp-base/pom.xml>
to org.apache.brooklyn.camp/camp-base/0.12.0-SNAPSHOT/camp-base-0.12.0-SNAPSHOT.pom
[JENKINS] Archiving <https://builds.apache.org/job/brooklyn-server-master/ws/camp/camp-base/target/camp-base-0.12.0-SNAPSHOT.jar>
to org.apache.brooklyn.camp/camp-base/0.12.0-SNAPSHOT/camp-base-0.12.0-SNAPSHOT.jar
[JENKINS] Archiving <https://builds.apache.org/job/brooklyn-server-master/ws/camp/camp-base/target/camp-base-0.12.0-SNAPSHOT-tests.jar>
to org.apache.brooklyn.camp/camp-base/0.12.0-SNAPSHOT/camp-base-0.12.0-SNAPSHOT-tests.jar
[JENKINS] Archiving <https://builds.apache.org/job/brooklyn-server-master/ws/camp/camp-base/target/camp-base-0.12.0-SNAPSHOT-sources.jar>
to org.apache.brooklyn.camp/camp-base/0.12.0-SNAPSHOT/camp-base-0.12.0-SNAPSHOT-sources.jar
[JENKINS] Archiving <https://builds.apache.org/job/brooklyn-server-master/ws/camp/camp-base/target/camp-base-0.12.0-SNAPSHOT-test-sources.jar>
to org.apache.brooklyn.camp/camp-base/0.12.0-SNAPSHOT/camp-base-0.12.0-SNAPSHOT-test-sources.jar
No artifacts from brooklyn-server-master » CAMP Base #562 to compare, so performing full
copy of artifacts
[JENKINS] Archiving <https://builds.apache.org/job/brooklyn-server-master/ws/camp/camp-brooklyn/pom.xml>
to org.apache.brooklyn/brooklyn-camp/0.12.0-SNAPSHOT/brooklyn-camp-0.12.0-SNAPSHOT.pom
[JENKINS] Archiving <https://builds.apache.org/job/brooklyn-server-master/ws/karaf/jetty-config/pom.xml>
to org.apache.brooklyn/brooklyn-karaf-jetty-config/0.12.0-SNAPSHOT/brooklyn-karaf-jetty-config-0.12.0-SNAPSHOT.pom
[JENKINS] Archiving <https://builds.apache.org/job/brooklyn-server-master/ws/server-cli/pom.xml>
to org.apache.brooklyn/brooklyn-cli/0.12.0-SNAPSHOT/brooklyn-cli-0.12.0-SNAPSHOT.pom
[JENKINS] Archiving <https://builds.apache.org/job/brooklyn-server-master/ws/logging/logback-xml/pom.xml>
to org.apache.brooklyn/brooklyn-logback-xml/0.12.0-SNAPSHOT/brooklyn-logback-xml-0.12.0-SNAPSHOT.pom
[JENKINS] Archiving <https://builds.apache.org/job/brooklyn-server-master/ws/logging/logback-xml/target/brooklyn-logback-xml-0.12.0-SNAPSHOT.jar>
to org.apache.brooklyn/brooklyn-logback-xml/0.12.0-SNAPSHOT/brooklyn-logback-xml-0.12.0-SNAPSHOT.jar
[JENKINS] Archiving <https://builds.apache.org/job/brooklyn-server-master/ws/logging/logback-xml/target/brooklyn-logback-xml-0.12.0-SNAPSHOT-sources.jar>
to org.apache.brooklyn/brooklyn-logback-xml/0.12.0-SNAPSHOT/brooklyn-logback-xml-0.12.0-SNAPSHOT-sources.jar
[JENKINS] Archiving <https://builds.apache.org/job/brooklyn-server-master/ws/logging/logback-xml/target/brooklyn-logback-xml-0.12.0-SNAPSHOT-test-sources.jar>
to org.apache.brooklyn/brooklyn-logback-xml/0.12.0-SNAPSHOT/brooklyn-logback-xml-0.12.0-SNAPSHOT-test-sources.jar
No artifacts from brooklyn-server-master » Brooklyn Logback Configuration #562 to compare,
so performing full copy of artifacts
[JENKINS] Archiving <https://builds.apache.org/job/brooklyn-server-master/ws/karaf/itests/pom.xml>
to org.apache.brooklyn/brooklyn-features-itests/0.12.0-SNAPSHOT/brooklyn-features-itests-0.12.0-SNAPSHOT.pom
[JENKINS] Archiving <https://builds.apache.org/job/brooklyn-server-master/ws/test-support/pom.xml>
to org.apache.brooklyn/brooklyn-test-support/0.12.0-SNAPSHOT/brooklyn-test-support-0.12.0-SNAPSHOT.pom
[JENKINS] Archiving <https://builds.apache.org/job/brooklyn-server-master/ws/test-support/target/brooklyn-test-support-0.12.0-SNAPSHOT.jar>
to org.apache.brooklyn/brooklyn-test-support/0.12.0-SNAPSHOT/brooklyn-test-support-0.12.0-SNAPSHOT.jar
[JENKINS] Archiving <https://builds.apache.org/job/brooklyn-server-master/ws/test-support/target/brooklyn-test-support-0.12.0-SNAPSHOT-sources.jar>
to org.apache.brooklyn/brooklyn-test-support/0.12.0-SNAPSHOT/brooklyn-test-support-0.12.0-SNAPSHOT-sources.jar
[JENKINS] Archiving <https://builds.apache.org/job/brooklyn-server-master/ws/test-support/target/brooklyn-test-support-0.12.0-SNAPSHOT-test-sources.jar>
to org.apache.brooklyn/brooklyn-test-support/0.12.0-SNAPSHOT/brooklyn-test-support-0.12.0-SNAPSHOT-test-sources.jar
No artifacts from brooklyn-server-master » Brooklyn Test Support #562 to compare, so performing
full copy of artifacts
[JENKINS] Archiving <https://builds.apache.org/job/brooklyn-server-master/ws/rest/rest-server/pom.xml>
to org.apache.brooklyn/brooklyn-rest-server/0.12.0-SNAPSHOT/brooklyn-rest-server-0.12.0-SNAPSHOT.pom
[JENKINS] Archiving <https://builds.apache.org/job/brooklyn-server-master/ws/api/pom.xml>
to org.apache.brooklyn/brooklyn-api/0.12.0-SNAPSHOT/brooklyn-api-0.12.0-SNAPSHOT.pom
[JENKINS] Archiving <https://builds.apache.org/job/brooklyn-server-master/ws/api/target/brooklyn-api-0.12.0-SNAPSHOT.jar>
to org.apache.brooklyn/brooklyn-api/0.12.0-SNAPSHOT/brooklyn-api-0.12.0-SNAPSHOT.jar
[JENKINS] Archiving <https://builds.apache.org/job/brooklyn-server-master/ws/api/target/brooklyn-api-0.12.0-SNAPSHOT-sources.jar>
to org.apache.brooklyn/brooklyn-api/0.12.0-SNAPSHOT/brooklyn-api-0.12.0-SNAPSHOT-sources.jar
[JENKINS] Archiving <https://builds.apache.org/job/brooklyn-server-master/ws/api/target/brooklyn-api-0.12.0-SNAPSHOT-test-sources.jar>
to org.apache.brooklyn/brooklyn-api/0.12.0-SNAPSHOT/brooklyn-api-0.12.0-SNAPSHOT-test-sources.jar
No artifacts from brooklyn-server-master » Brooklyn API #562 to compare, so performing full
copy of artifacts
[JENKINS] Archiving <https://builds.apache.org/job/brooklyn-server-master/ws/pom.xml>
to org.apache.brooklyn/brooklyn-server/0.12.0-SNAPSHOT/brooklyn-server-0.12.0-SNAPSHOT.pom
No artifacts from brooklyn-server-master » Brooklyn Server Root #562 to compare, so performing
full copy of artifacts
[JENKINS] Archiving <https://builds.apache.org/job/brooklyn-server-master/ws/locations/jclouds/pom.xml>
to org.apache.brooklyn/brooklyn-locations-jclouds/0.12.0-SNAPSHOT/brooklyn-locations-jclouds-0.12.0-SNAPSHOT.pom
[JENKINS] Archiving <https://builds.apache.org/job/brooklyn-server-master/ws/locations/jclouds/target/brooklyn-locations-jclouds-0.12.0-SNAPSHOT.jar>
to org.apache.brooklyn/brooklyn-locations-jclouds/0.12.0-SNAPSHOT/brooklyn-locations-jclouds-0.12.0-SNAPSHOT.jar
[JENKINS] Archiving <https://builds.apache.org/job/brooklyn-server-master/ws/locations/jclouds/target/brooklyn-locations-jclouds-0.12.0-SNAPSHOT-tests.jar>
to org.apache.brooklyn/brooklyn-locations-jclouds/0.12.0-SNAPSHOT/brooklyn-locations-jclouds-0.12.0-SNAPSHOT-tests.jar
[JENKINS] Archiving <https://builds.apache.org/job/brooklyn-server-master/ws/locations/jclouds/target/brooklyn-locations-jclouds-0.12.0-SNAPSHOT-sources.jar>
to org.apache.brooklyn/brooklyn-locations-jclouds/0.12.0-SNAPSHOT/brooklyn-locations-jclouds-0.12.0-SNAPSHOT-sources.jar
[JENKINS] Archiving <https://builds.apache.org/job/brooklyn-server-master/ws/locations/jclouds/target/brooklyn-locations-jclouds-0.12.0-SNAPSHOT-test-sources.jar>
to org.apache.brooklyn/brooklyn-locations-jclouds/0.12.0-SNAPSHOT/brooklyn-locations-jclouds-0.12.0-SNAPSHOT-test-sources.jar
[JENKINS] Archiving <https://builds.apache.org/job/brooklyn-server-master/ws/utils/common/pom.xml>
to org.apache.brooklyn/brooklyn-utils-common/0.12.0-SNAPSHOT/brooklyn-utils-common-0.12.0-SNAPSHOT.pom
[JENKINS] Archiving <https://builds.apache.org/job/brooklyn-server-master/ws/utils/common/target/brooklyn-utils-common-0.12.0-SNAPSHOT.jar>
to org.apache.brooklyn/brooklyn-utils-common/0.12.0-SNAPSHOT/brooklyn-utils-common-0.12.0-SNAPSHOT.jar
[JENKINS] Archiving <https://builds.apache.org/job/brooklyn-server-master/ws/utils/common/target/brooklyn-utils-common-0.12.0-SNAPSHOT-tests.jar>
to org.apache.brooklyn/brooklyn-utils-common/0.12.0-SNAPSHOT/brooklyn-utils-common-0.12.0-SNAPSHOT-tests.jar
[JENKINS] Archiving <https://builds.apache.org/job/brooklyn-server-master/ws/utils/common/target/brooklyn-utils-common-0.12.0-SNAPSHOT-sources.jar>
to org.apache.brooklyn/brooklyn-utils-common/0.12.0-SNAPSHOT/brooklyn-utils-common-0.12.0-SNAPSHOT-sources.jar
[JENKINS] Archiving <https://builds.apache.org/job/brooklyn-server-master/ws/utils/common/target/brooklyn-utils-common-0.12.0-SNAPSHOT-test-sources.jar>
to org.apache.brooklyn/brooklyn-utils-common/0.12.0-SNAPSHOT/brooklyn-utils-common-0.12.0-SNAPSHOT-test-sources.jar
No artifacts from brooklyn-server-master » Brooklyn Common Utilities #562 to compare, so
performing full copy of artifacts
[JENKINS] Archiving <https://builds.apache.org/job/brooklyn-server-master/ws/karaf/features/pom.xml>
to org.apache.brooklyn/brooklyn-features/0.12.0-SNAPSHOT/brooklyn-features-0.12.0-SNAPSHOT.pom
[JENKINS] Archiving <https://builds.apache.org/job/brooklyn-server-master/ws/rest/rest-api/pom.xml>
to org.apache.brooklyn/brooklyn-rest-api/0.12.0-SNAPSHOT/brooklyn-rest-api-0.12.0-SNAPSHOT.pom
[JENKINS] Archiving <https://builds.apache.org/job/brooklyn-server-master/ws/utils/jmx/jmxrmi-agent/pom.xml>
to org.apache.brooklyn/brooklyn-jmxrmi-agent/0.12.0-SNAPSHOT/brooklyn-jmxrmi-agent-0.12.0-SNAPSHOT.pom
[JENKINS] Archiving <https://builds.apache.org/job/brooklyn-server-master/ws/utils/jmx/jmxrmi-agent/target/brooklyn-jmxrmi-agent-0.12.0-SNAPSHOT.jar>
to org.apache.brooklyn/brooklyn-jmxrmi-agent/0.12.0-SNAPSHOT/brooklyn-jmxrmi-agent-0.12.0-SNAPSHOT.jar
[JENKINS] Archiving <https://builds.apache.org/job/brooklyn-server-master/ws/utils/jmx/jmxrmi-agent/target/brooklyn-jmxrmi-agent-0.12.0-SNAPSHOT-tests.jar>
to org.apache.brooklyn/brooklyn-jmxrmi-agent/0.12.0-SNAPSHOT/brooklyn-jmxrmi-agent-0.12.0-SNAPSHOT-tests.jar
[JENKINS] Archiving <https://builds.apache.org/job/brooklyn-server-master/ws/utils/jmx/jmxrmi-agent/target/brooklyn-jmxrmi-agent-0.12.0-SNAPSHOT-sources.jar>
to org.apache.brooklyn/brooklyn-jmxrmi-agent/0.12.0-SNAPSHOT/brooklyn-jmxrmi-agent-0.12.0-SNAPSHOT-sources.jar
[JENKINS] Archiving <https://builds.apache.org/job/brooklyn-server-master/ws/utils/jmx/jmxrmi-agent/target/brooklyn-jmxrmi-agent-0.12.0-SNAPSHOT-test-sources.jar>
to org.apache.brooklyn/brooklyn-jmxrmi-agent/0.12.0-SNAPSHOT/brooklyn-jmxrmi-agent-0.12.0-SNAPSHOT-test-sources.jar
[JENKINS] Archiving <https://builds.apache.org/job/brooklyn-server-master/ws/policy/pom.xml>
to org.apache.brooklyn/brooklyn-policy/0.12.0-SNAPSHOT/brooklyn-policy-0.12.0-SNAPSHOT.pom
[JENKINS] Archiving <https://builds.apache.org/job/brooklyn-server-master/ws/policy/target/brooklyn-policy-0.12.0-SNAPSHOT.jar>
to org.apache.brooklyn/brooklyn-policy/0.12.0-SNAPSHOT/brooklyn-policy-0.12.0-SNAPSHOT.jar
[JENKINS] Archiving <https://builds.apache.org/job/brooklyn-server-master/ws/policy/target/brooklyn-policy-0.12.0-SNAPSHOT-tests.jar>
to org.apache.brooklyn/brooklyn-policy/0.12.0-SNAPSHOT/brooklyn-policy-0.12.0-SNAPSHOT-tests.jar
[JENKINS] Archiving <https://builds.apache.org/job/brooklyn-server-master/ws/policy/target/brooklyn-policy-0.12.0-SNAPSHOT-sources.jar>
to org.apache.brooklyn/brooklyn-policy/0.12.0-SNAPSHOT/brooklyn-policy-0.12.0-SNAPSHOT-sources.jar
[JENKINS] Archiving <https://builds.apache.org/job/brooklyn-server-master/ws/policy/target/brooklyn-policy-0.12.0-SNAPSHOT-test-sources.jar>
to org.apache.brooklyn/brooklyn-policy/0.12.0-SNAPSHOT/brooklyn-policy-0.12.0-SNAPSHOT-test-sources.jar
[JENKINS] Archiving <https://builds.apache.org/job/brooklyn-server-master/ws/karaf/init/pom.xml>
to org.apache.brooklyn/brooklyn-karaf-init/0.12.0-SNAPSHOT/brooklyn-karaf-init-0.12.0-SNAPSHOT.pom
[JENKINS] Archiving <https://builds.apache.org/job/brooklyn-server-master/ws/karaf/commands/pom.xml>
to org.apache.brooklyn/brooklyn-commands/0.12.0-SNAPSHOT/brooklyn-commands-0.12.0-SNAPSHOT.pom
[JENKINS] Archiving <https://builds.apache.org/job/brooklyn-server-master/ws/storage/hazelcast/pom.xml>
to org.apache.brooklyn/brooklyn-storage-hazelcast/0.12.0-SNAPSHOT/brooklyn-storage-hazelcast-0.12.0-SNAPSHOT.pom
[JENKINS] Archiving <https://builds.apache.org/job/brooklyn-server-master/ws/logging/logback-includes/pom.xml>
to org.apache.brooklyn/brooklyn-logback-includes/0.12.0-SNAPSHOT/brooklyn-logback-includes-0.12.0-SNAPSHOT.pom
[JENKINS] Archiving <https://builds.apache.org/job/brooklyn-server-master/ws/logging/logback-includes/target/brooklyn-logback-includes-0.12.0-SNAPSHOT.jar>
to org.apache.brooklyn/brooklyn-logback-includes/0.12.0-SNAPSHOT/brooklyn-logback-includes-0.12.0-SNAPSHOT.jar
[JENKINS] Archiving <https://builds.apache.org/job/brooklyn-server-master/ws/logging/logback-includes/target/brooklyn-logback-includes-0.12.0-SNAPSHOT-sources.jar>
to org.apache.brooklyn/brooklyn-logback-includes/0.12.0-SNAPSHOT/brooklyn-logback-includes-0.12.0-SNAPSHOT-sources.jar
[JENKINS] Archiving <https://builds.apache.org/job/brooklyn-server-master/ws/logging/logback-includes/target/brooklyn-logback-includes-0.12.0-SNAPSHOT-test-sources.jar>
to org.apache.brooklyn/brooklyn-logback-includes/0.12.0-SNAPSHOT/brooklyn-logback-includes-0.12.0-SNAPSHOT-test-sources.jar
No artifacts from brooklyn-server-master » Brooklyn Logback Includable Configuration #562
to compare, so performing full copy of artifacts
[JENKINS] Archiving <https://builds.apache.org/job/brooklyn-server-master/ws/rest/rest-resources/pom.xml>
to org.apache.brooklyn/brooklyn-rest-resources/0.12.0-SNAPSHOT/brooklyn-rest-resources-0.12.0-SNAPSHOT.pom
[JENKINS] Archiving <https://builds.apache.org/job/brooklyn-server-master/ws/utils/jmx/jmxmp-ssl-agent/pom.xml>
to org.apache.brooklyn/brooklyn-jmxmp-agent/0.12.0-SNAPSHOT/brooklyn-jmxmp-agent-0.12.0-SNAPSHOT.pom
[JENKINS] Archiving <https://builds.apache.org/job/brooklyn-server-master/ws/utils/jmx/jmxmp-ssl-agent/target/brooklyn-jmxmp-agent-0.12.0-SNAPSHOT.jar>
to org.apache.brooklyn/brooklyn-jmxmp-agent/0.12.0-SNAPSHOT/brooklyn-jmxmp-agent-0.12.0-SNAPSHOT.jar
[JENKINS] Archiving <https://builds.apache.org/job/brooklyn-server-master/ws/utils/jmx/jmxmp-ssl-agent/target/brooklyn-jmxmp-agent-0.12.0-SNAPSHOT-tests.jar>
to org.apache.brooklyn/brooklyn-jmxmp-agent/0.12.0-SNAPSHOT/brooklyn-jmxmp-agent-0.12.0-SNAPSHOT-tests.jar
[JENKINS] Archiving <https://builds.apache.org/job/brooklyn-server-master/ws/utils/jmx/jmxmp-ssl-agent/target/brooklyn-jmxmp-agent-shaded-0.12.0-SNAPSHOT.jar>
to org.apache.brooklyn/brooklyn-jmxmp-agent/0.12.0-SNAPSHOT/brooklyn-jmxmp-agent-0.12.0-SNAPSHOT-with-dependencies.jar
[JENKINS] Archiving <https://builds.apache.org/job/brooklyn-server-master/ws/utils/jmx/jmxmp-ssl-agent/target/brooklyn-jmxmp-agent-0.12.0-SNAPSHOT-sources.jar>
to org.apache.brooklyn/brooklyn-jmxmp-agent/0.12.0-SNAPSHOT/brooklyn-jmxmp-agent-0.12.0-SNAPSHOT-sources.jar
[JENKINS] Archiving <https://builds.apache.org/job/brooklyn-server-master/ws/utils/jmx/jmxmp-ssl-agent/target/brooklyn-jmxmp-agent-0.12.0-SNAPSHOT-test-sources.jar>
to org.apache.brooklyn/brooklyn-jmxmp-agent/0.12.0-SNAPSHOT/brooklyn-jmxmp-agent-0.12.0-SNAPSHOT-test-sources.jar
[JENKINS] Archiving <https://builds.apache.org/job/brooklyn-server-master/ws/parent/pom.xml>
to org.apache.brooklyn/brooklyn-parent/0.12.0-SNAPSHOT/brooklyn-parent-0.12.0-SNAPSHOT.pom
No artifacts from brooklyn-server-master » Brooklyn Parent Project #562 to compare, so performing
full copy of artifacts
[JENKINS] Archiving <https://builds.apache.org/job/brooklyn-server-master/ws/software/winrm/pom.xml>
to org.apache.brooklyn/brooklyn-software-winrm/0.12.0-SNAPSHOT/brooklyn-software-winrm-0.12.0-SNAPSHOT.pom
[JENKINS] Archiving <https://builds.apache.org/job/brooklyn-server-master/ws/software/winrm/target/brooklyn-software-winrm-0.12.0-SNAPSHOT.jar>
to org.apache.brooklyn/brooklyn-software-winrm/0.12.0-SNAPSHOT/brooklyn-software-winrm-0.12.0-SNAPSHOT.jar
[JENKINS] Archiving <https://builds.apache.org/job/brooklyn-server-master/ws/software/winrm/target/brooklyn-software-winrm-0.12.0-SNAPSHOT-tests.jar>
to org.apache.brooklyn/brooklyn-software-winrm/0.12.0-SNAPSHOT/brooklyn-software-winrm-0.12.0-SNAPSHOT-tests.jar
[JENKINS] Archiving <https://builds.apache.org/job/brooklyn-server-master/ws/software/winrm/target/brooklyn-software-winrm-0.12.0-SNAPSHOT-sources.jar>
to org.apache.brooklyn/brooklyn-software-winrm/0.12.0-SNAPSHOT/brooklyn-software-winrm-0.12.0-SNAPSHOT-sources.jar
[JENKINS] Archiving <https://builds.apache.org/job/brooklyn-server-master/ws/software/winrm/target/brooklyn-software-winrm-0.12.0-SNAPSHOT-test-sources.jar>
to org.apache.brooklyn/brooklyn-software-winrm/0.12.0-SNAPSHOT/brooklyn-software-winrm-0.12.0-SNAPSHOT-test-sources.jar
channel stopped

Mime
View raw message