brooklyn-dev mailing list archives

Site index · List index
Message view « Date » · « Thread »
Top « Date » · « Thread »
From Apache Jenkins Server <jenk...@builds.apache.org>
Subject Build failed in Jenkins: brooklyn-server-master #604
Date Mon, 29 May 2017 12:17:21 GMT
See <https://builds.apache.org/job/brooklyn-server-master/604/display/redirect?page=changes>

Changes:

[aled.sage] jclouds stub test: better allow config to be overridden

------------------------------------------
[...truncated 5.79 MB...]
2017-05-29 12:06:24,816 INFO  TESTNG INVOKING CONFIGURATION: "Surefire test" - @AfterMethod
org.apache.brooklyn.camp.brooklyn.catalog.CatalogOsgiLibraryTest.tearDown()
2017-05-29 12:06:24,818 INFO  Stopping application BasicApplicationImpl{id=n1py4mk0es}
2017-05-29 12:06:24,819 INFO  Stopped application BasicApplicationImpl{id=n1py4mk0es}
2017-05-29 12:06:24,821 INFO  Uninstalling org.apache.brooklyn.test.resources.osgi.brooklyn-test-osgi-entities
[213] from OSGi container in /tmp/brooklyn-osgi-reusable-container-AvoH
2017-05-29 12:06:24,823 INFO  TESTNG PASSED CONFIGURATION: "Surefire test" - @AfterMethod
org.apache.brooklyn.camp.brooklyn.catalog.CatalogOsgiLibraryTest.tearDown() finished in 7
ms
2017-05-29 12:06:24,823 INFO  TESTNG INVOKING CONFIGURATION: "Surefire test" - @BeforeMethod
org.apache.brooklyn.camp.brooklyn.catalog.CatalogOsgiLibraryTest.setUp()
2017-05-29 12:06:24,829 INFO  TESTNG PASSED CONFIGURATION: "Surefire test" - @BeforeMethod
org.apache.brooklyn.camp.brooklyn.catalog.CatalogOsgiLibraryTest.setUp() finished in 6 ms
2017-05-29 12:06:24,829 INFO  TESTNG INVOKING: "Surefire test" - org.apache.brooklyn.camp.brooklyn.catalog.CatalogOsgiLibraryTest.testLibraryIsUsedByStockEntityDeclaredInCatalog()
2017-05-29 12:06:24,906 INFO  Started application BasicApplicationImpl{id=u607lqle8y}
2017-05-29 12:06:24,916 INFO  TESTNG PASSED: "Surefire test" - org.apache.brooklyn.camp.brooklyn.catalog.CatalogOsgiLibraryTest.testLibraryIsUsedByStockEntityDeclaredInCatalog()
finished in 86 ms
2017-05-29 12:06:24,916 INFO  TESTNG INVOKING CONFIGURATION: "Surefire test" - @AfterMethod
org.apache.brooklyn.camp.brooklyn.catalog.CatalogOsgiLibraryTest.tearDown()
2017-05-29 12:06:24,917 INFO  Stopping application BasicApplicationImpl{id=u607lqle8y}
2017-05-29 12:06:24,919 INFO  Stopped application BasicApplicationImpl{id=u607lqle8y}
2017-05-29 12:06:24,921 INFO  Uninstalling org.apache.brooklyn.test.resources.osgi.brooklyn-test-osgi-entities
[211] from OSGi container in /tmp/brooklyn-osgi-reusable-container-gT5Q
2017-05-29 12:06:24,923 INFO  TESTNG PASSED CONFIGURATION: "Surefire test" - @AfterMethod
org.apache.brooklyn.camp.brooklyn.catalog.CatalogOsgiLibraryTest.tearDown() finished in 7
ms
2017-05-29 12:06:24,923 INFO  TESTNG INVOKING CONFIGURATION: "Surefire test" - @BeforeMethod
org.apache.brooklyn.camp.brooklyn.catalog.CatalogOsgiLibraryTest.setUp()
2017-05-29 12:06:24,930 INFO  TESTNG PASSED CONFIGURATION: "Surefire test" - @BeforeMethod
org.apache.brooklyn.camp.brooklyn.catalog.CatalogOsgiLibraryTest.setUp() finished in 7 ms
2017-05-29 12:06:24,930 INFO  TESTNG INVOKING: "Surefire test" - org.apache.brooklyn.camp.brooklyn.catalog.CatalogOsgiLibraryTest.testLibraryMalformed()
2017-05-29 12:06:24,941 INFO  TESTNG PASSED: "Surefire test" - org.apache.brooklyn.camp.brooklyn.catalog.CatalogOsgiLibraryTest.testLibraryMalformed()
finished in 11 ms
2017-05-29 12:06:24,941 INFO  TESTNG INVOKING CONFIGURATION: "Surefire test" - @AfterMethod
org.apache.brooklyn.camp.brooklyn.catalog.CatalogOsgiLibraryTest.tearDown()
2017-05-29 12:06:24,942 INFO  TESTNG PASSED CONFIGURATION: "Surefire test" - @AfterMethod
org.apache.brooklyn.camp.brooklyn.catalog.CatalogOsgiLibraryTest.tearDown() finished in 1
ms
2017-05-29 12:06:24,943 INFO  TESTNG INVOKING CONFIGURATION: "Surefire test" - @BeforeMethod
org.apache.brooklyn.camp.brooklyn.catalog.CatalogOsgiLibraryTest.setUp()
2017-05-29 12:06:24,953 INFO  TESTNG PASSED CONFIGURATION: "Surefire test" - @BeforeMethod
org.apache.brooklyn.camp.brooklyn.catalog.CatalogOsgiLibraryTest.setUp() finished in 10 ms
2017-05-29 12:06:24,953 INFO  TESTNG INVOKING: "Surefire test" - org.apache.brooklyn.camp.brooklyn.catalog.CatalogOsgiLibraryTest.testLibraryMapWithClasspathUrl()
2017-05-29 12:06:24,971 INFO  TESTNG PASSED: "Surefire test" - org.apache.brooklyn.camp.brooklyn.catalog.CatalogOsgiLibraryTest.testLibraryMapWithClasspathUrl()
finished in 18 ms
2017-05-29 12:06:24,971 INFO  TESTNG INVOKING CONFIGURATION: "Surefire test" - @AfterMethod
org.apache.brooklyn.camp.brooklyn.catalog.CatalogOsgiLibraryTest.tearDown()
2017-05-29 12:06:24,972 INFO  Uninstalling org.apache.brooklyn.test.resources.osgi.brooklyn-test-osgi-entities
[212] from OSGi container in /tmp/brooklyn-osgi-reusable-container-gT5Q
2017-05-29 12:06:24,973 INFO  TESTNG PASSED CONFIGURATION: "Surefire test" - @AfterMethod
org.apache.brooklyn.camp.brooklyn.catalog.CatalogOsgiLibraryTest.tearDown() finished in 2
ms
2017-05-29 12:06:24,973 INFO  TESTNG INVOKING CONFIGURATION: "Surefire test" - @BeforeMethod
org.apache.brooklyn.camp.brooklyn.catalog.CatalogOsgiLibraryTest.setUp()
2017-05-29 12:06:24,979 INFO  TESTNG PASSED CONFIGURATION: "Surefire test" - @BeforeMethod
org.apache.brooklyn.camp.brooklyn.catalog.CatalogOsgiLibraryTest.setUp() finished in 6 ms
2017-05-29 12:06:24,979 INFO  TESTNG INVOKING: "Surefire test" - org.apache.brooklyn.camp.brooklyn.catalog.CatalogOsgiLibraryTest.testLibraryStringWithClasspathUrl()
2017-05-29 12:06:25,002 INFO  TESTNG PASSED: "Surefire test" - org.apache.brooklyn.camp.brooklyn.catalog.CatalogOsgiLibraryTest.testLibraryStringWithClasspathUrl()
finished in 23 ms
2017-05-29 12:06:25,002 INFO  TESTNG INVOKING CONFIGURATION: "Surefire test" - @AfterMethod
org.apache.brooklyn.camp.brooklyn.catalog.CatalogOsgiLibraryTest.tearDown()
2017-05-29 12:06:25,002 INFO  Uninstalling org.apache.brooklyn.test.resources.osgi.brooklyn-test-osgi-entities
[214] from OSGi container in /tmp/brooklyn-osgi-reusable-container-AvoH
2017-05-29 12:06:25,008 INFO  TESTNG PASSED CONFIGURATION: "Surefire test" - @AfterMethod
org.apache.brooklyn.camp.brooklyn.catalog.CatalogOsgiLibraryTest.tearDown() finished in 6
ms
2017-05-29 12:06:25,008 INFO  TESTNG INVOKING CONFIGURATION: "Surefire test" - @BeforeMethod
org.apache.brooklyn.camp.brooklyn.catalog.CatalogOsgiLibraryTest.setUp()
2017-05-29 12:06:25,014 INFO  TESTNG PASSED CONFIGURATION: "Surefire test" - @BeforeMethod
org.apache.brooklyn.camp.brooklyn.catalog.CatalogOsgiLibraryTest.setUp() finished in 6 ms
2017-05-29 12:06:25,014 INFO  TESTNG INVOKING: "Surefire test" - org.apache.brooklyn.camp.brooklyn.catalog.CatalogOsgiLibraryTest.testLibraryUrlDoesNotExist()
2017-05-29 12:06:25,016 INFO  TESTNG PASSED: "Surefire test" - org.apache.brooklyn.camp.brooklyn.catalog.CatalogOsgiLibraryTest.testLibraryUrlDoesNotExist()
finished in 2 ms
2017-05-29 12:06:25,016 INFO  TESTNG INVOKING CONFIGURATION: "Surefire test" - @AfterMethod
org.apache.brooklyn.camp.brooklyn.catalog.CatalogOsgiLibraryTest.tearDown()
2017-05-29 12:06:25,016 INFO  TESTNG PASSED CONFIGURATION: "Surefire test" - @AfterMethod
org.apache.brooklyn.camp.brooklyn.catalog.CatalogOsgiLibraryTest.tearDown() finished in 0
ms
2017-05-29 12:06:25,016 INFO  TESTNG INVOKING CONFIGURATION: "Surefire test" - @BeforeMethod
org.apache.brooklyn.camp.brooklyn.catalog.CatalogOsgiLibraryTest.setUp()
2017-05-29 12:06:25,022 INFO  TESTNG PASSED CONFIGURATION: "Surefire test" - @BeforeMethod
org.apache.brooklyn.camp.brooklyn.catalog.CatalogOsgiLibraryTest.setUp() finished in 6 ms
2017-05-29 12:06:25,022 INFO  TESTNG INVOKING: "Surefire test" - org.apache.brooklyn.camp.brooklyn.catalog.CatalogOsgiLibraryTest.testLibraryUrlUsingExternalizedConfig()
2017-05-29 12:06:25,022 INFO  Added external config supplier named 'myprovider': org.apache.brooklyn.camp.brooklyn.catalog.CatalogOsgiLibraryTest$MyExternalConfigSupplier@6305591f
[GC (Allocation Failure)  327459K->91064K(776192K), 0.0105019 secs]
2017-05-29 12:06:25,066 INFO  TESTNG PASSED: "Surefire test" - org.apache.brooklyn.camp.brooklyn.catalog.CatalogOsgiLibraryTest.testLibraryUrlUsingExternalizedConfig()
finished in 44 ms
2017-05-29 12:06:25,066 INFO  TESTNG INVOKING CONFIGURATION: "Surefire test" - @AfterMethod
org.apache.brooklyn.camp.brooklyn.catalog.CatalogOsgiLibraryTest.tearDown()
2017-05-29 12:06:25,066 INFO  Uninstalling org.apache.brooklyn.test.resources.osgi.brooklyn-test-osgi-entities
[215] from OSGi container in /tmp/brooklyn-osgi-reusable-container-AvoH
2017-05-29 12:06:25,068 INFO  TESTNG PASSED CONFIGURATION: "Surefire test" - @AfterMethod
org.apache.brooklyn.camp.brooklyn.catalog.CatalogOsgiLibraryTest.tearDown() finished in 2
ms
2017-05-29 12:06:25,069 INFO  TESTNG INVOKING CONFIGURATION: "Surefire test" - @BeforeMethod
org.apache.brooklyn.camp.brooklyn.catalog.CatalogOsgiLibraryTest.setUp()
2017-05-29 12:06:25,073 INFO  TESTNG PASSED CONFIGURATION: "Surefire test" - @BeforeMethod
org.apache.brooklyn.camp.brooklyn.catalog.CatalogOsgiLibraryTest.setUp() finished in 4 ms
2017-05-29 12:06:25,073 INFO  TESTNG INVOKING: "Surefire test" - org.apache.brooklyn.camp.brooklyn.catalog.CatalogOsgiLibraryTest.testLibraryUrlUsingExternalizedConfigForCredentialsLenient()
2017-05-29 12:06:25,073 INFO  Added external config supplier named 'myprovider': org.apache.brooklyn.camp.brooklyn.catalog.CatalogOsgiLibraryTest$MyExternalConfigSupplier@1073bab6
2017-05-29 12:06:25,111 INFO  TESTNG PASSED: "Surefire test" - org.apache.brooklyn.camp.brooklyn.catalog.CatalogOsgiLibraryTest.testLibraryUrlUsingExternalizedConfigForCredentialsLenient()
finished in 38 ms
2017-05-29 12:06:25,111 INFO  TESTNG INVOKING CONFIGURATION: "Surefire test" - @AfterMethod
org.apache.brooklyn.camp.brooklyn.catalog.CatalogOsgiLibraryTest.tearDown()
2017-05-29 12:06:25,112 INFO  Uninstalling org.apache.brooklyn.test.resources.osgi.brooklyn-test-osgi-entities
[213] from OSGi container in /tmp/brooklyn-osgi-reusable-container-gT5Q
2017-05-29 12:06:25,113 INFO  TESTNG PASSED CONFIGURATION: "Surefire test" - @AfterMethod
org.apache.brooklyn.camp.brooklyn.catalog.CatalogOsgiLibraryTest.tearDown() finished in 2
ms
2017-05-29 12:06:25,114 INFO  TESTNG INVOKING CONFIGURATION: "Surefire test" - @BeforeMethod
org.apache.brooklyn.camp.brooklyn.AbstractYamlTest.setUp()
2017-05-29 12:06:25,116 INFO  TESTNG PASSED CONFIGURATION: "Surefire test" - @BeforeMethod
org.apache.brooklyn.camp.brooklyn.AbstractYamlTest.setUp() finished in 2 ms
2017-05-29 12:06:25,116 INFO  TESTNG INVOKING: "Surefire test" - org.apache.brooklyn.camp.brooklyn.catalog.SpecParameterParsingTest.testYamlInputsParsed()
2017-05-29 12:06:25,138 INFO  TESTNG PASSED: "Surefire test" - org.apache.brooklyn.camp.brooklyn.catalog.SpecParameterParsingTest.testYamlInputsParsed()
finished in 22 ms
2017-05-29 12:06:25,138 INFO  TESTNG INVOKING CONFIGURATION: "Surefire test" - @AfterMethod
org.apache.brooklyn.camp.brooklyn.AbstractYamlTest.tearDown()
2017-05-29 12:06:25,139 INFO  TESTNG PASSED CONFIGURATION: "Surefire test" - @AfterMethod
org.apache.brooklyn.camp.brooklyn.AbstractYamlTest.tearDown() finished in 1 ms
2017-05-29 12:06:25,210 INFO  TESTNG 
===============================================
    Surefire test
    Tests run: 631, Failures: 1, Skips: 0
===============================================
Tests run: 631, Failures: 1, Errors: 0, Skipped: 0, Time elapsed: 89.292 sec <<<
FAILURE! - in TestSuite
testCatalogBomFromBundleWithManualManifest(org.apache.brooklyn.camp.brooklyn.catalog.CatalogMakeOsgiBundleTest)
 Time elapsed: 0.149 sec  <<< FAILURE!
java.lang.AssertionError: attribute=Sensor: a.sensor (java.lang.String); val=null
	at org.apache.brooklyn.camp.brooklyn.catalog.CatalogMakeOsgiBundleTest.assertBasic1DeploysAndHasSensor(CatalogMakeOsgiBundleTest.java:140)
	at org.apache.brooklyn.camp.brooklyn.catalog.CatalogMakeOsgiBundleTest.testCatalogBomFromBundleWithManualManifest(CatalogMakeOsgiBundleTest.java:165)


Results :

Failed tests: 
  CatalogMakeOsgiBundleTest.testCatalogBomFromBundleWithManualManifest:165->assertBasic1DeploysAndHasSensor:140
attribute=Sensor: a.sensor (java.lang.String); val=null

Tests run: 631, Failures: 1, Errors: 0, Skipped: 0

[JENKINS] Recording test results
[INFO] ------------------------------------------------------------------------
[INFO] Reactor Summary:
[INFO] 
[INFO] Brooklyn Server Root ............................... SUCCESS [  2.883 s]
[INFO] Brooklyn Parent Project ............................ SUCCESS [  4.128 s]
[INFO] Brooklyn Test Support Utilities .................... SUCCESS [  5.738 s]
[INFO] Brooklyn Logback Includable Configuration .......... SUCCESS [  2.017 s]
[INFO] Brooklyn Common Utilities .......................... SUCCESS [ 31.608 s]
[INFO] Brooklyn API ....................................... SUCCESS [  5.624 s]
[INFO] CAMP Server Parent Project ......................... SUCCESS [  1.580 s]
[INFO] CAMP Base .......................................... SUCCESS [  6.433 s]
[INFO] Brooklyn Test Support .............................. SUCCESS [  5.050 s]
[INFO] Brooklyn REST Swagger Apidoc Utilities ............. SUCCESS [  5.109 s]
[INFO] Brooklyn Logback Configuration ..................... SUCCESS [  5.512 s]
[INFO] CAMP Server ........................................ SUCCESS [  7.537 s]
[INFO] Brooklyn Felix Runtime ............................. SUCCESS [  5.717 s]
[INFO] Brooklyn Groovy Utilities .......................... SUCCESS [  6.798 s]
[INFO] Brooklyn Core ...................................... SUCCESS [03:23 min]
[INFO] Brooklyn Policies .................................. SUCCESS [01:08 min]
[INFO] Brooklyn WinRM Software Entities ................... SUCCESS [ 19.617 s]
[INFO] Brooklyn Secure JMXMP Agent ........................ SUCCESS [ 15.190 s]
[INFO] Brooklyn JMX RMI Agent ............................. SUCCESS [ 10.726 s]
[INFO] Brooklyn Jclouds Location Targets .................. SUCCESS [ 39.234 s]
[INFO] Brooklyn Software Base ............................. SUCCESS [01:26 min]
[INFO] Brooklyn CAMP ...................................... FAILURE [01:53 min]
[INFO] Brooklyn Launcher Common ........................... SKIPPED
[INFO] Brooklyn REST API .................................. SKIPPED
[INFO] Brooklyn REST Resources ............................ SKIPPED
[INFO] Brooklyn REST Server ............................... SKIPPED
[INFO] Brooklyn Launcher .................................. SKIPPED
[INFO] Brooklyn Command Line Interface .................... SKIPPED
[INFO] Brooklyn Test Framework ............................ SKIPPED
[INFO] Brooklyn OSGi init ................................. SKIPPED
[INFO] Brooklyn Karaf ..................................... SKIPPED
[INFO] Jetty config fragment .............................. SKIPPED
[INFO] Apache Http Component extension .................... SKIPPED
[INFO] Brooklyn Karaf Features ............................ SKIPPED
[INFO] Brooklyn Karaf Shell Commands ...................... SKIPPED
[INFO] Brooklyn Karaf Tests ............................... SKIPPED
[INFO] ------------------------------------------------------------------------
[INFO] BUILD FAILURE
[INFO] ------------------------------------------------------------------------
[INFO] Total time: 12:58 min
[INFO] Finished at: 2017-05-29T12:06:57+00:00
[INFO] Final Memory: 111M/767M
[INFO] ------------------------------------------------------------------------
Waiting for Jenkins to finish collecting data
[ERROR] Failed to execute goal org.apache.maven.plugins:maven-surefire-plugin:2.19.1:test
(default-test) on project brooklyn-camp: There are test failures.
[ERROR] 
[ERROR] Please refer to <https://builds.apache.org/job/brooklyn-server-master/ws/camp/camp-brooklyn/target/surefire-reports>
for the individual test results.
[ERROR] -> [Help 1]
[ERROR] 
[ERROR] To see the full stack trace of the errors, re-run Maven with the -e switch.
[ERROR] Re-run Maven using the -X switch to enable full debug logging.
[ERROR] 
[ERROR] For more information about the errors and possible solutions, please read the following
articles:
[ERROR] [Help 1] http://cwiki.apache.org/confluence/display/MAVEN/MojoFailureException
[ERROR] 
[ERROR] After correcting the problems, you can resume the build with the command
[ERROR]   mvn <goals> -rf :brooklyn-camp
[JENKINS] Archiving <https://builds.apache.org/job/brooklyn-server-master/ws/camp/pom.xml>
to org.apache.brooklyn.camp/camp-parent/0.12.0-SNAPSHOT/camp-parent-0.12.0-SNAPSHOT.pom
[JENKINS] Archiving <https://builds.apache.org/job/brooklyn-server-master/ws/utils/rt-felix/pom.xml>
to org.apache.brooklyn/brooklyn-rt-felix/0.12.0-SNAPSHOT/brooklyn-rt-felix-0.12.0-SNAPSHOT.pom
[JENKINS] Archiving <https://builds.apache.org/job/brooklyn-server-master/ws/utils/rt-felix/target/brooklyn-rt-felix-0.12.0-SNAPSHOT.jar>
to org.apache.brooklyn/brooklyn-rt-felix/0.12.0-SNAPSHOT/brooklyn-rt-felix-0.12.0-SNAPSHOT.jar
[JENKINS] Archiving <https://builds.apache.org/job/brooklyn-server-master/ws/utils/rt-felix/target/brooklyn-rt-felix-0.12.0-SNAPSHOT-tests.jar>
to org.apache.brooklyn/brooklyn-rt-felix/0.12.0-SNAPSHOT/brooklyn-rt-felix-0.12.0-SNAPSHOT-tests.jar
[JENKINS] Archiving <https://builds.apache.org/job/brooklyn-server-master/ws/utils/rt-felix/target/brooklyn-rt-felix-0.12.0-SNAPSHOT-sources.jar>
to org.apache.brooklyn/brooklyn-rt-felix/0.12.0-SNAPSHOT/brooklyn-rt-felix-0.12.0-SNAPSHOT-sources.jar
[JENKINS] Archiving <https://builds.apache.org/job/brooklyn-server-master/ws/utils/rt-felix/target/brooklyn-rt-felix-0.12.0-SNAPSHOT-test-sources.jar>
to org.apache.brooklyn/brooklyn-rt-felix/0.12.0-SNAPSHOT/brooklyn-rt-felix-0.12.0-SNAPSHOT-test-sources.jar
[JENKINS] Archiving <https://builds.apache.org/job/brooklyn-server-master/ws/test-framework/pom.xml>
to org.apache.brooklyn/brooklyn-test-framework/0.12.0-SNAPSHOT/brooklyn-test-framework-0.12.0-SNAPSHOT.pom
[JENKINS] Archiving <https://builds.apache.org/job/brooklyn-server-master/ws/core/pom.xml>
to org.apache.brooklyn/brooklyn-core/0.12.0-SNAPSHOT/brooklyn-core-0.12.0-SNAPSHOT.pom
[JENKINS] Archiving <https://builds.apache.org/job/brooklyn-server-master/ws/core/target/brooklyn-core-0.12.0-SNAPSHOT.jar>
to org.apache.brooklyn/brooklyn-core/0.12.0-SNAPSHOT/brooklyn-core-0.12.0-SNAPSHOT.jar
[JENKINS] Archiving <https://builds.apache.org/job/brooklyn-server-master/ws/core/target/brooklyn-core-0.12.0-SNAPSHOT-tests.jar>
to org.apache.brooklyn/brooklyn-core/0.12.0-SNAPSHOT/brooklyn-core-0.12.0-SNAPSHOT-tests.jar
[JENKINS] Archiving <https://builds.apache.org/job/brooklyn-server-master/ws/core/target/brooklyn-core-0.12.0-SNAPSHOT-sources.jar>
to org.apache.brooklyn/brooklyn-core/0.12.0-SNAPSHOT/brooklyn-core-0.12.0-SNAPSHOT-sources.jar
[JENKINS] Archiving <https://builds.apache.org/job/brooklyn-server-master/ws/core/target/brooklyn-core-0.12.0-SNAPSHOT-test-sources.jar>
to org.apache.brooklyn/brooklyn-core/0.12.0-SNAPSHOT/brooklyn-core-0.12.0-SNAPSHOT-test-sources.jar
[JENKINS] Archiving <https://builds.apache.org/job/brooklyn-server-master/ws/camp/camp-server/pom.xml>
to org.apache.brooklyn.camp/camp-server/0.12.0-SNAPSHOT/camp-server-0.12.0-SNAPSHOT.pom
[JENKINS] Archiving <https://builds.apache.org/job/brooklyn-server-master/ws/camp/camp-server/target/camp-server-0.12.0-SNAPSHOT.jar>
to org.apache.brooklyn.camp/camp-server/0.12.0-SNAPSHOT/camp-server-0.12.0-SNAPSHOT.jar
[JENKINS] Archiving <https://builds.apache.org/job/brooklyn-server-master/ws/camp/camp-server/target/camp-server-0.12.0-SNAPSHOT-tests.jar>
to org.apache.brooklyn.camp/camp-server/0.12.0-SNAPSHOT/camp-server-0.12.0-SNAPSHOT-tests.jar
[JENKINS] Archiving <https://builds.apache.org/job/brooklyn-server-master/ws/camp/camp-server/target/camp-server-0.12.0-SNAPSHOT-sources.jar>
to org.apache.brooklyn.camp/camp-server/0.12.0-SNAPSHOT/camp-server-0.12.0-SNAPSHOT-sources.jar
[JENKINS] Archiving <https://builds.apache.org/job/brooklyn-server-master/ws/camp/camp-server/target/camp-server-0.12.0-SNAPSHOT-test-sources.jar>
to org.apache.brooklyn.camp/camp-server/0.12.0-SNAPSHOT/camp-server-0.12.0-SNAPSHOT-test-sources.jar
[JENKINS] Archiving <https://builds.apache.org/job/brooklyn-server-master/ws/launcher/pom.xml>
to org.apache.brooklyn/brooklyn-launcher/0.12.0-SNAPSHOT/brooklyn-launcher-0.12.0-SNAPSHOT.pom
[JENKINS] Archiving <https://builds.apache.org/job/brooklyn-server-master/ws/karaf/pom.xml>
to org.apache.brooklyn/brooklyn-karaf/0.12.0-SNAPSHOT/brooklyn-karaf-0.12.0-SNAPSHOT.pom
[JENKINS] Archiving <https://builds.apache.org/job/brooklyn-server-master/ws/karaf/httpcomponent-extension/pom.xml>
to org.apache.brooklyn/brooklyn-karaf-httpcomponents-extension/0.12.0-SNAPSHOT/brooklyn-karaf-httpcomponents-extension-0.12.0-SNAPSHOT.pom
[JENKINS] Archiving <https://builds.apache.org/job/brooklyn-server-master/ws/utils/test-support/pom.xml>
to org.apache.brooklyn/brooklyn-utils-test-support/0.12.0-SNAPSHOT/brooklyn-utils-test-support-0.12.0-SNAPSHOT.pom
[JENKINS] Archiving <https://builds.apache.org/job/brooklyn-server-master/ws/utils/test-support/target/brooklyn-utils-test-support-0.12.0-SNAPSHOT.jar>
to org.apache.brooklyn/brooklyn-utils-test-support/0.12.0-SNAPSHOT/brooklyn-utils-test-support-0.12.0-SNAPSHOT.jar
[JENKINS] Archiving <https://builds.apache.org/job/brooklyn-server-master/ws/utils/test-support/target/brooklyn-utils-test-support-0.12.0-SNAPSHOT-sources.jar>
to org.apache.brooklyn/brooklyn-utils-test-support/0.12.0-SNAPSHOT/brooklyn-utils-test-support-0.12.0-SNAPSHOT-sources.jar
[JENKINS] Archiving <https://builds.apache.org/job/brooklyn-server-master/ws/utils/test-support/target/brooklyn-utils-test-support-0.12.0-SNAPSHOT-test-sources.jar>
to org.apache.brooklyn/brooklyn-utils-test-support/0.12.0-SNAPSHOT/brooklyn-utils-test-support-0.12.0-SNAPSHOT-test-sources.jar
[JENKINS] Archiving <https://builds.apache.org/job/brooklyn-server-master/ws/software/base/pom.xml>
to org.apache.brooklyn/brooklyn-software-base/0.12.0-SNAPSHOT/brooklyn-software-base-0.12.0-SNAPSHOT.pom
[JENKINS] Archiving <https://builds.apache.org/job/brooklyn-server-master/ws/software/base/target/brooklyn-software-base-0.12.0-SNAPSHOT.jar>
to org.apache.brooklyn/brooklyn-software-base/0.12.0-SNAPSHOT/brooklyn-software-base-0.12.0-SNAPSHOT.jar
[JENKINS] Archiving <https://builds.apache.org/job/brooklyn-server-master/ws/software/base/target/brooklyn-software-base-0.12.0-SNAPSHOT-tests.jar>
to org.apache.brooklyn/brooklyn-software-base/0.12.0-SNAPSHOT/brooklyn-software-base-0.12.0-SNAPSHOT-tests.jar
[JENKINS] Archiving <https://builds.apache.org/job/brooklyn-server-master/ws/software/base/target/brooklyn-software-base-0.12.0-SNAPSHOT-sources.jar>
to org.apache.brooklyn/brooklyn-software-base/0.12.0-SNAPSHOT/brooklyn-software-base-0.12.0-SNAPSHOT-sources.jar
[JENKINS] Archiving <https://builds.apache.org/job/brooklyn-server-master/ws/software/base/target/brooklyn-software-base-0.12.0-SNAPSHOT-test-sources.jar>
to org.apache.brooklyn/brooklyn-software-base/0.12.0-SNAPSHOT/brooklyn-software-base-0.12.0-SNAPSHOT-test-sources.jar
[JENKINS] Archiving <https://builds.apache.org/job/brooklyn-server-master/ws/utils/groovy/pom.xml>
to org.apache.brooklyn/brooklyn-utils-groovy/0.12.0-SNAPSHOT/brooklyn-utils-groovy-0.12.0-SNAPSHOT.pom
[JENKINS] Archiving <https://builds.apache.org/job/brooklyn-server-master/ws/utils/groovy/target/brooklyn-utils-groovy-0.12.0-SNAPSHOT.jar>
to org.apache.brooklyn/brooklyn-utils-groovy/0.12.0-SNAPSHOT/brooklyn-utils-groovy-0.12.0-SNAPSHOT.jar
[JENKINS] Archiving <https://builds.apache.org/job/brooklyn-server-master/ws/utils/groovy/target/brooklyn-utils-groovy-0.12.0-SNAPSHOT-tests.jar>
to org.apache.brooklyn/brooklyn-utils-groovy/0.12.0-SNAPSHOT/brooklyn-utils-groovy-0.12.0-SNAPSHOT-tests.jar
[JENKINS] Archiving <https://builds.apache.org/job/brooklyn-server-master/ws/utils/groovy/target/brooklyn-utils-groovy-0.12.0-SNAPSHOT-sources.jar>
to org.apache.brooklyn/brooklyn-utils-groovy/0.12.0-SNAPSHOT/brooklyn-utils-groovy-0.12.0-SNAPSHOT-sources.jar
[JENKINS] Archiving <https://builds.apache.org/job/brooklyn-server-master/ws/utils/groovy/target/brooklyn-utils-groovy-0.12.0-SNAPSHOT-test-sources.jar>
to org.apache.brooklyn/brooklyn-utils-groovy/0.12.0-SNAPSHOT/brooklyn-utils-groovy-0.12.0-SNAPSHOT-test-sources.jar
[JENKINS] Archiving <https://builds.apache.org/job/brooklyn-server-master/ws/utils/rest-swagger/pom.xml>
to org.apache.brooklyn/brooklyn-utils-rest-swagger/0.12.0-SNAPSHOT/brooklyn-utils-rest-swagger-0.12.0-SNAPSHOT.pom
[JENKINS] Archiving <https://builds.apache.org/job/brooklyn-server-master/ws/utils/rest-swagger/target/brooklyn-utils-rest-swagger-0.12.0-SNAPSHOT.jar>
to org.apache.brooklyn/brooklyn-utils-rest-swagger/0.12.0-SNAPSHOT/brooklyn-utils-rest-swagger-0.12.0-SNAPSHOT.jar
[JENKINS] Archiving <https://builds.apache.org/job/brooklyn-server-master/ws/utils/rest-swagger/target/brooklyn-utils-rest-swagger-0.12.0-SNAPSHOT-sources.jar>
to org.apache.brooklyn/brooklyn-utils-rest-swagger/0.12.0-SNAPSHOT/brooklyn-utils-rest-swagger-0.12.0-SNAPSHOT-sources.jar
[JENKINS] Archiving <https://builds.apache.org/job/brooklyn-server-master/ws/utils/rest-swagger/target/brooklyn-utils-rest-swagger-0.12.0-SNAPSHOT-test-sources.jar>
to org.apache.brooklyn/brooklyn-utils-rest-swagger/0.12.0-SNAPSHOT/brooklyn-utils-rest-swagger-0.12.0-SNAPSHOT-test-sources.jar
[JENKINS] Archiving <https://builds.apache.org/job/brooklyn-server-master/ws/launcher-common/pom.xml>
to org.apache.brooklyn/brooklyn-launcher-common/0.12.0-SNAPSHOT/brooklyn-launcher-common-0.12.0-SNAPSHOT.pom
[JENKINS] Archiving <https://builds.apache.org/job/brooklyn-server-master/ws/camp/camp-base/pom.xml>
to org.apache.brooklyn.camp/camp-base/0.12.0-SNAPSHOT/camp-base-0.12.0-SNAPSHOT.pom
[JENKINS] Archiving <https://builds.apache.org/job/brooklyn-server-master/ws/camp/camp-base/target/camp-base-0.12.0-SNAPSHOT.jar>
to org.apache.brooklyn.camp/camp-base/0.12.0-SNAPSHOT/camp-base-0.12.0-SNAPSHOT.jar
[JENKINS] Archiving <https://builds.apache.org/job/brooklyn-server-master/ws/camp/camp-base/target/camp-base-0.12.0-SNAPSHOT-tests.jar>
to org.apache.brooklyn.camp/camp-base/0.12.0-SNAPSHOT/camp-base-0.12.0-SNAPSHOT-tests.jar
[JENKINS] Archiving <https://builds.apache.org/job/brooklyn-server-master/ws/camp/camp-base/target/camp-base-0.12.0-SNAPSHOT-sources.jar>
to org.apache.brooklyn.camp/camp-base/0.12.0-SNAPSHOT/camp-base-0.12.0-SNAPSHOT-sources.jar
[JENKINS] Archiving <https://builds.apache.org/job/brooklyn-server-master/ws/camp/camp-base/target/camp-base-0.12.0-SNAPSHOT-test-sources.jar>
to org.apache.brooklyn.camp/camp-base/0.12.0-SNAPSHOT/camp-base-0.12.0-SNAPSHOT-test-sources.jar
[JENKINS] Archiving <https://builds.apache.org/job/brooklyn-server-master/ws/camp/camp-brooklyn/pom.xml>
to org.apache.brooklyn/brooklyn-camp/0.12.0-SNAPSHOT/brooklyn-camp-0.12.0-SNAPSHOT.pom
[JENKINS] Archiving <https://builds.apache.org/job/brooklyn-server-master/ws/karaf/jetty-config/pom.xml>
to org.apache.brooklyn/brooklyn-karaf-jetty-config/0.12.0-SNAPSHOT/brooklyn-karaf-jetty-config-0.12.0-SNAPSHOT.pom
[JENKINS] Archiving <https://builds.apache.org/job/brooklyn-server-master/ws/server-cli/pom.xml>
to org.apache.brooklyn/brooklyn-cli/0.12.0-SNAPSHOT/brooklyn-cli-0.12.0-SNAPSHOT.pom
[JENKINS] Archiving <https://builds.apache.org/job/brooklyn-server-master/ws/logging/logback-xml/pom.xml>
to org.apache.brooklyn/brooklyn-logback-xml/0.12.0-SNAPSHOT/brooklyn-logback-xml-0.12.0-SNAPSHOT.pom
[JENKINS] Archiving <https://builds.apache.org/job/brooklyn-server-master/ws/logging/logback-xml/target/brooklyn-logback-xml-0.12.0-SNAPSHOT.jar>
to org.apache.brooklyn/brooklyn-logback-xml/0.12.0-SNAPSHOT/brooklyn-logback-xml-0.12.0-SNAPSHOT.jar
[JENKINS] Archiving <https://builds.apache.org/job/brooklyn-server-master/ws/logging/logback-xml/target/brooklyn-logback-xml-0.12.0-SNAPSHOT-sources.jar>
to org.apache.brooklyn/brooklyn-logback-xml/0.12.0-SNAPSHOT/brooklyn-logback-xml-0.12.0-SNAPSHOT-sources.jar
[JENKINS] Archiving <https://builds.apache.org/job/brooklyn-server-master/ws/logging/logback-xml/target/brooklyn-logback-xml-0.12.0-SNAPSHOT-test-sources.jar>
to org.apache.brooklyn/brooklyn-logback-xml/0.12.0-SNAPSHOT/brooklyn-logback-xml-0.12.0-SNAPSHOT-test-sources.jar
[JENKINS] Archiving <https://builds.apache.org/job/brooklyn-server-master/ws/karaf/itests/pom.xml>
to org.apache.brooklyn/brooklyn-features-itests/0.12.0-SNAPSHOT/brooklyn-features-itests-0.12.0-SNAPSHOT.pom
[JENKINS] Archiving <https://builds.apache.org/job/brooklyn-server-master/ws/test-support/pom.xml>
to org.apache.brooklyn/brooklyn-test-support/0.12.0-SNAPSHOT/brooklyn-test-support-0.12.0-SNAPSHOT.pom
[JENKINS] Archiving <https://builds.apache.org/job/brooklyn-server-master/ws/test-support/target/brooklyn-test-support-0.12.0-SNAPSHOT.jar>
to org.apache.brooklyn/brooklyn-test-support/0.12.0-SNAPSHOT/brooklyn-test-support-0.12.0-SNAPSHOT.jar
[JENKINS] Archiving <https://builds.apache.org/job/brooklyn-server-master/ws/test-support/target/brooklyn-test-support-0.12.0-SNAPSHOT-sources.jar>
to org.apache.brooklyn/brooklyn-test-support/0.12.0-SNAPSHOT/brooklyn-test-support-0.12.0-SNAPSHOT-sources.jar
[JENKINS] Archiving <https://builds.apache.org/job/brooklyn-server-master/ws/test-support/target/brooklyn-test-support-0.12.0-SNAPSHOT-test-sources.jar>
to org.apache.brooklyn/brooklyn-test-support/0.12.0-SNAPSHOT/brooklyn-test-support-0.12.0-SNAPSHOT-test-sources.jar
[JENKINS] Archiving <https://builds.apache.org/job/brooklyn-server-master/ws/rest/rest-server/pom.xml>
to org.apache.brooklyn/brooklyn-rest-server/0.12.0-SNAPSHOT/brooklyn-rest-server-0.12.0-SNAPSHOT.pom
[JENKINS] Archiving <https://builds.apache.org/job/brooklyn-server-master/ws/api/pom.xml>
to org.apache.brooklyn/brooklyn-api/0.12.0-SNAPSHOT/brooklyn-api-0.12.0-SNAPSHOT.pom
[JENKINS] Archiving <https://builds.apache.org/job/brooklyn-server-master/ws/api/target/brooklyn-api-0.12.0-SNAPSHOT.jar>
to org.apache.brooklyn/brooklyn-api/0.12.0-SNAPSHOT/brooklyn-api-0.12.0-SNAPSHOT.jar
[JENKINS] Archiving <https://builds.apache.org/job/brooklyn-server-master/ws/api/target/brooklyn-api-0.12.0-SNAPSHOT-sources.jar>
to org.apache.brooklyn/brooklyn-api/0.12.0-SNAPSHOT/brooklyn-api-0.12.0-SNAPSHOT-sources.jar
[JENKINS] Archiving <https://builds.apache.org/job/brooklyn-server-master/ws/api/target/brooklyn-api-0.12.0-SNAPSHOT-test-sources.jar>
to org.apache.brooklyn/brooklyn-api/0.12.0-SNAPSHOT/brooklyn-api-0.12.0-SNAPSHOT-test-sources.jar
[JENKINS] Archiving <https://builds.apache.org/job/brooklyn-server-master/ws/pom.xml>
to org.apache.brooklyn/brooklyn-server/0.12.0-SNAPSHOT/brooklyn-server-0.12.0-SNAPSHOT.pom
[JENKINS] Archiving <https://builds.apache.org/job/brooklyn-server-master/ws/locations/jclouds/pom.xml>
to org.apache.brooklyn/brooklyn-locations-jclouds/0.12.0-SNAPSHOT/brooklyn-locations-jclouds-0.12.0-SNAPSHOT.pom
[JENKINS] Archiving <https://builds.apache.org/job/brooklyn-server-master/ws/locations/jclouds/target/brooklyn-locations-jclouds-0.12.0-SNAPSHOT.jar>
to org.apache.brooklyn/brooklyn-locations-jclouds/0.12.0-SNAPSHOT/brooklyn-locations-jclouds-0.12.0-SNAPSHOT.jar
[JENKINS] Archiving <https://builds.apache.org/job/brooklyn-server-master/ws/locations/jclouds/target/brooklyn-locations-jclouds-0.12.0-SNAPSHOT-tests.jar>
to org.apache.brooklyn/brooklyn-locations-jclouds/0.12.0-SNAPSHOT/brooklyn-locations-jclouds-0.12.0-SNAPSHOT-tests.jar
[JENKINS] Archiving <https://builds.apache.org/job/brooklyn-server-master/ws/locations/jclouds/target/brooklyn-locations-jclouds-0.12.0-SNAPSHOT-sources.jar>
to org.apache.brooklyn/brooklyn-locations-jclouds/0.12.0-SNAPSHOT/brooklyn-locations-jclouds-0.12.0-SNAPSHOT-sources.jar
[JENKINS] Archiving <https://builds.apache.org/job/brooklyn-server-master/ws/locations/jclouds/target/brooklyn-locations-jclouds-0.12.0-SNAPSHOT-test-sources.jar>
to org.apache.brooklyn/brooklyn-locations-jclouds/0.12.0-SNAPSHOT/brooklyn-locations-jclouds-0.12.0-SNAPSHOT-test-sources.jar
[JENKINS] Archiving <https://builds.apache.org/job/brooklyn-server-master/ws/utils/common/pom.xml>
to org.apache.brooklyn/brooklyn-utils-common/0.12.0-SNAPSHOT/brooklyn-utils-common-0.12.0-SNAPSHOT.pom
[JENKINS] Archiving <https://builds.apache.org/job/brooklyn-server-master/ws/utils/common/target/brooklyn-utils-common-0.12.0-SNAPSHOT.jar>
to org.apache.brooklyn/brooklyn-utils-common/0.12.0-SNAPSHOT/brooklyn-utils-common-0.12.0-SNAPSHOT.jar
[JENKINS] Archiving <https://builds.apache.org/job/brooklyn-server-master/ws/utils/common/target/brooklyn-utils-common-0.12.0-SNAPSHOT-tests.jar>
to org.apache.brooklyn/brooklyn-utils-common/0.12.0-SNAPSHOT/brooklyn-utils-common-0.12.0-SNAPSHOT-tests.jar
[JENKINS] Archiving <https://builds.apache.org/job/brooklyn-server-master/ws/utils/common/target/brooklyn-utils-common-0.12.0-SNAPSHOT-sources.jar>
to org.apache.brooklyn/brooklyn-utils-common/0.12.0-SNAPSHOT/brooklyn-utils-common-0.12.0-SNAPSHOT-sources.jar
[JENKINS] Archiving <https://builds.apache.org/job/brooklyn-server-master/ws/utils/common/target/brooklyn-utils-common-0.12.0-SNAPSHOT-test-sources.jar>
to org.apache.brooklyn/brooklyn-utils-common/0.12.0-SNAPSHOT/brooklyn-utils-common-0.12.0-SNAPSHOT-test-sources.jar
[JENKINS] Archiving <https://builds.apache.org/job/brooklyn-server-master/ws/karaf/features/pom.xml>
to org.apache.brooklyn/brooklyn-features/0.12.0-SNAPSHOT/brooklyn-features-0.12.0-SNAPSHOT.pom
[JENKINS] Archiving <https://builds.apache.org/job/brooklyn-server-master/ws/rest/rest-api/pom.xml>
to org.apache.brooklyn/brooklyn-rest-api/0.12.0-SNAPSHOT/brooklyn-rest-api-0.12.0-SNAPSHOT.pom
[JENKINS] Archiving <https://builds.apache.org/job/brooklyn-server-master/ws/utils/jmx/jmxrmi-agent/pom.xml>
to org.apache.brooklyn/brooklyn-jmxrmi-agent/0.12.0-SNAPSHOT/brooklyn-jmxrmi-agent-0.12.0-SNAPSHOT.pom
[JENKINS] Archiving <https://builds.apache.org/job/brooklyn-server-master/ws/utils/jmx/jmxrmi-agent/target/brooklyn-jmxrmi-agent-0.12.0-SNAPSHOT.jar>
to org.apache.brooklyn/brooklyn-jmxrmi-agent/0.12.0-SNAPSHOT/brooklyn-jmxrmi-agent-0.12.0-SNAPSHOT.jar
[JENKINS] Archiving <https://builds.apache.org/job/brooklyn-server-master/ws/utils/jmx/jmxrmi-agent/target/brooklyn-jmxrmi-agent-0.12.0-SNAPSHOT-tests.jar>
to org.apache.brooklyn/brooklyn-jmxrmi-agent/0.12.0-SNAPSHOT/brooklyn-jmxrmi-agent-0.12.0-SNAPSHOT-tests.jar
[JENKINS] Archiving <https://builds.apache.org/job/brooklyn-server-master/ws/utils/jmx/jmxrmi-agent/target/brooklyn-jmxrmi-agent-0.12.0-SNAPSHOT-sources.jar>
to org.apache.brooklyn/brooklyn-jmxrmi-agent/0.12.0-SNAPSHOT/brooklyn-jmxrmi-agent-0.12.0-SNAPSHOT-sources.jar
[JENKINS] Archiving <https://builds.apache.org/job/brooklyn-server-master/ws/utils/jmx/jmxrmi-agent/target/brooklyn-jmxrmi-agent-0.12.0-SNAPSHOT-test-sources.jar>
to org.apache.brooklyn/brooklyn-jmxrmi-agent/0.12.0-SNAPSHOT/brooklyn-jmxrmi-agent-0.12.0-SNAPSHOT-test-sources.jar
[JENKINS] Archiving <https://builds.apache.org/job/brooklyn-server-master/ws/policy/pom.xml>
to org.apache.brooklyn/brooklyn-policy/0.12.0-SNAPSHOT/brooklyn-policy-0.12.0-SNAPSHOT.pom
[JENKINS] Archiving <https://builds.apache.org/job/brooklyn-server-master/ws/policy/target/brooklyn-policy-0.12.0-SNAPSHOT.jar>
to org.apache.brooklyn/brooklyn-policy/0.12.0-SNAPSHOT/brooklyn-policy-0.12.0-SNAPSHOT.jar
[JENKINS] Archiving <https://builds.apache.org/job/brooklyn-server-master/ws/policy/target/brooklyn-policy-0.12.0-SNAPSHOT-tests.jar>
to org.apache.brooklyn/brooklyn-policy/0.12.0-SNAPSHOT/brooklyn-policy-0.12.0-SNAPSHOT-tests.jar
[JENKINS] Archiving <https://builds.apache.org/job/brooklyn-server-master/ws/policy/target/brooklyn-policy-0.12.0-SNAPSHOT-sources.jar>
to org.apache.brooklyn/brooklyn-policy/0.12.0-SNAPSHOT/brooklyn-policy-0.12.0-SNAPSHOT-sources.jar
[JENKINS] Archiving <https://builds.apache.org/job/brooklyn-server-master/ws/policy/target/brooklyn-policy-0.12.0-SNAPSHOT-test-sources.jar>
to org.apache.brooklyn/brooklyn-policy/0.12.0-SNAPSHOT/brooklyn-policy-0.12.0-SNAPSHOT-test-sources.jar
[JENKINS] Archiving <https://builds.apache.org/job/brooklyn-server-master/ws/karaf/init/pom.xml>
to org.apache.brooklyn/brooklyn-karaf-init/0.12.0-SNAPSHOT/brooklyn-karaf-init-0.12.0-SNAPSHOT.pom
[JENKINS] Archiving <https://builds.apache.org/job/brooklyn-server-master/ws/karaf/commands/pom.xml>
to org.apache.brooklyn/brooklyn-commands/0.12.0-SNAPSHOT/brooklyn-commands-0.12.0-SNAPSHOT.pom
[JENKINS] Archiving <https://builds.apache.org/job/brooklyn-server-master/ws/logging/logback-includes/pom.xml>
to org.apache.brooklyn/brooklyn-logback-includes/0.12.0-SNAPSHOT/brooklyn-logback-includes-0.12.0-SNAPSHOT.pom
[JENKINS] Archiving <https://builds.apache.org/job/brooklyn-server-master/ws/logging/logback-includes/target/brooklyn-logback-includes-0.12.0-SNAPSHOT.jar>
to org.apache.brooklyn/brooklyn-logback-includes/0.12.0-SNAPSHOT/brooklyn-logback-includes-0.12.0-SNAPSHOT.jar
[JENKINS] Archiving <https://builds.apache.org/job/brooklyn-server-master/ws/logging/logback-includes/target/brooklyn-logback-includes-0.12.0-SNAPSHOT-sources.jar>
to org.apache.brooklyn/brooklyn-logback-includes/0.12.0-SNAPSHOT/brooklyn-logback-includes-0.12.0-SNAPSHOT-sources.jar
[JENKINS] Archiving <https://builds.apache.org/job/brooklyn-server-master/ws/logging/logback-includes/target/brooklyn-logback-includes-0.12.0-SNAPSHOT-test-sources.jar>
to org.apache.brooklyn/brooklyn-logback-includes/0.12.0-SNAPSHOT/brooklyn-logback-includes-0.12.0-SNAPSHOT-test-sources.jar
[JENKINS] Archiving <https://builds.apache.org/job/brooklyn-server-master/ws/rest/rest-resources/pom.xml>
to org.apache.brooklyn/brooklyn-rest-resources/0.12.0-SNAPSHOT/brooklyn-rest-resources-0.12.0-SNAPSHOT.pom
[JENKINS] Archiving <https://builds.apache.org/job/brooklyn-server-master/ws/utils/jmx/jmxmp-ssl-agent/pom.xml>
to org.apache.brooklyn/brooklyn-jmxmp-agent/0.12.0-SNAPSHOT/brooklyn-jmxmp-agent-0.12.0-SNAPSHOT.pom
[JENKINS] Archiving <https://builds.apache.org/job/brooklyn-server-master/ws/utils/jmx/jmxmp-ssl-agent/target/brooklyn-jmxmp-agent-0.12.0-SNAPSHOT.jar>
to org.apache.brooklyn/brooklyn-jmxmp-agent/0.12.0-SNAPSHOT/brooklyn-jmxmp-agent-0.12.0-SNAPSHOT.jar
[JENKINS] Archiving <https://builds.apache.org/job/brooklyn-server-master/ws/utils/jmx/jmxmp-ssl-agent/target/brooklyn-jmxmp-agent-0.12.0-SNAPSHOT-tests.jar>
to org.apache.brooklyn/brooklyn-jmxmp-agent/0.12.0-SNAPSHOT/brooklyn-jmxmp-agent-0.12.0-SNAPSHOT-tests.jar
[JENKINS] Archiving <https://builds.apache.org/job/brooklyn-server-master/ws/utils/jmx/jmxmp-ssl-agent/target/brooklyn-jmxmp-agent-shaded-0.12.0-SNAPSHOT.jar>
to org.apache.brooklyn/brooklyn-jmxmp-agent/0.12.0-SNAPSHOT/brooklyn-jmxmp-agent-0.12.0-SNAPSHOT-with-dependencies.jar
[JENKINS] Archiving <https://builds.apache.org/job/brooklyn-server-master/ws/utils/jmx/jmxmp-ssl-agent/target/brooklyn-jmxmp-agent-0.12.0-SNAPSHOT-sources.jar>
to org.apache.brooklyn/brooklyn-jmxmp-agent/0.12.0-SNAPSHOT/brooklyn-jmxmp-agent-0.12.0-SNAPSHOT-sources.jar
[JENKINS] Archiving <https://builds.apache.org/job/brooklyn-server-master/ws/utils/jmx/jmxmp-ssl-agent/target/brooklyn-jmxmp-agent-0.12.0-SNAPSHOT-test-sources.jar>
to org.apache.brooklyn/brooklyn-jmxmp-agent/0.12.0-SNAPSHOT/brooklyn-jmxmp-agent-0.12.0-SNAPSHOT-test-sources.jar
[JENKINS] Archiving <https://builds.apache.org/job/brooklyn-server-master/ws/parent/pom.xml>
to org.apache.brooklyn/brooklyn-parent/0.12.0-SNAPSHOT/brooklyn-parent-0.12.0-SNAPSHOT.pom
Compressed 80.33 KB of artifacts by 79.7% relative to #603
[JENKINS] Archiving <https://builds.apache.org/job/brooklyn-server-master/ws/software/winrm/pom.xml>
to org.apache.brooklyn/brooklyn-software-winrm/0.12.0-SNAPSHOT/brooklyn-software-winrm-0.12.0-SNAPSHOT.pom
[JENKINS] Archiving <https://builds.apache.org/job/brooklyn-server-master/ws/software/winrm/target/brooklyn-software-winrm-0.12.0-SNAPSHOT.jar>
to org.apache.brooklyn/brooklyn-software-winrm/0.12.0-SNAPSHOT/brooklyn-software-winrm-0.12.0-SNAPSHOT.jar
[JENKINS] Archiving <https://builds.apache.org/job/brooklyn-server-master/ws/software/winrm/target/brooklyn-software-winrm-0.12.0-SNAPSHOT-tests.jar>
to org.apache.brooklyn/brooklyn-software-winrm/0.12.0-SNAPSHOT/brooklyn-software-winrm-0.12.0-SNAPSHOT-tests.jar
[JENKINS] Archiving <https://builds.apache.org/job/brooklyn-server-master/ws/software/winrm/target/brooklyn-software-winrm-0.12.0-SNAPSHOT-sources.jar>
to org.apache.brooklyn/brooklyn-software-winrm/0.12.0-SNAPSHOT/brooklyn-software-winrm-0.12.0-SNAPSHOT-sources.jar
[JENKINS] Archiving <https://builds.apache.org/job/brooklyn-server-master/ws/software/winrm/target/brooklyn-software-winrm-0.12.0-SNAPSHOT-test-sources.jar>
to org.apache.brooklyn/brooklyn-software-winrm/0.12.0-SNAPSHOT/brooklyn-software-winrm-0.12.0-SNAPSHOT-test-sources.jar
channel stopped

Mime
View raw message