brooklyn-dev mailing list archives

Site index · List index
Message view « Date » · « Thread »
Top « Date » · « Thread »
From Apache Jenkins Server <jenk...@builds.apache.org>
Subject Build failed in Jenkins: brooklyn-server-master #585
Date Fri, 19 May 2017 11:46:20 GMT
See <https://builds.apache.org/job/brooklyn-server-master/585/display/redirect?page=changes>

Changes:

[aled.sage] Delete usage of Groovy ObservableList

------------------------------------------
[...truncated 3.86 MB...]
2017-05-19 11:43:48,340 WARN  Using DEPRECATED flag OPEN_IPTABLES (will not be supported in
future versions) for SshMachineLocation[173.194.32.1:jenkins@1.2.3.4/1.2.3.4:12345(id=gbn2wwm9tw)]
at JcloudsLocation[aws-ec2:us-east-1:stub-identity@runpg98xxg]
2017-05-19 11:43:48,340 INFO  No ports to open in iptables (no inbound ports) for SshMachineLocation[173.194.32.1:jenkins@1.2.3.4/1.2.3.4:12345(id=gbn2wwm9tw)]
at JcloudsLocation[aws-ec2:us-east-1:stub-identity@runpg98xxg]
2017-05-19 11:43:48,341 INFO  Finished VM aws-ec2:us-east-1 creation: jenkins@1.2.3.4/1.2.3.4:12345
ready after 150ms (semaphore obtained in 0ms;{image={id=us-east-1/bogus-image, providerId=ebs-image-provider,
name=image, location={scope=REGION, id=us-east-1, description=us-east-1, parent=aws-ec2},
os={family=ubuntu, arch=paravirtual, version=1.0, description=ubuntu, is64Bit=true}, description=description,
version=1.0, status=AVAILABLE, loginUser=root, userMetadata={rootDeviceType=ebs}}, hardware={id=supporting-bogus,
providerId=t2.micro, processors=[{cores=1.0, speed=0.1}], ram=1024, supportsImage=Predicates.and(requiresRootDeviceType(ebs),requiresVirtualizationType(paravirtual),idIn([us-east-1/bogus-image]),Predicates.alwaysTrue())},
location={scope=REGION, id=us-east-1, description=us-east-1, parent=aws-ec2}, options=Mock
for TemplateOptions, hashCode: 1702663130} template built in 0ms; {id=mynodeid1, location={scope=REGION,
id=us-east-1, description=us-east-1, parent=aws-ec2}, status=RUNNING, loginPort=22, privateAddresses=[172.168.10.1],
publicAddresses=[173.194.32.1]} provisioned in 1ms; SshMachineLocation[173.194.32.1:jenkins@1.2.3.4/1.2.3.4:12345(id=gbn2wwm9tw)]
connection usable in 144ms; and os customized in 5ms - point /dev/random to urandom)
2017-05-19 11:43:48,341 INFO  Releasing machine SshMachineLocation[173.194.32.1:jenkins@1.2.3.4/1.2.3.4:12345(id=gbn2wwm9tw)]
in JcloudsLocation[aws-ec2:us-east-1:stub-identity@runpg98xxg], instance id mynodeid1
2017-05-19 11:43:48,342 WARN  Releasing port-forwarding of SshMachineLocation[173.194.32.1:jenkins@1.2.3.4/1.2.3.4:12345(id=gbn2wwm9tw)]
not executing in execution-context (e.g. not invoked inside effector); falling back to executing
sequentially
2017-05-19 11:43:48,343 INFO  Attempted release of unknown machine SshMachineLocation[173.194.32.1:jenkins@1.2.3.4/1.2.3.4:12345(id=gbn2wwm9tw)]
in JcloudsLocation[aws-ec2:us-east-1:stub-identity@runpg98xxg]
2017-05-19 11:43:48,344 INFO  TESTNG PASSED: "Surefire test" - org.apache.brooklyn.location.jclouds.networking.JcloudsPortForwardingStubbedTest.testPortForwardingCallsForwarder()
finished in 155 ms
2017-05-19 11:43:48,344 INFO  TESTNG INVOKING CONFIGURATION: "Surefire test" - @AfterMethod
org.apache.brooklyn.location.jclouds.AbstractJcloudsStubbedUnitTest.tearDown()
2017-05-19 11:43:48,345 INFO  TESTNG PASSED CONFIGURATION: "Surefire test" - @AfterMethod
org.apache.brooklyn.location.jclouds.AbstractJcloudsStubbedUnitTest.tearDown() finished in
1 ms
2017-05-19 11:43:48,355 INFO  TESTNG INVOKING CONFIGURATION: "Surefire test" - @BeforeMethod
org.apache.brooklyn.location.jclouds.networking.JcloudsPortForwardingStubbedTest.setUp()
2017-05-19 11:43:48,362 INFO  No Camp-YAML parser registered for parsing catalog item DSL;
skipping DSL-parsing
2017-05-19 11:43:48,365 INFO  TESTNG PASSED CONFIGURATION: "Surefire test" - @BeforeMethod
org.apache.brooklyn.location.jclouds.networking.JcloudsPortForwardingStubbedTest.setUp() finished
in 10 ms
2017-05-19 11:43:48,365 INFO  TESTNG INVOKING: "Surefire test" - org.apache.brooklyn.location.jclouds.networking.JcloudsPortForwardingStubbedTest.testReleaseVmDoesNotImpactOtherVms()
2017-05-19 11:43:48,365 WARN  Deprecated construction of org.apache.brooklyn.core.location.access.PortForwardManagerImpl;
instead use location resolver
2017-05-19 11:43:48,366 INFO  Creating VM aws-ec2:us-east-1 in JcloudsLocation[aws-ec2:us-east-1:stub-identity@kmqzm0b1sh]
2017-05-19 11:43:48,366 WARN  Cannot check imageChooser status for aws-ec2:us-east-1 due to
manually supplied black-box TemplateBuilder; it is recommended to use a PortableTemplateBuilder
if you supply a TemplateBuilder
2017-05-19 11:43:48,367 WARN  No context entity found in config or current task
2017-05-19 11:43:48,370 INFO  Using host-and-port=1.2.3.4:12345 and user=myuser when connecting
to {id=mynodeid1, location={scope=REGION, id=us-east-1, description=us-east-1, parent=aws-ec2},
status=RUNNING, loginPort=22, privateAddresses=[172.168.10.1], publicAddresses=[173.194.32.1],
loginUser=myuser}
2017-05-19 11:43:48,371 INFO  Default SSH keys not found or not usable; will create new keys
for each machine. Create ~/.ssh/id_rsa or set privateKeyFile / privateKeyPassphrase / password
as appropriate for this location if you wish to be able to log in without Brooklyn.
2017-05-19 11:43:48,417 WARN  org.apache.brooklyn.core.mgmt.internal.LocalLocationManager@706b68e6
call to stop management of unknown location (already unmanaged?) SshMachineLocation[SshMachineLocation:lj0u:myuser@1.2.3.4/1.2.3.4:12345(id=lj0u5u5s4w)];
skipping, and all descendants
2017-05-19 11:43:48,424 WARN  Using DEPRECATED flag OPEN_IPTABLES (will not be supported in
future versions) for SshMachineLocation[173.194.32.1:jenkins@1.2.3.4/1.2.3.4:12345(id=xpxw620ohw)]
at JcloudsLocation[aws-ec2:us-east-1:stub-identity@kmqzm0b1sh]
2017-05-19 11:43:48,424 INFO  No ports to open in iptables (no inbound ports) for SshMachineLocation[173.194.32.1:jenkins@1.2.3.4/1.2.3.4:12345(id=xpxw620ohw)]
at JcloudsLocation[aws-ec2:us-east-1:stub-identity@kmqzm0b1sh]
2017-05-19 11:43:48,425 INFO  Finished VM aws-ec2:us-east-1 creation: jenkins@1.2.3.4/1.2.3.4:12345
ready after 58ms (semaphore obtained in 0ms;{image={id=us-east-1/bogus-image, providerId=ebs-image-provider,
name=image, location={scope=REGION, id=us-east-1, description=us-east-1, parent=aws-ec2},
os={family=ubuntu, arch=paravirtual, version=1.0, description=ubuntu, is64Bit=true}, description=description,
version=1.0, status=AVAILABLE, loginUser=root, userMetadata={rootDeviceType=ebs}}, hardware={id=supporting-bogus,
providerId=t2.micro, processors=[{cores=1.0, speed=0.1}], ram=1024, supportsImage=Predicates.and(requiresRootDeviceType(ebs),requiresVirtualizationType(paravirtual),idIn([us-east-1/bogus-image]),Predicates.alwaysTrue())},
location={scope=REGION, id=us-east-1, description=us-east-1, parent=aws-ec2}, options=Mock
for TemplateOptions, hashCode: 204948910} template built in 0ms; {id=mynodeid1, location={scope=REGION,
id=us-east-1, description=us-east-1, parent=aws-ec2}, status=RUNNING, loginPort=22, privateAddresses=[172.168.10.1],
publicAddresses=[173.194.32.1]} provisioned in 1ms; SshMachineLocation[173.194.32.1:jenkins@1.2.3.4/1.2.3.4:12345(id=xpxw620ohw)]
connection usable in 53ms; and os customized in 4ms - point /dev/random to urandom)
2017-05-19 11:43:48,425 INFO  Creating VM aws-ec2:us-east-1 in JcloudsLocation[aws-ec2:us-east-1:stub-identity@kmqzm0b1sh]
2017-05-19 11:43:48,425 WARN  Cannot check imageChooser status for aws-ec2:us-east-1 due to
manually supplied black-box TemplateBuilder; it is recommended to use a PortableTemplateBuilder
if you supply a TemplateBuilder
2017-05-19 11:43:48,427 WARN  No context entity found in config or current task
2017-05-19 11:43:48,429 INFO  Using host-and-port=1.2.3.4:12346 and user=myuser when connecting
to {id=mynodeid2, location={scope=REGION, id=us-east-1, description=us-east-1, parent=aws-ec2},
status=RUNNING, loginPort=22, privateAddresses=[172.168.10.2], publicAddresses=[173.194.32.2],
loginUser=myuser}
2017-05-19 11:43:48,430 INFO  Default SSH keys not found or not usable; will create new keys
for each machine. Create ~/.ssh/id_rsa or set privateKeyFile / privateKeyPassphrase / password
as appropriate for this location if you wish to be able to log in without Brooklyn.
2017-05-19 11:43:48,530 WARN  org.apache.brooklyn.core.mgmt.internal.LocalLocationManager@706b68e6
call to stop management of unknown location (already unmanaged?) SshMachineLocation[SshMachineLocation:g4yf:myuser@1.2.3.4/1.2.3.4:12346(id=g4yf2v4ss8)];
skipping, and all descendants
2017-05-19 11:43:48,554 WARN  Using DEPRECATED flag OPEN_IPTABLES (will not be supported in
future versions) for SshMachineLocation[173.194.32.2:jenkins@1.2.3.4/1.2.3.4:12346(id=qpym6s0epm)]
at JcloudsLocation[aws-ec2:us-east-1:stub-identity@kmqzm0b1sh]
2017-05-19 11:43:48,554 INFO  No ports to open in iptables (no inbound ports) for SshMachineLocation[173.194.32.2:jenkins@1.2.3.4/1.2.3.4:12346(id=qpym6s0epm)]
at JcloudsLocation[aws-ec2:us-east-1:stub-identity@kmqzm0b1sh]
2017-05-19 11:43:48,555 INFO  Finished VM aws-ec2:us-east-1 creation: jenkins@1.2.3.4/1.2.3.4:12346
ready after 129ms (semaphore obtained in 0ms;{image={id=us-east-1/bogus-image, providerId=ebs-image-provider,
name=image, location={scope=REGION, id=us-east-1, description=us-east-1, parent=aws-ec2},
os={family=ubuntu, arch=paravirtual, version=1.0, description=ubuntu, is64Bit=true}, description=description,
version=1.0, status=AVAILABLE, loginUser=root, userMetadata={rootDeviceType=ebs}}, hardware={id=supporting-bogus,
providerId=t2.micro, processors=[{cores=1.0, speed=0.1}], ram=1024, supportsImage=Predicates.and(requiresRootDeviceType(ebs),requiresVirtualizationType(paravirtual),idIn([us-east-1/bogus-image]),Predicates.alwaysTrue())},
location={scope=REGION, id=us-east-1, description=us-east-1, parent=aws-ec2}, options=Mock
for TemplateOptions, hashCode: 204948910} template built in 0ms; {id=mynodeid2, location={scope=REGION,
id=us-east-1, description=us-east-1, parent=aws-ec2}, status=RUNNING, loginPort=22, privateAddresses=[172.168.10.2],
publicAddresses=[173.194.32.2]} provisioned in 1ms; SshMachineLocation[173.194.32.2:jenkins@1.2.3.4/1.2.3.4:12346(id=qpym6s0epm)]
connection usable in 106ms; and os customized in 22ms - point /dev/random to urandom)
2017-05-19 11:43:48,555 INFO  Releasing machine SshMachineLocation[173.194.32.1:jenkins@1.2.3.4/1.2.3.4:12345(id=xpxw620ohw)]
in JcloudsLocation[aws-ec2:us-east-1:stub-identity@kmqzm0b1sh], instance id mynodeid1
2017-05-19 11:43:48,555 WARN  Releasing port-forwarding of SshMachineLocation[173.194.32.1:jenkins@1.2.3.4/1.2.3.4:12345(id=xpxw620ohw)]
not executing in execution-context (e.g. not invoked inside effector); falling back to executing
sequentially
2017-05-19 11:43:48,556 INFO  Attempted release of unknown machine SshMachineLocation[173.194.32.1:jenkins@1.2.3.4/1.2.3.4:12345(id=xpxw620ohw)]
in JcloudsLocation[aws-ec2:us-east-1:stub-identity@kmqzm0b1sh]
2017-05-19 11:43:48,557 INFO  TESTNG PASSED: "Surefire test" - org.apache.brooklyn.location.jclouds.networking.JcloudsPortForwardingStubbedTest.testReleaseVmDoesNotImpactOtherVms()
finished in 192 ms
2017-05-19 11:43:48,557 INFO  TESTNG INVOKING CONFIGURATION: "Surefire test" - @AfterMethod
org.apache.brooklyn.location.jclouds.AbstractJcloudsStubbedUnitTest.tearDown()
2017-05-19 11:43:48,557 INFO  Releasing machine SshMachineLocation[173.194.32.2:jenkins@1.2.3.4/1.2.3.4:12346(id=qpym6s0epm)]
in JcloudsLocation[aws-ec2:us-east-1:stub-identity@kmqzm0b1sh], instance id mynodeid2
2017-05-19 11:43:48,557 WARN  Releasing port-forwarding of SshMachineLocation[173.194.32.2:jenkins@1.2.3.4/1.2.3.4:12346(id=qpym6s0epm)]
not executing in execution-context (e.g. not invoked inside effector); falling back to executing
sequentially
2017-05-19 11:43:48,558 INFO  Attempted release of unknown machine SshMachineLocation[173.194.32.2:jenkins@1.2.3.4/1.2.3.4:12346(id=qpym6s0epm)]
in JcloudsLocation[aws-ec2:us-east-1:stub-identity@kmqzm0b1sh]
2017-05-19 11:43:48,559 INFO  TESTNG PASSED CONFIGURATION: "Surefire test" - @AfterMethod
org.apache.brooklyn.location.jclouds.AbstractJcloudsStubbedUnitTest.tearDown() finished in
2 ms
2017-05-19 11:43:48,635 INFO  TESTNG 
===============================================
    Surefire test
    Tests run: 168, Failures: 1, Skips: 0
===============================================
[GC (Allocation Failure)  241451K->30402K(762368K), 0.0619069 secs]
2017-05-19 11:43:48,859 WARN  Task[ssh: using urandom instead of random]@KCF5VbZu was never
submitted; did the code create it and forget to run it? ('cancel' the task to suppress this
message)
2017-05-19 11:43:48,860 WARN  Task[Close port-forward 1.2.3.4:12345->22]@YdV0CQLd was never
submitted; did the code create it and forget to run it? ('cancel' the task to suppress this
message)
2017-05-19 11:43:48,860 WARN  Task[close port-forwarding at SshMachineLocation[173.194.32.1:jenkins@1.2.3.4/1.2.3.4:12345(id=xpxw620ohw)]]@VtDSJ34a
was never submitted; did the code create it and forget to run it? ('cancel' the task to suppress
this message)
2017-05-19 11:43:48,860 WARN  Task[Close port-forward 1.2.3.4:12346->22]@r90FUllG was never
submitted; did the code create it and forget to run it? ('cancel' the task to suppress this
message)
2017-05-19 11:43:48,860 WARN  Task[Close port-forward 1.2.3.4:1234->80]@psFwZrCH was never
submitted; did the code create it and forget to run it? ('cancel' the task to suppress this
message)
2017-05-19 11:43:48,860 WARN  Task[close port-forwarding at SshMachineLocation[173.194.32.2:jenkins@1.2.3.4/1.2.3.4:12346(id=qpym6s0epm)]]@XOkyH7SG
was never submitted; did the code create it and forget to run it? ('cancel' the task to suppress
this message)
2017-05-19 11:43:48,860 WARN  Task[ssh: using urandom instead of random]@TUPXDGVq was never
submitted; did the code create it and forget to run it? ('cancel' the task to suppress this
message)
2017-05-19 11:43:48,860 WARN  Task[Close port-forward 1.2.3.4:1234->80]@EkNGcYtm was never
submitted; did the code create it and forget to run it? ('cancel' the task to suppress this
message)
2017-05-19 11:43:48,860 WARN  Task[close port-forwarding at SshMachineLocation[173.194.32.1:jenkins@173.194.32.1/173.194.32.1:22(id=e1ehi4g4ma)]]@wWOZndL6
was never submitted; did the code create it and forget to run it? ('cancel' the task to suppress
this message)
2017-05-19 11:43:48,860 WARN  Task[Close port-forward 1.2.3.4:12345->22]@AyNnSjI0 was never
submitted; did the code create it and forget to run it? ('cancel' the task to suppress this
message)
2017-05-19 11:43:48,860 WARN  Task[close port-forwarding at SshMachineLocation[173.194.32.1:jenkins@1.2.3.4/1.2.3.4:12345(id=gbn2wwm9tw)]]@sI8qlO7r
was never submitted; did the code create it and forget to run it? ('cancel' the task to suppress
this message)
2017-05-19 11:43:48,861 WARN  Task[ssh: using urandom instead of random]@kaT0PhKK was never
submitted; did the code create it and forget to run it? ('cancel' the task to suppress this
message)
2017-05-19 11:43:48,861 WARN  Task[ssh: using urandom instead of random]@iu9okTwV was never
submitted; did the code create it and forget to run it? ('cancel' the task to suppress this
message)
2017-05-19 11:43:48,862 WARN  Task[ssh: using urandom instead of random]@zw52CqL4 was never
submitted; did the code create it and forget to run it? ('cancel' the task to suppress this
message)
2017-05-19 11:43:48,862 WARN  Task[ssh: using urandom instead of random]@Pgt6PvBG was never
submitted; did the code create it and forget to run it? ('cancel' the task to suppress this
message)
2017-05-19 11:43:48,862 WARN  Task[ssh: using urandom instead of random]@MxognnK1 was never
submitted; did the code create it and forget to run it? ('cancel' the task to suppress this
message)
2017-05-19 11:43:48,862 WARN  Task[Close port-forward 1.2.3.4:12345->5985]@s6rj4TOz was
never submitted; did the code create it and forget to run it? ('cancel' the task to suppress
this message)
2017-05-19 11:43:48,862 WARN  Task[close port-forwarding at JcloudsWinRmMachineLocation{id=kivgz37e4a,
name=1.1.1.1}]@b906WY0j was never submitted; did the code create it and forget to run it?
('cancel' the task to suppress this message)
2017-05-19 11:43:48,862 WARN  Task[ssh: using urandom instead of random]@LVczcWaO was never
submitted; did the code create it and forget to run it? ('cancel' the task to suppress this
message)
2017-05-19 11:43:48,862 WARN  Task[ssh: using urandom instead of random]@PQeRg6nL was never
submitted; did the code create it and forget to run it? ('cancel' the task to suppress this
message)
2017-05-19 11:43:48,863 WARN  Task[ssh: using urandom instead of random]@XJcyhO7C was never
submitted; did the code create it and forget to run it? ('cancel' the task to suppress this
message)
2017-05-19 11:43:48,863 WARN  Task[Close port-forward 1.2.3.4:12345->22]@BpNOccBj was never
submitted; did the code create it and forget to run it? ('cancel' the task to suppress this
message)
2017-05-19 11:43:48,863 WARN  Task[close port-forwarding at SshMachineLocation[1.1.1.1:jenkins@1.2.3.4/1.2.3.4:12345(id=dgesy33crq)]]@zlEiCBwU
was never submitted; did the code create it and forget to run it? ('cancel' the task to suppress
this message)
2017-05-19 11:43:48,863 WARN  Task[ssh: using urandom instead of random]@fQFZvzVA was never
submitted; did the code create it and forget to run it? ('cancel' the task to suppress this
message)
Tests run: 168, Failures: 1, Errors: 0, Skipped: 0, Time elapsed: 30.522 sec <<<
FAILURE! - in TestSuite
testMode(org.apache.brooklyn.location.jclouds.DefaultConnectivityResolverTest)  Time elapsed:
0.141 sec  <<< FAILURE!
java.lang.AssertionError: expected [192.168.0.2] but found [10.0.0.2]
	at org.apache.brooklyn.location.jclouds.DefaultConnectivityResolverTest.testMode(DefaultConnectivityResolverTest.java:200)


Results :

Failed tests: 
org.apache.brooklyn.location.jclouds.DefaultConnectivityResolverTest.testMode(org.apache.brooklyn.location.jclouds.DefaultConnectivityResolverTest)
  Run 1: PASS
  Run 2: PASS
  Run 3: DefaultConnectivityResolverTest.testMode:200 expected [192.168.0.2] but found [10.0.0.2]
  Run 4: PASS
  Run 5: PASS
  Run 6: PASS


Tests run: 163, Failures: 1, Errors: 0, Skipped: 0

[JENKINS] Recording test results
[INFO] ------------------------------------------------------------------------
[INFO] Reactor Summary:
[INFO] 
[INFO] Brooklyn Server Root ............................... SUCCESS [ 11.558 s]
[INFO] Brooklyn Parent Project ............................ SUCCESS [ 20.897 s]
[INFO] Brooklyn Test Support Utilities .................... SUCCESS [ 25.302 s]
[INFO] Brooklyn Logback Includable Configuration .......... SUCCESS [ 47.697 s]
[INFO] Brooklyn Common Utilities .......................... SUCCESS [ 37.896 s]
[INFO] Brooklyn API ....................................... SUCCESS [ 13.310 s]
[INFO] CAMP Server Parent Project ......................... SUCCESS [  7.621 s]
[INFO] CAMP Base .......................................... SUCCESS [ 30.125 s]
[INFO] Brooklyn Test Support .............................. SUCCESS [ 17.079 s]
[INFO] Brooklyn REST Swagger Apidoc Utilities ............. SUCCESS [ 19.465 s]
[INFO] Brooklyn Logback Configuration ..................... SUCCESS [  6.825 s]
[INFO] CAMP Server ........................................ SUCCESS [ 20.813 s]
[INFO] Brooklyn Felix Runtime ............................. SUCCESS [ 10.539 s]
[INFO] Brooklyn Groovy Utilities .......................... SUCCESS [  9.650 s]
[INFO] Brooklyn Core ...................................... SUCCESS [04:14 min]
[INFO] Brooklyn Policies .................................. SUCCESS [01:13 min]
[INFO] Brooklyn WinRM Software Entities ................... SUCCESS [ 16.098 s]
[INFO] Brooklyn Secure JMXMP Agent ........................ SUCCESS [ 18.204 s]
[INFO] Brooklyn JMX RMI Agent ............................. SUCCESS [  6.187 s]
[INFO] Brooklyn Jclouds Location Targets .................. FAILURE [ 42.463 s]
[INFO] Brooklyn Software Base ............................. SKIPPED
[INFO] Brooklyn CAMP ...................................... SKIPPED
[INFO] Brooklyn Launcher Common ........................... SKIPPED
[INFO] Brooklyn REST API .................................. SKIPPED
[INFO] Brooklyn REST Resources ............................ SKIPPED
[INFO] Brooklyn REST Server ............................... SKIPPED
[INFO] Brooklyn Launcher .................................. SKIPPED
[INFO] Brooklyn Command Line Interface .................... SKIPPED
[INFO] Brooklyn Test Framework ............................ SKIPPED
[INFO] Brooklyn OSGi init ................................. SKIPPED
[INFO] Brooklyn Karaf ..................................... SKIPPED
[INFO] Jetty config fragment .............................. SKIPPED
[INFO] Apache Http Component extension .................... SKIPPED
[INFO] Brooklyn Karaf Features ............................ SKIPPED
[INFO] Brooklyn Karaf Shell Commands ...................... SKIPPED
[INFO] Brooklyn Karaf Tests ............................... SKIPPED
[INFO] ------------------------------------------------------------------------
[INFO] BUILD FAILURE
[INFO] ------------------------------------------------------------------------
[INFO] Total time: 14:48 min
[INFO] Finished at: 2017-05-19T11:44:03+00:00
[INFO] Final Memory: 98M/839M
[INFO] ------------------------------------------------------------------------
Waiting for Jenkins to finish collecting data
[ERROR] Failed to execute goal org.apache.maven.plugins:maven-surefire-plugin:2.19.1:test
(default-test) on project brooklyn-locations-jclouds: There are test failures.
[ERROR] 
[ERROR] Please refer to <https://builds.apache.org/job/brooklyn-server-master/ws/locations/jclouds/target/surefire-reports>
for the individual test results.
[ERROR] -> [Help 1]
[ERROR] 
[ERROR] To see the full stack trace of the errors, re-run Maven with the -e switch.
[ERROR] Re-run Maven using the -X switch to enable full debug logging.
[ERROR] 
[ERROR] For more information about the errors and possible solutions, please read the following
articles:
[ERROR] [Help 1] http://cwiki.apache.org/confluence/display/MAVEN/MojoFailureException
[ERROR] 
[ERROR] After correcting the problems, you can resume the build with the command
[ERROR]   mvn <goals> -rf :brooklyn-locations-jclouds
[JENKINS] Archiving <https://builds.apache.org/job/brooklyn-server-master/ws/camp/pom.xml>
to org.apache.brooklyn.camp/camp-parent/0.12.0-SNAPSHOT/camp-parent-0.12.0-SNAPSHOT.pom
[JENKINS] Archiving <https://builds.apache.org/job/brooklyn-server-master/ws/utils/rt-felix/pom.xml>
to org.apache.brooklyn/brooklyn-rt-felix/0.12.0-SNAPSHOT/brooklyn-rt-felix-0.12.0-SNAPSHOT.pom
[JENKINS] Archiving <https://builds.apache.org/job/brooklyn-server-master/ws/utils/rt-felix/target/brooklyn-rt-felix-0.12.0-SNAPSHOT.jar>
to org.apache.brooklyn/brooklyn-rt-felix/0.12.0-SNAPSHOT/brooklyn-rt-felix-0.12.0-SNAPSHOT.jar
[JENKINS] Archiving <https://builds.apache.org/job/brooklyn-server-master/ws/utils/rt-felix/target/brooklyn-rt-felix-0.12.0-SNAPSHOT-tests.jar>
to org.apache.brooklyn/brooklyn-rt-felix/0.12.0-SNAPSHOT/brooklyn-rt-felix-0.12.0-SNAPSHOT-tests.jar
[JENKINS] Archiving <https://builds.apache.org/job/brooklyn-server-master/ws/utils/rt-felix/target/brooklyn-rt-felix-0.12.0-SNAPSHOT-sources.jar>
to org.apache.brooklyn/brooklyn-rt-felix/0.12.0-SNAPSHOT/brooklyn-rt-felix-0.12.0-SNAPSHOT-sources.jar
[JENKINS] Archiving <https://builds.apache.org/job/brooklyn-server-master/ws/utils/rt-felix/target/brooklyn-rt-felix-0.12.0-SNAPSHOT-test-sources.jar>
to org.apache.brooklyn/brooklyn-rt-felix/0.12.0-SNAPSHOT/brooklyn-rt-felix-0.12.0-SNAPSHOT-test-sources.jar
[JENKINS] Archiving <https://builds.apache.org/job/brooklyn-server-master/ws/test-framework/pom.xml>
to org.apache.brooklyn/brooklyn-test-framework/0.12.0-SNAPSHOT/brooklyn-test-framework-0.12.0-SNAPSHOT.pom
[JENKINS] Archiving <https://builds.apache.org/job/brooklyn-server-master/ws/core/pom.xml>
to org.apache.brooklyn/brooklyn-core/0.12.0-SNAPSHOT/brooklyn-core-0.12.0-SNAPSHOT.pom
[JENKINS] Archiving <https://builds.apache.org/job/brooklyn-server-master/ws/core/target/brooklyn-core-0.12.0-SNAPSHOT.jar>
to org.apache.brooklyn/brooklyn-core/0.12.0-SNAPSHOT/brooklyn-core-0.12.0-SNAPSHOT.jar
[JENKINS] Archiving <https://builds.apache.org/job/brooklyn-server-master/ws/core/target/brooklyn-core-0.12.0-SNAPSHOT-tests.jar>
to org.apache.brooklyn/brooklyn-core/0.12.0-SNAPSHOT/brooklyn-core-0.12.0-SNAPSHOT-tests.jar
[JENKINS] Archiving <https://builds.apache.org/job/brooklyn-server-master/ws/core/target/brooklyn-core-0.12.0-SNAPSHOT-sources.jar>
to org.apache.brooklyn/brooklyn-core/0.12.0-SNAPSHOT/brooklyn-core-0.12.0-SNAPSHOT-sources.jar
[JENKINS] Archiving <https://builds.apache.org/job/brooklyn-server-master/ws/core/target/brooklyn-core-0.12.0-SNAPSHOT-test-sources.jar>
to org.apache.brooklyn/brooklyn-core/0.12.0-SNAPSHOT/brooklyn-core-0.12.0-SNAPSHOT-test-sources.jar
[JENKINS] Archiving <https://builds.apache.org/job/brooklyn-server-master/ws/camp/camp-server/pom.xml>
to org.apache.brooklyn.camp/camp-server/0.12.0-SNAPSHOT/camp-server-0.12.0-SNAPSHOT.pom
[JENKINS] Archiving <https://builds.apache.org/job/brooklyn-server-master/ws/camp/camp-server/target/camp-server-0.12.0-SNAPSHOT.jar>
to org.apache.brooklyn.camp/camp-server/0.12.0-SNAPSHOT/camp-server-0.12.0-SNAPSHOT.jar
[JENKINS] Archiving <https://builds.apache.org/job/brooklyn-server-master/ws/camp/camp-server/target/camp-server-0.12.0-SNAPSHOT-tests.jar>
to org.apache.brooklyn.camp/camp-server/0.12.0-SNAPSHOT/camp-server-0.12.0-SNAPSHOT-tests.jar
[JENKINS] Archiving <https://builds.apache.org/job/brooklyn-server-master/ws/camp/camp-server/target/camp-server-0.12.0-SNAPSHOT-sources.jar>
to org.apache.brooklyn.camp/camp-server/0.12.0-SNAPSHOT/camp-server-0.12.0-SNAPSHOT-sources.jar
[JENKINS] Archiving <https://builds.apache.org/job/brooklyn-server-master/ws/camp/camp-server/target/camp-server-0.12.0-SNAPSHOT-test-sources.jar>
to org.apache.brooklyn.camp/camp-server/0.12.0-SNAPSHOT/camp-server-0.12.0-SNAPSHOT-test-sources.jar
[JENKINS] Archiving <https://builds.apache.org/job/brooklyn-server-master/ws/launcher/pom.xml>
to org.apache.brooklyn/brooklyn-launcher/0.12.0-SNAPSHOT/brooklyn-launcher-0.12.0-SNAPSHOT.pom
[JENKINS] Archiving <https://builds.apache.org/job/brooklyn-server-master/ws/karaf/pom.xml>
to org.apache.brooklyn/brooklyn-karaf/0.12.0-SNAPSHOT/brooklyn-karaf-0.12.0-SNAPSHOT.pom
[JENKINS] Archiving <https://builds.apache.org/job/brooklyn-server-master/ws/karaf/httpcomponent-extension/pom.xml>
to org.apache.brooklyn/brooklyn-karaf-httpcomponents-extension/0.12.0-SNAPSHOT/brooklyn-karaf-httpcomponents-extension-0.12.0-SNAPSHOT.pom
[JENKINS] Archiving <https://builds.apache.org/job/brooklyn-server-master/ws/utils/test-support/pom.xml>
to org.apache.brooklyn/brooklyn-utils-test-support/0.12.0-SNAPSHOT/brooklyn-utils-test-support-0.12.0-SNAPSHOT.pom
[JENKINS] Archiving <https://builds.apache.org/job/brooklyn-server-master/ws/utils/test-support/target/brooklyn-utils-test-support-0.12.0-SNAPSHOT.jar>
to org.apache.brooklyn/brooklyn-utils-test-support/0.12.0-SNAPSHOT/brooklyn-utils-test-support-0.12.0-SNAPSHOT.jar
[JENKINS] Archiving <https://builds.apache.org/job/brooklyn-server-master/ws/utils/test-support/target/brooklyn-utils-test-support-0.12.0-SNAPSHOT-sources.jar>
to org.apache.brooklyn/brooklyn-utils-test-support/0.12.0-SNAPSHOT/brooklyn-utils-test-support-0.12.0-SNAPSHOT-sources.jar
[JENKINS] Archiving <https://builds.apache.org/job/brooklyn-server-master/ws/utils/test-support/target/brooklyn-utils-test-support-0.12.0-SNAPSHOT-test-sources.jar>
to org.apache.brooklyn/brooklyn-utils-test-support/0.12.0-SNAPSHOT/brooklyn-utils-test-support-0.12.0-SNAPSHOT-test-sources.jar
[JENKINS] Archiving <https://builds.apache.org/job/brooklyn-server-master/ws/software/base/pom.xml>
to org.apache.brooklyn/brooklyn-software-base/0.12.0-SNAPSHOT/brooklyn-software-base-0.12.0-SNAPSHOT.pom
[JENKINS] Archiving <https://builds.apache.org/job/brooklyn-server-master/ws/utils/groovy/pom.xml>
to org.apache.brooklyn/brooklyn-utils-groovy/0.12.0-SNAPSHOT/brooklyn-utils-groovy-0.12.0-SNAPSHOT.pom
[JENKINS] Archiving <https://builds.apache.org/job/brooklyn-server-master/ws/utils/groovy/target/brooklyn-utils-groovy-0.12.0-SNAPSHOT.jar>
to org.apache.brooklyn/brooklyn-utils-groovy/0.12.0-SNAPSHOT/brooklyn-utils-groovy-0.12.0-SNAPSHOT.jar
[JENKINS] Archiving <https://builds.apache.org/job/brooklyn-server-master/ws/utils/groovy/target/brooklyn-utils-groovy-0.12.0-SNAPSHOT-tests.jar>
to org.apache.brooklyn/brooklyn-utils-groovy/0.12.0-SNAPSHOT/brooklyn-utils-groovy-0.12.0-SNAPSHOT-tests.jar
[JENKINS] Archiving <https://builds.apache.org/job/brooklyn-server-master/ws/utils/groovy/target/brooklyn-utils-groovy-0.12.0-SNAPSHOT-sources.jar>
to org.apache.brooklyn/brooklyn-utils-groovy/0.12.0-SNAPSHOT/brooklyn-utils-groovy-0.12.0-SNAPSHOT-sources.jar
[JENKINS] Archiving <https://builds.apache.org/job/brooklyn-server-master/ws/utils/groovy/target/brooklyn-utils-groovy-0.12.0-SNAPSHOT-test-sources.jar>
to org.apache.brooklyn/brooklyn-utils-groovy/0.12.0-SNAPSHOT/brooklyn-utils-groovy-0.12.0-SNAPSHOT-test-sources.jar
[JENKINS] Archiving <https://builds.apache.org/job/brooklyn-server-master/ws/utils/rest-swagger/pom.xml>
to org.apache.brooklyn/brooklyn-utils-rest-swagger/0.12.0-SNAPSHOT/brooklyn-utils-rest-swagger-0.12.0-SNAPSHOT.pom
[JENKINS] Archiving <https://builds.apache.org/job/brooklyn-server-master/ws/utils/rest-swagger/target/brooklyn-utils-rest-swagger-0.12.0-SNAPSHOT.jar>
to org.apache.brooklyn/brooklyn-utils-rest-swagger/0.12.0-SNAPSHOT/brooklyn-utils-rest-swagger-0.12.0-SNAPSHOT.jar
[JENKINS] Archiving <https://builds.apache.org/job/brooklyn-server-master/ws/utils/rest-swagger/target/brooklyn-utils-rest-swagger-0.12.0-SNAPSHOT-sources.jar>
to org.apache.brooklyn/brooklyn-utils-rest-swagger/0.12.0-SNAPSHOT/brooklyn-utils-rest-swagger-0.12.0-SNAPSHOT-sources.jar
[JENKINS] Archiving <https://builds.apache.org/job/brooklyn-server-master/ws/utils/rest-swagger/target/brooklyn-utils-rest-swagger-0.12.0-SNAPSHOT-test-sources.jar>
to org.apache.brooklyn/brooklyn-utils-rest-swagger/0.12.0-SNAPSHOT/brooklyn-utils-rest-swagger-0.12.0-SNAPSHOT-test-sources.jar
[JENKINS] Archiving <https://builds.apache.org/job/brooklyn-server-master/ws/launcher-common/pom.xml>
to org.apache.brooklyn/brooklyn-launcher-common/0.12.0-SNAPSHOT/brooklyn-launcher-common-0.12.0-SNAPSHOT.pom
[JENKINS] Archiving <https://builds.apache.org/job/brooklyn-server-master/ws/camp/camp-base/pom.xml>
to org.apache.brooklyn.camp/camp-base/0.12.0-SNAPSHOT/camp-base-0.12.0-SNAPSHOT.pom
[JENKINS] Archiving <https://builds.apache.org/job/brooklyn-server-master/ws/camp/camp-base/target/camp-base-0.12.0-SNAPSHOT.jar>
to org.apache.brooklyn.camp/camp-base/0.12.0-SNAPSHOT/camp-base-0.12.0-SNAPSHOT.jar
[JENKINS] Archiving <https://builds.apache.org/job/brooklyn-server-master/ws/camp/camp-base/target/camp-base-0.12.0-SNAPSHOT-tests.jar>
to org.apache.brooklyn.camp/camp-base/0.12.0-SNAPSHOT/camp-base-0.12.0-SNAPSHOT-tests.jar
[JENKINS] Archiving <https://builds.apache.org/job/brooklyn-server-master/ws/camp/camp-base/target/camp-base-0.12.0-SNAPSHOT-sources.jar>
to org.apache.brooklyn.camp/camp-base/0.12.0-SNAPSHOT/camp-base-0.12.0-SNAPSHOT-sources.jar
[JENKINS] Archiving <https://builds.apache.org/job/brooklyn-server-master/ws/camp/camp-base/target/camp-base-0.12.0-SNAPSHOT-test-sources.jar>
to org.apache.brooklyn.camp/camp-base/0.12.0-SNAPSHOT/camp-base-0.12.0-SNAPSHOT-test-sources.jar
[JENKINS] Archiving <https://builds.apache.org/job/brooklyn-server-master/ws/camp/camp-brooklyn/pom.xml>
to org.apache.brooklyn/brooklyn-camp/0.12.0-SNAPSHOT/brooklyn-camp-0.12.0-SNAPSHOT.pom
[JENKINS] Archiving <https://builds.apache.org/job/brooklyn-server-master/ws/karaf/jetty-config/pom.xml>
to org.apache.brooklyn/brooklyn-karaf-jetty-config/0.12.0-SNAPSHOT/brooklyn-karaf-jetty-config-0.12.0-SNAPSHOT.pom
[JENKINS] Archiving <https://builds.apache.org/job/brooklyn-server-master/ws/server-cli/pom.xml>
to org.apache.brooklyn/brooklyn-cli/0.12.0-SNAPSHOT/brooklyn-cli-0.12.0-SNAPSHOT.pom
[JENKINS] Archiving <https://builds.apache.org/job/brooklyn-server-master/ws/logging/logback-xml/pom.xml>
to org.apache.brooklyn/brooklyn-logback-xml/0.12.0-SNAPSHOT/brooklyn-logback-xml-0.12.0-SNAPSHOT.pom
[JENKINS] Archiving <https://builds.apache.org/job/brooklyn-server-master/ws/logging/logback-xml/target/brooklyn-logback-xml-0.12.0-SNAPSHOT.jar>
to org.apache.brooklyn/brooklyn-logback-xml/0.12.0-SNAPSHOT/brooklyn-logback-xml-0.12.0-SNAPSHOT.jar
[JENKINS] Archiving <https://builds.apache.org/job/brooklyn-server-master/ws/logging/logback-xml/target/brooklyn-logback-xml-0.12.0-SNAPSHOT-sources.jar>
to org.apache.brooklyn/brooklyn-logback-xml/0.12.0-SNAPSHOT/brooklyn-logback-xml-0.12.0-SNAPSHOT-sources.jar
[JENKINS] Archiving <https://builds.apache.org/job/brooklyn-server-master/ws/logging/logback-xml/target/brooklyn-logback-xml-0.12.0-SNAPSHOT-test-sources.jar>
to org.apache.brooklyn/brooklyn-logback-xml/0.12.0-SNAPSHOT/brooklyn-logback-xml-0.12.0-SNAPSHOT-test-sources.jar
[JENKINS] Archiving <https://builds.apache.org/job/brooklyn-server-master/ws/karaf/itests/pom.xml>
to org.apache.brooklyn/brooklyn-features-itests/0.12.0-SNAPSHOT/brooklyn-features-itests-0.12.0-SNAPSHOT.pom
[JENKINS] Archiving <https://builds.apache.org/job/brooklyn-server-master/ws/test-support/pom.xml>
to org.apache.brooklyn/brooklyn-test-support/0.12.0-SNAPSHOT/brooklyn-test-support-0.12.0-SNAPSHOT.pom
[JENKINS] Archiving <https://builds.apache.org/job/brooklyn-server-master/ws/test-support/target/brooklyn-test-support-0.12.0-SNAPSHOT.jar>
to org.apache.brooklyn/brooklyn-test-support/0.12.0-SNAPSHOT/brooklyn-test-support-0.12.0-SNAPSHOT.jar
[JENKINS] Archiving <https://builds.apache.org/job/brooklyn-server-master/ws/test-support/target/brooklyn-test-support-0.12.0-SNAPSHOT-sources.jar>
to org.apache.brooklyn/brooklyn-test-support/0.12.0-SNAPSHOT/brooklyn-test-support-0.12.0-SNAPSHOT-sources.jar
[JENKINS] Archiving <https://builds.apache.org/job/brooklyn-server-master/ws/test-support/target/brooklyn-test-support-0.12.0-SNAPSHOT-test-sources.jar>
to org.apache.brooklyn/brooklyn-test-support/0.12.0-SNAPSHOT/brooklyn-test-support-0.12.0-SNAPSHOT-test-sources.jar
[JENKINS] Archiving <https://builds.apache.org/job/brooklyn-server-master/ws/rest/rest-server/pom.xml>
to org.apache.brooklyn/brooklyn-rest-server/0.12.0-SNAPSHOT/brooklyn-rest-server-0.12.0-SNAPSHOT.pom
[JENKINS] Archiving <https://builds.apache.org/job/brooklyn-server-master/ws/api/pom.xml>
to org.apache.brooklyn/brooklyn-api/0.12.0-SNAPSHOT/brooklyn-api-0.12.0-SNAPSHOT.pom
[JENKINS] Archiving <https://builds.apache.org/job/brooklyn-server-master/ws/api/target/brooklyn-api-0.12.0-SNAPSHOT.jar>
to org.apache.brooklyn/brooklyn-api/0.12.0-SNAPSHOT/brooklyn-api-0.12.0-SNAPSHOT.jar
[JENKINS] Archiving <https://builds.apache.org/job/brooklyn-server-master/ws/api/target/brooklyn-api-0.12.0-SNAPSHOT-sources.jar>
to org.apache.brooklyn/brooklyn-api/0.12.0-SNAPSHOT/brooklyn-api-0.12.0-SNAPSHOT-sources.jar
[JENKINS] Archiving <https://builds.apache.org/job/brooklyn-server-master/ws/api/target/brooklyn-api-0.12.0-SNAPSHOT-test-sources.jar>
to org.apache.brooklyn/brooklyn-api/0.12.0-SNAPSHOT/brooklyn-api-0.12.0-SNAPSHOT-test-sources.jar
[JENKINS] Archiving <https://builds.apache.org/job/brooklyn-server-master/ws/pom.xml>
to org.apache.brooklyn/brooklyn-server/0.12.0-SNAPSHOT/brooklyn-server-0.12.0-SNAPSHOT.pom
[JENKINS] Archiving <https://builds.apache.org/job/brooklyn-server-master/ws/locations/jclouds/pom.xml>
to org.apache.brooklyn/brooklyn-locations-jclouds/0.12.0-SNAPSHOT/brooklyn-locations-jclouds-0.12.0-SNAPSHOT.pom
[JENKINS] Archiving <https://builds.apache.org/job/brooklyn-server-master/ws/utils/common/pom.xml>
to org.apache.brooklyn/brooklyn-utils-common/0.12.0-SNAPSHOT/brooklyn-utils-common-0.12.0-SNAPSHOT.pom
[JENKINS] Archiving <https://builds.apache.org/job/brooklyn-server-master/ws/utils/common/target/brooklyn-utils-common-0.12.0-SNAPSHOT.jar>
to org.apache.brooklyn/brooklyn-utils-common/0.12.0-SNAPSHOT/brooklyn-utils-common-0.12.0-SNAPSHOT.jar
[JENKINS] Archiving <https://builds.apache.org/job/brooklyn-server-master/ws/utils/common/target/brooklyn-utils-common-0.12.0-SNAPSHOT-tests.jar>
to org.apache.brooklyn/brooklyn-utils-common/0.12.0-SNAPSHOT/brooklyn-utils-common-0.12.0-SNAPSHOT-tests.jar
[JENKINS] Archiving <https://builds.apache.org/job/brooklyn-server-master/ws/utils/common/target/brooklyn-utils-common-0.12.0-SNAPSHOT-sources.jar>
to org.apache.brooklyn/brooklyn-utils-common/0.12.0-SNAPSHOT/brooklyn-utils-common-0.12.0-SNAPSHOT-sources.jar
[JENKINS] Archiving <https://builds.apache.org/job/brooklyn-server-master/ws/utils/common/target/brooklyn-utils-common-0.12.0-SNAPSHOT-test-sources.jar>
to org.apache.brooklyn/brooklyn-utils-common/0.12.0-SNAPSHOT/brooklyn-utils-common-0.12.0-SNAPSHOT-test-sources.jar
[JENKINS] Archiving <https://builds.apache.org/job/brooklyn-server-master/ws/karaf/features/pom.xml>
to org.apache.brooklyn/brooklyn-features/0.12.0-SNAPSHOT/brooklyn-features-0.12.0-SNAPSHOT.pom
[JENKINS] Archiving <https://builds.apache.org/job/brooklyn-server-master/ws/rest/rest-api/pom.xml>
to org.apache.brooklyn/brooklyn-rest-api/0.12.0-SNAPSHOT/brooklyn-rest-api-0.12.0-SNAPSHOT.pom
[JENKINS] Archiving <https://builds.apache.org/job/brooklyn-server-master/ws/utils/jmx/jmxrmi-agent/pom.xml>
to org.apache.brooklyn/brooklyn-jmxrmi-agent/0.12.0-SNAPSHOT/brooklyn-jmxrmi-agent-0.12.0-SNAPSHOT.pom
[JENKINS] Archiving <https://builds.apache.org/job/brooklyn-server-master/ws/utils/jmx/jmxrmi-agent/target/brooklyn-jmxrmi-agent-0.12.0-SNAPSHOT.jar>
to org.apache.brooklyn/brooklyn-jmxrmi-agent/0.12.0-SNAPSHOT/brooklyn-jmxrmi-agent-0.12.0-SNAPSHOT.jar
[JENKINS] Archiving <https://builds.apache.org/job/brooklyn-server-master/ws/utils/jmx/jmxrmi-agent/target/brooklyn-jmxrmi-agent-0.12.0-SNAPSHOT-tests.jar>
to org.apache.brooklyn/brooklyn-jmxrmi-agent/0.12.0-SNAPSHOT/brooklyn-jmxrmi-agent-0.12.0-SNAPSHOT-tests.jar
[JENKINS] Archiving <https://builds.apache.org/job/brooklyn-server-master/ws/utils/jmx/jmxrmi-agent/target/brooklyn-jmxrmi-agent-0.12.0-SNAPSHOT-sources.jar>
to org.apache.brooklyn/brooklyn-jmxrmi-agent/0.12.0-SNAPSHOT/brooklyn-jmxrmi-agent-0.12.0-SNAPSHOT-sources.jar
[JENKINS] Archiving <https://builds.apache.org/job/brooklyn-server-master/ws/utils/jmx/jmxrmi-agent/target/brooklyn-jmxrmi-agent-0.12.0-SNAPSHOT-test-sources.jar>
to org.apache.brooklyn/brooklyn-jmxrmi-agent/0.12.0-SNAPSHOT/brooklyn-jmxrmi-agent-0.12.0-SNAPSHOT-test-sources.jar
[JENKINS] Archiving <https://builds.apache.org/job/brooklyn-server-master/ws/policy/pom.xml>
to org.apache.brooklyn/brooklyn-policy/0.12.0-SNAPSHOT/brooklyn-policy-0.12.0-SNAPSHOT.pom
[JENKINS] Archiving <https://builds.apache.org/job/brooklyn-server-master/ws/policy/target/brooklyn-policy-0.12.0-SNAPSHOT.jar>
to org.apache.brooklyn/brooklyn-policy/0.12.0-SNAPSHOT/brooklyn-policy-0.12.0-SNAPSHOT.jar
[JENKINS] Archiving <https://builds.apache.org/job/brooklyn-server-master/ws/policy/target/brooklyn-policy-0.12.0-SNAPSHOT-tests.jar>
to org.apache.brooklyn/brooklyn-policy/0.12.0-SNAPSHOT/brooklyn-policy-0.12.0-SNAPSHOT-tests.jar
[JENKINS] Archiving <https://builds.apache.org/job/brooklyn-server-master/ws/policy/target/brooklyn-policy-0.12.0-SNAPSHOT-sources.jar>
to org.apache.brooklyn/brooklyn-policy/0.12.0-SNAPSHOT/brooklyn-policy-0.12.0-SNAPSHOT-sources.jar
[JENKINS] Archiving <https://builds.apache.org/job/brooklyn-server-master/ws/policy/target/brooklyn-policy-0.12.0-SNAPSHOT-test-sources.jar>
to org.apache.brooklyn/brooklyn-policy/0.12.0-SNAPSHOT/brooklyn-policy-0.12.0-SNAPSHOT-test-sources.jar
[JENKINS] Archiving <https://builds.apache.org/job/brooklyn-server-master/ws/karaf/init/pom.xml>
to org.apache.brooklyn/brooklyn-karaf-init/0.12.0-SNAPSHOT/brooklyn-karaf-init-0.12.0-SNAPSHOT.pom
[JENKINS] Archiving <https://builds.apache.org/job/brooklyn-server-master/ws/karaf/commands/pom.xml>
to org.apache.brooklyn/brooklyn-commands/0.12.0-SNAPSHOT/brooklyn-commands-0.12.0-SNAPSHOT.pom
[JENKINS] Archiving <https://builds.apache.org/job/brooklyn-server-master/ws/logging/logback-includes/pom.xml>
to org.apache.brooklyn/brooklyn-logback-includes/0.12.0-SNAPSHOT/brooklyn-logback-includes-0.12.0-SNAPSHOT.pom
[JENKINS] Archiving <https://builds.apache.org/job/brooklyn-server-master/ws/logging/logback-includes/target/brooklyn-logback-includes-0.12.0-SNAPSHOT.jar>
to org.apache.brooklyn/brooklyn-logback-includes/0.12.0-SNAPSHOT/brooklyn-logback-includes-0.12.0-SNAPSHOT.jar
[JENKINS] Archiving <https://builds.apache.org/job/brooklyn-server-master/ws/logging/logback-includes/target/brooklyn-logback-includes-0.12.0-SNAPSHOT-sources.jar>
to org.apache.brooklyn/brooklyn-logback-includes/0.12.0-SNAPSHOT/brooklyn-logback-includes-0.12.0-SNAPSHOT-sources.jar
[JENKINS] Archiving <https://builds.apache.org/job/brooklyn-server-master/ws/logging/logback-includes/target/brooklyn-logback-includes-0.12.0-SNAPSHOT-test-sources.jar>
to org.apache.brooklyn/brooklyn-logback-includes/0.12.0-SNAPSHOT/brooklyn-logback-includes-0.12.0-SNAPSHOT-test-sources.jar
[JENKINS] Archiving <https://builds.apache.org/job/brooklyn-server-master/ws/rest/rest-resources/pom.xml>
to org.apache.brooklyn/brooklyn-rest-resources/0.12.0-SNAPSHOT/brooklyn-rest-resources-0.12.0-SNAPSHOT.pom
[JENKINS] Archiving <https://builds.apache.org/job/brooklyn-server-master/ws/utils/jmx/jmxmp-ssl-agent/pom.xml>
to org.apache.brooklyn/brooklyn-jmxmp-agent/0.12.0-SNAPSHOT/brooklyn-jmxmp-agent-0.12.0-SNAPSHOT.pom
[JENKINS] Archiving <https://builds.apache.org/job/brooklyn-server-master/ws/utils/jmx/jmxmp-ssl-agent/target/brooklyn-jmxmp-agent-0.12.0-SNAPSHOT.jar>
to org.apache.brooklyn/brooklyn-jmxmp-agent/0.12.0-SNAPSHOT/brooklyn-jmxmp-agent-0.12.0-SNAPSHOT.jar
[JENKINS] Archiving <https://builds.apache.org/job/brooklyn-server-master/ws/utils/jmx/jmxmp-ssl-agent/target/brooklyn-jmxmp-agent-0.12.0-SNAPSHOT-tests.jar>
to org.apache.brooklyn/brooklyn-jmxmp-agent/0.12.0-SNAPSHOT/brooklyn-jmxmp-agent-0.12.0-SNAPSHOT-tests.jar
[JENKINS] Archiving <https://builds.apache.org/job/brooklyn-server-master/ws/utils/jmx/jmxmp-ssl-agent/target/brooklyn-jmxmp-agent-shaded-0.12.0-SNAPSHOT.jar>
to org.apache.brooklyn/brooklyn-jmxmp-agent/0.12.0-SNAPSHOT/brooklyn-jmxmp-agent-0.12.0-SNAPSHOT-with-dependencies.jar
[JENKINS] Archiving <https://builds.apache.org/job/brooklyn-server-master/ws/utils/jmx/jmxmp-ssl-agent/target/brooklyn-jmxmp-agent-0.12.0-SNAPSHOT-sources.jar>
to org.apache.brooklyn/brooklyn-jmxmp-agent/0.12.0-SNAPSHOT/brooklyn-jmxmp-agent-0.12.0-SNAPSHOT-sources.jar
[JENKINS] Archiving <https://builds.apache.org/job/brooklyn-server-master/ws/utils/jmx/jmxmp-ssl-agent/target/brooklyn-jmxmp-agent-0.12.0-SNAPSHOT-test-sources.jar>
to org.apache.brooklyn/brooklyn-jmxmp-agent/0.12.0-SNAPSHOT/brooklyn-jmxmp-agent-0.12.0-SNAPSHOT-test-sources.jar
[JENKINS] Archiving <https://builds.apache.org/job/brooklyn-server-master/ws/parent/pom.xml>
to org.apache.brooklyn/brooklyn-parent/0.12.0-SNAPSHOT/brooklyn-parent-0.12.0-SNAPSHOT.pom
Compressed 80.35 KB of artifacts by 79.7% relative to #584
[JENKINS] Archiving <https://builds.apache.org/job/brooklyn-server-master/ws/software/winrm/pom.xml>
to org.apache.brooklyn/brooklyn-software-winrm/0.12.0-SNAPSHOT/brooklyn-software-winrm-0.12.0-SNAPSHOT.pom
[JENKINS] Archiving <https://builds.apache.org/job/brooklyn-server-master/ws/software/winrm/target/brooklyn-software-winrm-0.12.0-SNAPSHOT.jar>
to org.apache.brooklyn/brooklyn-software-winrm/0.12.0-SNAPSHOT/brooklyn-software-winrm-0.12.0-SNAPSHOT.jar
[JENKINS] Archiving <https://builds.apache.org/job/brooklyn-server-master/ws/software/winrm/target/brooklyn-software-winrm-0.12.0-SNAPSHOT-tests.jar>
to org.apache.brooklyn/brooklyn-software-winrm/0.12.0-SNAPSHOT/brooklyn-software-winrm-0.12.0-SNAPSHOT-tests.jar
[JENKINS] Archiving <https://builds.apache.org/job/brooklyn-server-master/ws/software/winrm/target/brooklyn-software-winrm-0.12.0-SNAPSHOT-sources.jar>
to org.apache.brooklyn/brooklyn-software-winrm/0.12.0-SNAPSHOT/brooklyn-software-winrm-0.12.0-SNAPSHOT-sources.jar
[JENKINS] Archiving <https://builds.apache.org/job/brooklyn-server-master/ws/software/winrm/target/brooklyn-software-winrm-0.12.0-SNAPSHOT-test-sources.jar>
to org.apache.brooklyn/brooklyn-software-winrm/0.12.0-SNAPSHOT/brooklyn-software-winrm-0.12.0-SNAPSHOT-test-sources.jar
channel stopped

Mime
View raw message