brooklyn-dev mailing list archives

Site index · List index
Message view « Date » · « Thread »
Top « Date » · « Thread »
From Apache Jenkins Server <jenk...@builds.apache.org>
Subject Build failed in Jenkins: brooklyn-library-master #272
Date Sat, 06 May 2017 03:57:16 GMT
See <https://builds.apache.org/job/brooklyn-library-master/272/display/redirect>

------------------------------------------
[...truncated 253.58 KB...]
org.testng.internal.thread.ThreadTimeoutException: Method org.apache.brooklyn.core.test.BrooklynMgmtUnitTestSupport.tearDown()
didn't finish within the time-out 30000
	at org.apache.brooklyn.core.test.BrooklynMgmtUnitTestSupport.destroyManagementContextSafely(BrooklynMgmtUnitTestSupport.java:73)
	at org.apache.brooklyn.core.test.BrooklynMgmtUnitTestSupport.tearDown(BrooklynMgmtUnitTestSupport.java:58)
	at java.util.concurrent.Executors$RunnableAdapter.call(Executors.java:511)
	at java.util.concurrent.FutureTask.run(FutureTask.java:266)
	at java.util.concurrent.ThreadPoolExecutor.runWorker(ThreadPoolExecutor.java:1142)
	at java.util.concurrent.ThreadPoolExecutor$Worker.run(ThreadPoolExecutor.java:617)
	at java.lang.Thread.run(Thread.java:745)
2017-05-06 03:55:55,931 INFO  TESTNG INVOKING CONFIGURATION: "Surefire test" - @AfterMethod
org.apache.brooklyn.core.test.BrooklynMgmtUnitTestSupport.tearDown()
2017-05-06 03:55:55,965 INFO  TESTNG PASSED CONFIGURATION: "Surefire test" - @AfterMethod
org.apache.brooklyn.core.test.BrooklynMgmtUnitTestSupport.tearDown() finished in 34 ms
2017-05-06 03:55:55,965 INFO  TESTNG INVOKING CONFIGURATION: "Surefire test" - @BeforeMethod
org.apache.brooklyn.entity.dns.AbstractGeoDnsServiceTest.setUp()
2017-05-06 03:55:55,977 WARN  Deprecated use of unmanaged location (SshMachineLocation[West
child:null@100.0.0.1/100.0.0.1:22(id=memm03bftr)]); will be managed automatically now but
not supported in future versions
2017-05-06 03:55:55,978 WARN  Deprecated use of unmanaged location (SshMachineLocation[West
child with location:null@100.0.0.1/100.0.0.1:22(id=wnrbibzkor)]); will be managed automatically
now but not supported in future versions
2017-05-06 03:55:55,979 WARN  Deprecated use of unmanaged location (SshMachineLocation[East
child:null@100.0.0.2/100.0.0.2:22(id=kbts9addfr)]); will be managed automatically now but
not supported in future versions
2017-05-06 03:55:55,979 WARN  Deprecated use of unmanaged location (SshMachineLocation[East
child with location:null@100.0.0.2/100.0.0.2:22(id=b4y7mppn0t)]); will be managed automatically
now but not supported in future versions
2017-05-06 03:55:55,980 WARN  Deprecated use of unmanaged location (SshMachineLocation[North
child:null@10.0.0.1/10.0.0.1:22(id=jfvr1j8dy6)]); will be managed automatically now but not
supported in future versions
2017-05-06 03:55:55,984 INFO  No Camp-YAML parser registered for parsing catalog item DSL;
skipping DSL-parsing
2017-05-06 03:55:56,014 INFO  TESTNG PASSED CONFIGURATION: "Surefire test" - @BeforeMethod
org.apache.brooklyn.entity.dns.AbstractGeoDnsServiceTest.setUp() finished in 49 ms
2017-05-06 03:55:56,014 INFO  TESTNG INVOKING: "Surefire test" - org.apache.brooklyn.entity.dns.AbstractGeoDnsServiceTest.testSubscribesToHostname()
2017-05-06 03:55:56,014 INFO  TESTNG SKIPPED: "Surefire test" - org.apache.brooklyn.entity.dns.AbstractGeoDnsServiceTest.testSubscribesToHostname()
finished in 0 ms
org.testng.internal.thread.ThreadTimeoutException: Method org.apache.brooklyn.core.test.BrooklynMgmtUnitTestSupport.tearDown()
didn't finish within the time-out 30000
	at org.apache.brooklyn.core.test.BrooklynMgmtUnitTestSupport.destroyManagementContextSafely(BrooklynMgmtUnitTestSupport.java:73)
	at org.apache.brooklyn.core.test.BrooklynMgmtUnitTestSupport.tearDown(BrooklynMgmtUnitTestSupport.java:58)
	at java.util.concurrent.Executors$RunnableAdapter.call(Executors.java:511)
	at java.util.concurrent.FutureTask.run(FutureTask.java:266)
	at java.util.concurrent.ThreadPoolExecutor.runWorker(ThreadPoolExecutor.java:1142)
	at java.util.concurrent.ThreadPoolExecutor$Worker.run(ThreadPoolExecutor.java:617)
	at java.lang.Thread.run(Thread.java:745)
2017-05-06 03:55:56,014 INFO  TESTNG INVOKING CONFIGURATION: "Surefire test" - @AfterMethod
org.apache.brooklyn.core.test.BrooklynMgmtUnitTestSupport.tearDown()
2017-05-06 03:55:56,021 INFO  TESTNG PASSED CONFIGURATION: "Surefire test" - @AfterMethod
org.apache.brooklyn.core.test.BrooklynMgmtUnitTestSupport.tearDown() finished in 7 ms
2017-05-06 03:55:56,021 INFO  TESTNG INVOKING CONFIGURATION: "Surefire test" - @BeforeMethod
org.apache.brooklyn.entity.webapp.DynamicWebAppFabricTest.setUp()
2017-05-06 03:55:56,032 INFO  TESTNG PASSED CONFIGURATION: "Surefire test" - @BeforeMethod
org.apache.brooklyn.entity.webapp.DynamicWebAppFabricTest.setUp() finished in 11 ms
2017-05-06 03:55:56,032 INFO  TESTNG INVOKING: "Surefire test" - org.apache.brooklyn.entity.webapp.DynamicWebAppFabricTest.testRequestCountAggregation()
2017-05-06 03:55:56,146 INFO  No Camp-YAML parser registered for parsing catalog item DSL;
skipping DSL-parsing
2017-05-06 03:55:56,158 INFO  Creating entity in fabric DynamicWebAppFabricImpl{id=uc48t9aap0}
at SimulatedLocation{id=vvk32zwqlj, name=SimulatedLocation:vvk3}
[GC (Allocation Failure)  259248K->23009K(774144K), 0.0145896 secs]
2017-05-06 03:55:56,325 WARN  Set no-arg constructor accessible for class org.apache.brooklyn.entity.software.base.SoftwareProcessImpl$UpdatingNotUpFromServiceProcessIsRunning
(deprecated; should have public no-arg constructor)
2017-05-06 03:55:56,325 WARN  Set no-arg constructor accessible for class org.apache.brooklyn.entity.software.base.SoftwareProcessImpl$ServiceNotUpDiagnosticsCollector
(deprecated; should have public no-arg constructor)
2017-05-06 03:55:56,350 INFO  Creating entity in fabric DynamicWebAppFabricImpl{id=uc48t9aap0}
at SimulatedLocation{id=lletlm5cbi, name=SimulatedLocation:llet}
2017-05-06 03:55:56,499 WARN  Set no-arg constructor accessible for class org.apache.brooklyn.entity.software.base.SoftwareProcessImpl$UpdatingNotUpFromServiceProcessIsRunning
(deprecated; should have public no-arg constructor)
2017-05-06 03:55:56,499 WARN  Set no-arg constructor accessible for class org.apache.brooklyn.entity.software.base.SoftwareProcessImpl$ServiceNotUpDiagnosticsCollector
(deprecated; should have public no-arg constructor)
2017-05-06 03:55:56,530 INFO  TESTNG PASSED: "Surefire test" - org.apache.brooklyn.entity.webapp.DynamicWebAppFabricTest.testRequestCountAggregation()
finished in 498 ms
2017-05-06 03:55:56,530 INFO  TESTNG INVOKING CONFIGURATION: "Surefire test" - @AfterMethod
org.apache.brooklyn.entity.webapp.DynamicWebAppFabricTest.tearDown()
2017-05-06 03:55:56,546 INFO  TESTNG PASSED CONFIGURATION: "Surefire test" - @AfterMethod
org.apache.brooklyn.entity.webapp.DynamicWebAppFabricTest.tearDown() finished in 16 ms
2017-05-06 03:55:56,548 INFO  TESTNG INVOKING CONFIGURATION: "Surefire test" - @BeforeMethod
org.apache.brooklyn.entity.webapp.DynamicWebAppFabricTest.setUp()
2017-05-06 03:55:56,548 WARN  Error calculating and setting aggregate for enricher Aggregator{uniqueTag=aggregator:webapp.reqs.errors,
running=true, entity=DynamicWebAppFabricImpl{id=uc48t9aap0}, id=u5wgqcesdn}
java.lang.IllegalStateException: Entity DynamicWebAppFabricImpl{id=uc48t9aap0} is no longer
managed, when trying to publish Sensor: webapp.reqs.errors (java.lang.Integer) null
	at org.apache.brooklyn.core.entity.AbstractEntity$BasicSensorSupport.emitInternal(AbstractEntity.java:1210)
~[brooklyn-core-0.12.0-SNAPSHOT.jar:0.12.0-SNAPSHOT]
2017-05-06 03:55:56,562 INFO  TESTNG PASSED CONFIGURATION: "Surefire test" - @BeforeMethod
org.apache.brooklyn.entity.webapp.DynamicWebAppFabricTest.setUp() finished in 14 ms
2017-05-06 03:55:56,562 INFO  TESTNG INVOKING: "Surefire test" - org.apache.brooklyn.entity.webapp.DynamicWebAppFabricTest.testRequestCountAggregationOverClusters()
2017-05-06 03:55:56,653 INFO  No Camp-YAML parser registered for parsing catalog item DSL;
skipping DSL-parsing
2017-05-06 03:55:56,657 INFO  Creating entity in fabric DynamicWebAppFabricImpl{id=ex676n97d8}
at SimulatedLocation{id=zjlhuhgjpr, name=SimulatedLocation:zjlh}
[GC (Allocation Failure)  261089K->22993K(776192K), 0.0084663 secs]
2017-05-06 03:55:56,716 WARN  Task Task[sensor uc48t9aap0:webapp.reqs.errors null]@GRvOgqn9
is being finalized before completion
2017-05-06 03:55:56,716 WARN  Task Task[sensor uc48t9aap0:webapp.reqs.total 3]@D8CKQwEg is
being finalized before completion
2017-05-06 03:55:56,716 WARN  Task Task[sensor uc48t9aap0:webapp.reqs.total 3]@axXAU54W is
being finalized before completion
2017-05-06 03:55:56,716 WARN  Task Task[sensor uc48t9aap0:group.members.removed]@XoWINCut
is being finalized before completion
2017-05-06 03:55:56,716 WARN  Task Task[sensor uc48t9aap0:group.members.removed]@auy8pmDq
is being finalized before completion
2017-05-06 03:55:56,716 WARN  Task Task[sensor uc48t9aap0:group.members.removed]@ExCPpe0d
is being finalized before completion
2017-05-06 03:55:56,716 WARN  Task Task[sensor uc48t9aap0:group.members.removed]@h6QqtvKv
is being finalized before completion
2017-05-06 03:55:56,716 WARN  Task Task[sensor uc48t9aap0:group.members.removed]@mxhQ8Run
is being finalized before completion
2017-05-06 03:55:56,716 WARN  Task Task[sensor uc48t9aap0:group.members.removed]@IagIYnaD
is being finalized before completion
2017-05-06 03:55:56,716 WARN  Task Task[sensor uc48t9aap0:group.members.removed]@wiMQurdE
is being finalized before completion
2017-05-06 03:55:56,716 WARN  Task Task[sensor uc48t9aap0:group.members.removed]@qVvnkq9r
is being finalized before completion
2017-05-06 03:55:56,716 WARN  Task Task[sensor uc48t9aap0:entity.children.removed]@IbhqCgZx
is being finalized before completion
2017-05-06 03:55:56,716 WARN  Task Task[sensor uc48t9aap0:entity.children.removed]@LkodZ31B
is being finalized before completion
2017-05-06 03:55:56,716 WARN  Task Task[sensor uc48t9aap0:group.members.removed]@tKAbhJUX
is being finalized before completion
2017-05-06 03:55:56,716 WARN  Task Task[sensor uc48t9aap0:group.members.removed]@H11ZCPMU
is being finalized before completion
2017-05-06 03:55:56,716 WARN  Task Task[sensor uc48t9aap0:group.members.removed]@vd4JFkTW
is being finalized before completion
2017-05-06 03:55:56,776 INFO  Creating entity in fabric DynamicWebAppFabricImpl{id=ex676n97d8}
at SimulatedLocation{id=rs6ne9t78z, name=SimulatedLocation:rs6n}
2017-05-06 03:55:56,792 INFO  Resize DynamicWebAppClusterImpl{id=z6spkx71j5} from 0 to 2
2017-05-06 03:55:56,902 INFO  Resize DynamicWebAppClusterImpl{id=qmfs7jb1jd} from 0 to 2
[GC (Allocation Failure)  263633K->22624K(775168K), 0.0068681 secs]
2017-05-06 03:55:56,977 WARN  Set no-arg constructor accessible for class org.apache.brooklyn.entity.software.base.SoftwareProcessImpl$UpdatingNotUpFromServiceProcessIsRunning
(deprecated; should have public no-arg constructor)
2017-05-06 03:55:56,977 WARN  Set no-arg constructor accessible for class org.apache.brooklyn.entity.software.base.SoftwareProcessImpl$ServiceNotUpDiagnosticsCollector
(deprecated; should have public no-arg constructor)
2017-05-06 03:55:57,099 WARN  Set no-arg constructor accessible for class org.apache.brooklyn.entity.software.base.SoftwareProcessImpl$UpdatingNotUpFromServiceProcessIsRunning
(deprecated; should have public no-arg constructor)
2017-05-06 03:55:57,100 WARN  Set no-arg constructor accessible for class org.apache.brooklyn.entity.software.base.SoftwareProcessImpl$ServiceNotUpDiagnosticsCollector
(deprecated; should have public no-arg constructor)
[GC (Allocation Failure)  263264K->23134K(777216K), 0.0102254 secs]
2017-05-06 03:55:57,200 WARN  Set no-arg constructor accessible for class org.apache.brooklyn.entity.software.base.SoftwareProcessImpl$UpdatingNotUpFromServiceProcessIsRunning
(deprecated; should have public no-arg constructor)
2017-05-06 03:55:57,200 WARN  Set no-arg constructor accessible for class org.apache.brooklyn.entity.software.base.SoftwareProcessImpl$ServiceNotUpDiagnosticsCollector
(deprecated; should have public no-arg constructor)
2017-05-06 03:55:57,287 WARN  Set no-arg constructor accessible for class org.apache.brooklyn.entity.software.base.SoftwareProcessImpl$UpdatingNotUpFromServiceProcessIsRunning
(deprecated; should have public no-arg constructor)
2017-05-06 03:55:57,288 WARN  Set no-arg constructor accessible for class org.apache.brooklyn.entity.software.base.SoftwareProcessImpl$ServiceNotUpDiagnosticsCollector
(deprecated; should have public no-arg constructor)
2017-05-06 03:55:57,361 INFO  TESTNG PASSED: "Surefire test" - org.apache.brooklyn.entity.webapp.DynamicWebAppFabricTest.testRequestCountAggregationOverClusters()
finished in 799 ms
2017-05-06 03:55:57,361 INFO  TESTNG INVOKING CONFIGURATION: "Surefire test" - @AfterMethod
org.apache.brooklyn.entity.webapp.DynamicWebAppFabricTest.tearDown()
2017-05-06 03:55:57,385 WARN  Error calculating and setting aggregate for enricher Aggregator{uniqueTag=aggregator:webapp.reqs.errors,
running=true, entity=DynamicWebAppFabricImpl{id=ex676n97d8}, id=aqh660lhff}
java.lang.IllegalStateException: Entity DynamicWebAppFabricImpl{id=ex676n97d8} is no longer
managed, when trying to publish Sensor: webapp.reqs.errors (java.lang.Integer) null
	at org.apache.brooklyn.core.entity.AbstractEntity$BasicSensorSupport.emitInternal(AbstractEntity.java:1210)
~[brooklyn-core-0.12.0-SNAPSHOT.jar:0.12.0-SNAPSHOT]
2017-05-06 03:55:57,386 INFO  TESTNG PASSED CONFIGURATION: "Surefire test" - @AfterMethod
org.apache.brooklyn.entity.webapp.DynamicWebAppFabricTest.tearDown() finished in 25 ms
2017-05-06 03:55:57,430 INFO  TESTNG 
===============================================
    Surefire test
    Tests run: 41, Failures: 0, Skips: 4
    Configuration Failures: 1, Skips: 0
===============================================
2017-05-06 03:55:57,431 WARN  Management Context LocalManagementContext[?-npWeofxv] running,
creation stacktrace:
java.lang.Throwable: for construction stacktrace
	at org.apache.brooklyn.core.mgmt.internal.LocalManagementContext.<init>(LocalManagementContext.java:142)
	at org.apache.brooklyn.core.mgmt.internal.LocalManagementContext.<init>(LocalManagementContext.java:175)
	at org.apache.brooklyn.core.mgmt.internal.LocalManagementContext.<init>(LocalManagementContext.java:167)
	at org.apache.brooklyn.core.mgmt.internal.LocalManagementContext.<init>(LocalManagementContext.java:154)
	at org.apache.brooklyn.core.test.entity.LocalManagementContextForTests.<init>(LocalManagementContextForTests.java:44)
	at org.apache.brooklyn.core.test.entity.LocalManagementContextForTests$Builder.build(LocalManagementContextForTests.java:184)
	at org.apache.brooklyn.core.test.entity.LocalManagementContextForTests.newInstance(LocalManagementContextForTests.java:199)
	at org.apache.brooklyn.core.test.BrooklynMgmtUnitTestSupport.setUp(BrooklynMgmtUnitTestSupport.java:50)
	at org.apache.brooklyn.core.test.BrooklynAppUnitTestSupport.setUp(BrooklynAppUnitTestSupport.java:38)
	at org.apache.brooklyn.entity.dns.AbstractGeoDnsServiceTest.setUp(AbstractGeoDnsServiceTest.java:98)
	at sun.reflect.NativeMethodAccessorImpl.invoke0(Native Method)
	at sun.reflect.NativeMethodAccessorImpl.invoke(NativeMethodAccessorImpl.java:62)
	at sun.reflect.DelegatingMethodAccessorImpl.invoke(DelegatingMethodAccessorImpl.java:43)
	at java.lang.reflect.Method.invoke(Method.java:498)
	at org.testng.internal.MethodInvocationHelper.invokeMethod(MethodInvocationHelper.java:104)
	at org.testng.internal.Invoker.invokeConfigurationMethod(Invoker.java:515)
	at org.testng.internal.Invoker.invokeConfigurations(Invoker.java:217)
	at org.testng.internal.Invoker.invokeMethod(Invoker.java:590)
	at org.testng.internal.Invoker.invokeTestMethod(Invoker.java:851)
	at org.testng.internal.Invoker.invokeTestMethods(Invoker.java:1177)
	at org.testng.internal.TestMethodWorker.invokeTestMethods(TestMethodWorker.java:129)
	at org.testng.internal.TestMethodWorker.run(TestMethodWorker.java:112)
	at org.testng.TestRunner.privateRun(TestRunner.java:756)
	at org.testng.TestRunner.run(TestRunner.java:610)
	at org.testng.SuiteRunner.runTest(SuiteRunner.java:387)
	at org.testng.SuiteRunner.runSequentially(SuiteRunner.java:382)
	at org.testng.SuiteRunner.privateRun(SuiteRunner.java:340)
	at org.testng.SuiteRunner.run(SuiteRunner.java:289)
	at org.testng.SuiteRunnerWorker.runSuite(SuiteRunnerWorker.java:52)
	at org.testng.SuiteRunnerWorker.run(SuiteRunnerWorker.java:86)
	at org.testng.TestNG.runSuitesSequentially(TestNG.java:1293)
	at org.testng.TestNG.runSuitesLocally(TestNG.java:1218)
	at org.testng.TestNG.runSuites(TestNG.java:1133)
	at org.testng.TestNG.run(TestNG.java:1104)
	at org.apache.maven.surefire.testng.TestNGExecutor.run(TestNGExecutor.java:132)
	at org.apache.maven.surefire.testng.TestNGDirectoryTestSuite.executeMulti(TestNGDirectoryTestSuite.java:193)
	at org.apache.maven.surefire.testng.TestNGDirectoryTestSuite.execute(TestNGDirectoryTestSuite.java:94)
	at org.apache.maven.surefire.testng.TestNGProvider.invoke(TestNGProvider.java:147)
	at org.apache.maven.surefire.booter.ForkedBooter.invokeProviderInSameClassLoader(ForkedBooter.java:290)
	at org.apache.maven.surefire.booter.ForkedBooter.runSuitesInProcess(ForkedBooter.java:242)
	at org.apache.maven.surefire.booter.ForkedBooter.main(ForkedBooter.java:121)

2017-05-06 03:55:57,431 INFO  BrooklynLeakListener.onFinish attempting to terminate all extant
ManagementContexts: name=Surefire test; includedGroups=[]; excludedGroups=[Integration, Acceptance,
Live, Live-sanity, WIP, Broken]; suiteName=Surefire suite; outDir=<https://builds.apache.org/job/brooklyn-library-master/ws/software/webapp/target/surefire-reports/Surefire>
suite: 1 ManagementContexts terminated
2017-05-06 03:55:57,433 ERROR Problem refreshing group membership: org.apache.brooklyn.util.exceptions.RuntimeInterruptedException:
java.lang.InterruptedException
org.apache.brooklyn.util.exceptions.RuntimeInterruptedException: java.lang.InterruptedException
	at org.apache.brooklyn.util.exceptions.Exceptions.propagate(Exceptions.java:124) ~[brooklyn-utils-common-0.12.0-SNAPSHOT.jar:0.12.0-SNAPSHOT]
Caused by: java.lang.InterruptedException: null
	at java.util.concurrent.FutureTask.awaitDone(FutureTask.java:404) [na:1.8.0_121]
Tests run: 42, Failures: 1, Errors: 0, Skipped: 4, Time elapsed: 50.513 sec <<< FAILURE!
- in TestSuite
tearDown(org.apache.brooklyn.entity.dns.AbstractGeoDnsServiceTest)  Time elapsed: 30.093 sec
 <<< FAILURE!
org.testng.internal.thread.ThreadTimeoutException: Method org.apache.brooklyn.core.test.BrooklynMgmtUnitTestSupport.tearDown()
didn't finish within the time-out 30000


Results :

Failed tests: 
  AbstractGeoDnsServiceTest>BrooklynMgmtUnitTestSupport.tearDown:58->BrooklynMgmtUnitTestSupport.destroyManagementContextSafely:73
ยป ThreadTimeout

Tests run: 42, Failures: 1, Errors: 0, Skipped: 4

[JENKINS] Recording test results
[INFO] ------------------------------------------------------------------------
[INFO] Reactor Summary:
[INFO] 
[INFO] Brooklyn Library Root .............................. SUCCESS [  3.607 s]
[INFO] Brooklyn CM SaltStack .............................. SUCCESS [ 40.624 s]
[INFO] Brooklyn CM Ansible ................................ SUCCESS [  8.195 s]
[INFO] Brooklyn CM Integration Root ....................... SUCCESS [  3.083 s]
[INFO] Brooklyn Network Software Entities ................. SUCCESS [  8.599 s]
[INFO] Brooklyn OSGi Software Entities .................... SUCCESS [  7.817 s]
[INFO] Brooklyn Database Software Entities ................ SUCCESS [ 10.610 s]
[INFO] Brooklyn Web App Software Entities ................. FAILURE [ 58.728 s]
[INFO] Brooklyn Messaging Software Entities ............... SKIPPED
[INFO] Brooklyn NoSQL Data Store Software Entities ........ SKIPPED
[INFO] Brooklyn Monitoring Software Entities .............. SKIPPED
[INFO] Brooklyn QA ........................................ SKIPPED
[INFO] Brooklyn Examples Aggregator Project ............... SKIPPED
[INFO] Brooklyn Examples Aggregator Project - Webapps ..... SKIPPED
[INFO] hello-world-webapp Maven Webapp .................... SKIPPED
[INFO] hello-world-sql-webapp Maven Webapp ................ SKIPPED
[INFO] Brooklyn Simple Web Cluster Example ................ SKIPPED
[INFO] Brooklyn Global Web Fabric Example ................. SKIPPED
[INFO] Brooklyn Simple Messaging Publish-Subscribe Example  SKIPPED
[INFO] Brooklyn NoSQL Cluster Examples .................... SKIPPED
[INFO] Brooklyn Library Karaf integration ................. SKIPPED
[INFO] Brooklyn Library Catalog ........................... SKIPPED
[INFO] Brooklyn Library Karaf Features .................... SKIPPED
[INFO] ------------------------------------------------------------------------
[INFO] BUILD FAILURE
[INFO] ------------------------------------------------------------------------
[INFO] Total time: 02:44 min
[INFO] Finished at: 2017-05-06T03:56:03+00:00
[INFO] Final Memory: 93M/718M
[INFO] ------------------------------------------------------------------------
Waiting for Jenkins to finish collecting data
[ERROR] Failed to execute goal org.apache.maven.plugins:maven-surefire-plugin:2.19.1:test
(default-test) on project brooklyn-software-webapp: There are test failures.
[ERROR] 
[ERROR] Please refer to <https://builds.apache.org/job/brooklyn-library-master/ws/software/webapp/target/surefire-reports>
for the individual test results.
[ERROR] -> [Help 1]
[ERROR] 
[ERROR] To see the full stack trace of the errors, re-run Maven with the -e switch.
[ERROR] Re-run Maven using the -X switch to enable full debug logging.
[ERROR] 
[ERROR] For more information about the errors and possible solutions, please read the following
articles:
[ERROR] [Help 1] http://cwiki.apache.org/confluence/display/MAVEN/MojoFailureException
[ERROR] 
[ERROR] After correcting the problems, you can resume the build with the command
[ERROR]   mvn <goals> -rf :brooklyn-software-webapp
[JENKINS] Archiving <https://builds.apache.org/job/brooklyn-library-master/ws/software/cm/salt/pom.xml>
to org.apache.brooklyn/brooklyn-software-cm-salt/0.12.0-SNAPSHOT/brooklyn-software-cm-salt-0.12.0-SNAPSHOT.pom
[JENKINS] Archiving <https://builds.apache.org/job/brooklyn-library-master/ws/software/cm/salt/target/brooklyn-software-cm-salt-0.12.0-SNAPSHOT.jar>
to org.apache.brooklyn/brooklyn-software-cm-salt/0.12.0-SNAPSHOT/brooklyn-software-cm-salt-0.12.0-SNAPSHOT.jar
[JENKINS] Archiving <https://builds.apache.org/job/brooklyn-library-master/ws/software/cm/salt/target/brooklyn-software-cm-salt-0.12.0-SNAPSHOT-tests.jar>
to org.apache.brooklyn/brooklyn-software-cm-salt/0.12.0-SNAPSHOT/brooklyn-software-cm-salt-0.12.0-SNAPSHOT-tests.jar
[JENKINS] Archiving <https://builds.apache.org/job/brooklyn-library-master/ws/software/cm/salt/target/brooklyn-software-cm-salt-0.12.0-SNAPSHOT-sources.jar>
to org.apache.brooklyn/brooklyn-software-cm-salt/0.12.0-SNAPSHOT/brooklyn-software-cm-salt-0.12.0-SNAPSHOT-sources.jar
[JENKINS] Archiving <https://builds.apache.org/job/brooklyn-library-master/ws/software/cm/salt/target/brooklyn-software-cm-salt-0.12.0-SNAPSHOT-test-sources.jar>
to org.apache.brooklyn/brooklyn-software-cm-salt/0.12.0-SNAPSHOT/brooklyn-software-cm-salt-0.12.0-SNAPSHOT-test-sources.jar
[JENKINS] Archiving <https://builds.apache.org/job/brooklyn-library-master/ws/software/osgi/pom.xml>
to org.apache.brooklyn/brooklyn-software-osgi/0.12.0-SNAPSHOT/brooklyn-software-osgi-0.12.0-SNAPSHOT.pom
[JENKINS] Archiving <https://builds.apache.org/job/brooklyn-library-master/ws/software/osgi/target/brooklyn-software-osgi-0.12.0-SNAPSHOT.jar>
to org.apache.brooklyn/brooklyn-software-osgi/0.12.0-SNAPSHOT/brooklyn-software-osgi-0.12.0-SNAPSHOT.jar
[JENKINS] Archiving <https://builds.apache.org/job/brooklyn-library-master/ws/software/osgi/target/brooklyn-software-osgi-0.12.0-SNAPSHOT-tests.jar>
to org.apache.brooklyn/brooklyn-software-osgi/0.12.0-SNAPSHOT/brooklyn-software-osgi-0.12.0-SNAPSHOT-tests.jar
[JENKINS] Archiving <https://builds.apache.org/job/brooklyn-library-master/ws/software/osgi/target/brooklyn-software-osgi-0.12.0-SNAPSHOT-sources.jar>
to org.apache.brooklyn/brooklyn-software-osgi/0.12.0-SNAPSHOT/brooklyn-software-osgi-0.12.0-SNAPSHOT-sources.jar
[JENKINS] Archiving <https://builds.apache.org/job/brooklyn-library-master/ws/software/osgi/target/brooklyn-software-osgi-0.12.0-SNAPSHOT-test-sources.jar>
to org.apache.brooklyn/brooklyn-software-osgi/0.12.0-SNAPSHOT/brooklyn-software-osgi-0.12.0-SNAPSHOT-test-sources.jar
[JENKINS] Archiving <https://builds.apache.org/job/brooklyn-library-master/ws/pom.xml>
to org.apache.brooklyn/brooklyn-library/0.12.0-SNAPSHOT/brooklyn-library-0.12.0-SNAPSHOT.pom
[JENKINS] Archiving <https://builds.apache.org/job/brooklyn-library-master/ws/software/database/pom.xml>
to org.apache.brooklyn/brooklyn-software-database/0.12.0-SNAPSHOT/brooklyn-software-database-0.12.0-SNAPSHOT.pom
[JENKINS] Archiving <https://builds.apache.org/job/brooklyn-library-master/ws/software/database/target/brooklyn-software-database-0.12.0-SNAPSHOT.jar>
to org.apache.brooklyn/brooklyn-software-database/0.12.0-SNAPSHOT/brooklyn-software-database-0.12.0-SNAPSHOT.jar
[JENKINS] Archiving <https://builds.apache.org/job/brooklyn-library-master/ws/software/database/target/brooklyn-software-database-0.12.0-SNAPSHOT-tests.jar>
to org.apache.brooklyn/brooklyn-software-database/0.12.0-SNAPSHOT/brooklyn-software-database-0.12.0-SNAPSHOT-tests.jar
[JENKINS] Archiving <https://builds.apache.org/job/brooklyn-library-master/ws/software/database/target/brooklyn-software-database-0.12.0-SNAPSHOT-sources.jar>
to org.apache.brooklyn/brooklyn-software-database/0.12.0-SNAPSHOT/brooklyn-software-database-0.12.0-SNAPSHOT-sources.jar
[JENKINS] Archiving <https://builds.apache.org/job/brooklyn-library-master/ws/software/database/target/brooklyn-software-database-0.12.0-SNAPSHOT-test-sources.jar>
to org.apache.brooklyn/brooklyn-software-database/0.12.0-SNAPSHOT/brooklyn-software-database-0.12.0-SNAPSHOT-test-sources.jar
Compressed 663.70 KB of artifacts by 19.3% relative to #271
[JENKINS] Archiving <https://builds.apache.org/job/brooklyn-library-master/ws/examples/webapps/hello-world-webapp/pom.xml>
to org.apache.brooklyn.example/brooklyn-example-hello-world-webapp/0.12.0-SNAPSHOT/brooklyn-example-hello-world-webapp-0.12.0-SNAPSHOT.pom
[JENKINS] Archiving <https://builds.apache.org/job/brooklyn-library-master/ws/software/messaging/pom.xml>
to org.apache.brooklyn/brooklyn-software-messaging/0.12.0-SNAPSHOT/brooklyn-software-messaging-0.12.0-SNAPSHOT.pom
[JENKINS] Archiving <https://builds.apache.org/job/brooklyn-library-master/ws/qa/pom.xml>
to org.apache.brooklyn/brooklyn-qa/0.12.0-SNAPSHOT/brooklyn-qa-0.12.0-SNAPSHOT.pom
[JENKINS] Archiving <https://builds.apache.org/job/brooklyn-library-master/ws/software/cm/ansible/pom.xml>
to org.apache.brooklyn/brooklyn-software-cm-ansible/0.12.0-SNAPSHOT/brooklyn-software-cm-ansible-0.12.0-SNAPSHOT.pom
[JENKINS] Archiving <https://builds.apache.org/job/brooklyn-library-master/ws/software/cm/ansible/target/brooklyn-software-cm-ansible-0.12.0-SNAPSHOT.jar>
to org.apache.brooklyn/brooklyn-software-cm-ansible/0.12.0-SNAPSHOT/brooklyn-software-cm-ansible-0.12.0-SNAPSHOT.jar
[JENKINS] Archiving <https://builds.apache.org/job/brooklyn-library-master/ws/software/cm/ansible/target/brooklyn-software-cm-ansible-0.12.0-SNAPSHOT-tests.jar>
to org.apache.brooklyn/brooklyn-software-cm-ansible/0.12.0-SNAPSHOT/brooklyn-software-cm-ansible-0.12.0-SNAPSHOT-tests.jar
[JENKINS] Archiving <https://builds.apache.org/job/brooklyn-library-master/ws/software/cm/ansible/target/brooklyn-software-cm-ansible-0.12.0-SNAPSHOT-sources.jar>
to org.apache.brooklyn/brooklyn-software-cm-ansible/0.12.0-SNAPSHOT/brooklyn-software-cm-ansible-0.12.0-SNAPSHOT-sources.jar
[JENKINS] Archiving <https://builds.apache.org/job/brooklyn-library-master/ws/software/cm/ansible/target/brooklyn-software-cm-ansible-0.12.0-SNAPSHOT-test-sources.jar>
to org.apache.brooklyn/brooklyn-software-cm-ansible/0.12.0-SNAPSHOT/brooklyn-software-cm-ansible-0.12.0-SNAPSHOT-test-sources.jar
[JENKINS] Archiving <https://builds.apache.org/job/brooklyn-library-master/ws/software/monitoring/pom.xml>
to org.apache.brooklyn/brooklyn-software-monitoring/0.12.0-SNAPSHOT/brooklyn-software-monitoring-0.12.0-SNAPSHOT.pom
[JENKINS] Archiving <https://builds.apache.org/job/brooklyn-library-master/ws/examples/global-web-fabric/pom.xml>
to org.apache.brooklyn.example/brooklyn-example-global-web-fabric/0.12.0-SNAPSHOT/brooklyn-example-global-web-fabric-0.12.0-SNAPSHOT.pom
[JENKINS] Archiving <https://builds.apache.org/job/brooklyn-library-master/ws/karaf/catalog/pom.xml>
to org.apache.brooklyn/brooklyn-library-catalog/0.12.0-SNAPSHOT/brooklyn-library-catalog-0.12.0-SNAPSHOT.pom
[JENKINS] Archiving <https://builds.apache.org/job/brooklyn-library-master/ws/software/cm/pom.xml>
to org.apache.brooklyn/brooklyn-software-cm/0.12.0-SNAPSHOT/brooklyn-software-cm-0.12.0-SNAPSHOT.pom
[JENKINS] Archiving <https://builds.apache.org/job/brooklyn-library-master/ws/examples/webapps/hello-world-sql/pom.xml>
to org.apache.brooklyn.example/brooklyn-example-hello-world-sql-webapp/0.12.0-SNAPSHOT/brooklyn-example-hello-world-sql-webapp-0.12.0-SNAPSHOT.pom
[JENKINS] Archiving <https://builds.apache.org/job/brooklyn-library-master/ws/examples/simple-messaging-pubsub/pom.xml>
to org.apache.brooklyn.example/brooklyn-example-simple-messaging-pubsub/0.12.0-SNAPSHOT/brooklyn-example-simple-messaging-pubsub-0.12.0-SNAPSHOT.pom
[JENKINS] Archiving <https://builds.apache.org/job/brooklyn-library-master/ws/software/network/pom.xml>
to org.apache.brooklyn/brooklyn-software-network/0.12.0-SNAPSHOT/brooklyn-software-network-0.12.0-SNAPSHOT.pom
[JENKINS] Archiving <https://builds.apache.org/job/brooklyn-library-master/ws/software/network/target/brooklyn-software-network-0.12.0-SNAPSHOT.jar>
to org.apache.brooklyn/brooklyn-software-network/0.12.0-SNAPSHOT/brooklyn-software-network-0.12.0-SNAPSHOT.jar
[JENKINS] Archiving <https://builds.apache.org/job/brooklyn-library-master/ws/software/network/target/brooklyn-software-network-0.12.0-SNAPSHOT-tests.jar>
to org.apache.brooklyn/brooklyn-software-network/0.12.0-SNAPSHOT/brooklyn-software-network-0.12.0-SNAPSHOT-tests.jar
[JENKINS] Archiving <https://builds.apache.org/job/brooklyn-library-master/ws/software/network/target/brooklyn-software-network-0.12.0-SNAPSHOT-sources.jar>
to org.apache.brooklyn/brooklyn-software-network/0.12.0-SNAPSHOT/brooklyn-software-network-0.12.0-SNAPSHOT-sources.jar
[JENKINS] Archiving <https://builds.apache.org/job/brooklyn-library-master/ws/software/network/target/brooklyn-software-network-0.12.0-SNAPSHOT-test-sources.jar>
to org.apache.brooklyn/brooklyn-software-network/0.12.0-SNAPSHOT/brooklyn-software-network-0.12.0-SNAPSHOT-test-sources.jar
[JENKINS] Archiving <https://builds.apache.org/job/brooklyn-library-master/ws/software/webapp/pom.xml>
to org.apache.brooklyn/brooklyn-software-webapp/0.12.0-SNAPSHOT/brooklyn-software-webapp-0.12.0-SNAPSHOT.pom
[JENKINS] Archiving <https://builds.apache.org/job/brooklyn-library-master/ws/software/nosql/pom.xml>
to org.apache.brooklyn/brooklyn-software-nosql/0.12.0-SNAPSHOT/brooklyn-software-nosql-0.12.0-SNAPSHOT.pom
[JENKINS] Archiving <https://builds.apache.org/job/brooklyn-library-master/ws/karaf/features/pom.xml>
to org.apache.brooklyn/brooklyn-library-features/0.12.0-SNAPSHOT/brooklyn-library-features-0.12.0-SNAPSHOT.pom
[JENKINS] Archiving <https://builds.apache.org/job/brooklyn-library-master/ws/karaf/pom.xml>
to org.apache.brooklyn/brooklyn-library-karaf/0.12.0-SNAPSHOT/brooklyn-library-karaf-0.12.0-SNAPSHOT.pom
[JENKINS] Archiving <https://builds.apache.org/job/brooklyn-library-master/ws/examples/simple-nosql-cluster/pom.xml>
to org.apache.brooklyn.example/brooklyn-example-simple-nosql-cluster/0.12.0-SNAPSHOT/brooklyn-example-simple-nosql-cluster-0.12.0-SNAPSHOT.pom
[JENKINS] Archiving <https://builds.apache.org/job/brooklyn-library-master/ws/examples/webapps/pom.xml>
to org.apache.brooklyn.example/brooklyn-examples-webapps-parent/0.12.0-SNAPSHOT/brooklyn-examples-webapps-parent-0.12.0-SNAPSHOT.pom
[JENKINS] Archiving <https://builds.apache.org/job/brooklyn-library-master/ws/examples/simple-web-cluster/pom.xml>
to org.apache.brooklyn.example/brooklyn-example-simple-web-cluster/0.12.0-SNAPSHOT/brooklyn-example-simple-web-cluster-0.12.0-SNAPSHOT.pom
[JENKINS] Archiving <https://builds.apache.org/job/brooklyn-library-master/ws/examples/pom.xml>
to org.apache.brooklyn.example/brooklyn-examples-parent/0.12.0-SNAPSHOT/brooklyn-examples-parent-0.12.0-SNAPSHOT.pom
channel stopped

Mime
View raw message