brooklyn-dev mailing list archives

Site index · List index
Message view « Date » · « Thread »
Top « Date » · « Thread »
From Apache Jenkins Server <jenk...@builds.apache.org>
Subject Build failed in Jenkins: brooklyn-library-master #271
Date Fri, 05 May 2017 14:22:55 GMT
See <https://builds.apache.org/job/brooklyn-library-master/271/display/redirect?page=changes>

Changes:

[duncan.grant] change config for 2.0.0

------------------------------------------
[...truncated 240.13 KB...]
2017-05-05 14:22:05,785 INFO  TESTNG INVOKING: "Surefire test" - org.apache.brooklyn.entity.webapp.HttpsSslConfigTest.testCoerce()
2017-05-05 14:22:05,786 INFO  TESTNG PASSED: "Surefire test" - org.apache.brooklyn.entity.webapp.HttpsSslConfigTest.testCoerce()
finished in 1 ms
2017-05-05 14:22:05,786 INFO  TESTNG INVOKING: "Surefire test" - org.apache.brooklyn.entity.webapp.jboss.JBoss7PasswordHashingTest.testPasswordForApplicationRealm()
2017-05-05 14:22:05,815 INFO  TESTNG PASSED: "Surefire test" - org.apache.brooklyn.entity.webapp.jboss.JBoss7PasswordHashingTest.testPasswordForApplicationRealm()
finished in 29 ms
2017-05-05 14:22:05,815 INFO  TESTNG INVOKING: "Surefire test" - org.apache.brooklyn.entity.webapp.jboss.JBoss7PasswordHashingTest.testPasswordForCustomRealm()
2017-05-05 14:22:05,816 INFO  TESTNG PASSED: "Surefire test" - org.apache.brooklyn.entity.webapp.jboss.JBoss7PasswordHashingTest.testPasswordForCustomRealm()
finished in 1 ms
2017-05-05 14:22:05,816 INFO  TESTNG INVOKING: "Surefire test" - org.apache.brooklyn.entity.webapp.jboss.JBoss7PasswordHashingTest.testPasswordForManagementRealm()
2017-05-05 14:22:05,816 INFO  TESTNG PASSED: "Surefire test" - org.apache.brooklyn.entity.webapp.jboss.JBoss7PasswordHashingTest.testPasswordForManagementRealm()
finished in 0 ms
2017-05-05 14:22:05,817 INFO  TESTNG INVOKING: "Surefire test" - org.apache.brooklyn.entity.proxy.ProxySslConfigTest.testFromMap()
2017-05-05 14:22:05,819 INFO  TESTNG PASSED: "Surefire test" - org.apache.brooklyn.entity.proxy.ProxySslConfigTest.testFromMap()
finished in 2 ms
2017-05-05 14:22:05,819 INFO  TESTNG INVOKING: "Surefire test" - org.apache.brooklyn.entity.proxy.ProxySslConfigTest.testFromMapWithNullsAndDefaults()
2017-05-05 14:22:05,820 INFO  TESTNG PASSED: "Surefire test" - org.apache.brooklyn.entity.proxy.ProxySslConfigTest.testFromMapWithNullsAndDefaults()
finished in 1 ms
2017-05-05 14:22:05,822 INFO  TESTNG INVOKING CONFIGURATION: "Surefire test" - @BeforeMethod
org.apache.brooklyn.entity.webapp.DynamicWebAppClusterTest.setUp()
2017-05-05 14:22:05,837 INFO  TESTNG PASSED CONFIGURATION: "Surefire test" - @BeforeMethod
org.apache.brooklyn.entity.webapp.DynamicWebAppClusterTest.setUp() finished in 15 ms
2017-05-05 14:22:05,837 INFO  TESTNG INVOKING: "Surefire test" - org.apache.brooklyn.entity.webapp.DynamicWebAppClusterTest.testPropertiesToChildren()
2017-05-05 14:22:05,984 INFO  No Camp-YAML parser registered for parsing catalog item DSL;
skipping DSL-parsing
2017-05-05 14:22:06,001 INFO  Resize DynamicWebAppClusterImpl{id=zamix7hoyi} from 0 to 1
2017-05-05 14:22:06,011 WARN  Unsupported flags when configuring TestJavaWebAppEntityImpl{id=hxkze5iuqi};
storing: {a=1, b=2}
[GC (Allocation Failure)  246955K->21773K(770560K), 0.0078035 secs]
2017-05-05 14:22:06,229 WARN  Set no-arg constructor accessible for class org.apache.brooklyn.entity.software.base.SoftwareProcessImpl$UpdatingNotUpFromServiceProcessIsRunning
(deprecated; should have public no-arg constructor)
2017-05-05 14:22:06,229 WARN  Set no-arg constructor accessible for class org.apache.brooklyn.entity.software.base.SoftwareProcessImpl$ServiceNotUpDiagnosticsCollector
(deprecated; should have public no-arg constructor)
2017-05-05 14:22:06,261 INFO  TESTNG PASSED: "Surefire test" - org.apache.brooklyn.entity.webapp.DynamicWebAppClusterTest.testPropertiesToChildren()
finished in 423 ms
2017-05-05 14:22:06,261 INFO  TESTNG INVOKING CONFIGURATION: "Surefire test" - @AfterMethod
org.apache.brooklyn.entity.webapp.DynamicWebAppClusterTest.tearDown()
2017-05-05 14:22:06,273 INFO  TESTNG PASSED CONFIGURATION: "Surefire test" - @AfterMethod
org.apache.brooklyn.entity.webapp.DynamicWebAppClusterTest.tearDown() finished in 12 ms
2017-05-05 14:22:06,273 INFO  TESTNG INVOKING CONFIGURATION: "Surefire test" - @BeforeMethod
org.apache.brooklyn.entity.webapp.DynamicWebAppClusterTest.setUp()
2017-05-05 14:22:06,288 INFO  TESTNG PASSED CONFIGURATION: "Surefire test" - @BeforeMethod
org.apache.brooklyn.entity.webapp.DynamicWebAppClusterTest.setUp() finished in 15 ms
2017-05-05 14:22:06,288 INFO  TESTNG INVOKING: "Surefire test" - org.apache.brooklyn.entity.webapp.DynamicWebAppClusterTest.testRequestCountAggregation()
2017-05-05 14:22:06,389 INFO  No Camp-YAML parser registered for parsing catalog item DSL;
skipping DSL-parsing
2017-05-05 14:22:06,405 INFO  Resize DynamicWebAppClusterImpl{id=l8fknqzp17} from 0 to 2
[GC (Allocation Failure)  252173K->20019K(772096K), 0.0068964 secs]
2017-05-05 14:22:06,554 WARN  Set no-arg constructor accessible for class org.apache.brooklyn.entity.software.base.SoftwareProcessImpl$UpdatingNotUpFromServiceProcessIsRunning
(deprecated; should have public no-arg constructor)
2017-05-05 14:22:06,554 WARN  Set no-arg constructor accessible for class org.apache.brooklyn.entity.software.base.SoftwareProcessImpl$ServiceNotUpDiagnosticsCollector
(deprecated; should have public no-arg constructor)
2017-05-05 14:22:06,704 WARN  Set no-arg constructor accessible for class org.apache.brooklyn.entity.software.base.SoftwareProcessImpl$UpdatingNotUpFromServiceProcessIsRunning
(deprecated; should have public no-arg constructor)
2017-05-05 14:22:06,704 WARN  Set no-arg constructor accessible for class org.apache.brooklyn.entity.software.base.SoftwareProcessImpl$ServiceNotUpDiagnosticsCollector
(deprecated; should have public no-arg constructor)
2017-05-05 14:22:06,737 INFO  TESTNG PASSED: "Surefire test" - org.apache.brooklyn.entity.webapp.DynamicWebAppClusterTest.testRequestCountAggregation()
finished in 449 ms
2017-05-05 14:22:06,737 INFO  TESTNG INVOKING CONFIGURATION: "Surefire test" - @AfterMethod
org.apache.brooklyn.entity.webapp.DynamicWebAppClusterTest.tearDown()
2017-05-05 14:22:06,750 INFO  TESTNG PASSED CONFIGURATION: "Surefire test" - @AfterMethod
org.apache.brooklyn.entity.webapp.DynamicWebAppClusterTest.tearDown() finished in 13 ms
2017-05-05 14:22:06,750 INFO  TESTNG INVOKING CONFIGURATION: "Surefire test" - @BeforeMethod
org.apache.brooklyn.entity.webapp.DynamicWebAppClusterTest.setUp()
2017-05-05 14:22:06,763 INFO  TESTNG PASSED CONFIGURATION: "Surefire test" - @BeforeMethod
org.apache.brooklyn.entity.webapp.DynamicWebAppClusterTest.setUp() finished in 13 ms
2017-05-05 14:22:06,763 INFO  TESTNG INVOKING: "Surefire test" - org.apache.brooklyn.entity.webapp.DynamicWebAppClusterTest.testSetsServiceUpIfMemberIsUp()
2017-05-05 14:22:06,859 INFO  No Camp-YAML parser registered for parsing catalog item DSL;
skipping DSL-parsing
2017-05-05 14:22:06,873 INFO  Resize DynamicWebAppClusterImpl{id=isz1xhiurw} from 0 to 1
[GC (Allocation Failure)  252979K->21246K(771584K), 0.0094272 secs]
2017-05-05 14:22:07,025 WARN  Set no-arg constructor accessible for class org.apache.brooklyn.entity.software.base.SoftwareProcessImpl$UpdatingNotUpFromServiceProcessIsRunning
(deprecated; should have public no-arg constructor)
2017-05-05 14:22:07,026 WARN  Set no-arg constructor accessible for class org.apache.brooklyn.entity.software.base.SoftwareProcessImpl$ServiceNotUpDiagnosticsCollector
(deprecated; should have public no-arg constructor)
2017-05-05 14:22:07,054 WARN  Setting TestJavaWebAppEntityImpl{id=rp3i5hy777} on-fire due
to problems when expected running, up=false, not-up-indicators: {}
2017-05-05 14:22:07,055 WARN  Setting DynamicWebAppClusterImpl{id=isz1xhiurw} on-fire due
to problems when expected running, up=false, problems: {service-lifecycle-indicators-from-children-and-members=Required
entity not healthy: TestJavaWebAppEntityImpl{id=rp3i5hy777}}
2017-05-05 14:22:07,056 WARN  Setting Application[am9wsqwb] on-fire due to problems when expected
running, up=false, problems: {service-lifecycle-indicators-from-children-and-members=Required
entity not healthy: DynamicWebAppClusterImpl{id=isz1xhiurw}}
2017-05-05 14:22:07,309 INFO  Resize DynamicWebAppClusterImpl{id=isz1xhiurw} from 1 to 2
2017-05-05 14:22:07,445 WARN  Set no-arg constructor accessible for class org.apache.brooklyn.entity.software.base.SoftwareProcessImpl$UpdatingNotUpFromServiceProcessIsRunning
(deprecated; should have public no-arg constructor)
2017-05-05 14:22:07,445 WARN  Set no-arg constructor accessible for class org.apache.brooklyn.entity.software.base.SoftwareProcessImpl$ServiceNotUpDiagnosticsCollector
(deprecated; should have public no-arg constructor)
2017-05-05 14:22:07,465 INFO  TESTNG PASSED: "Surefire test" - org.apache.brooklyn.entity.webapp.DynamicWebAppClusterTest.testSetsServiceUpIfMemberIsUp()
finished in 702 ms
2017-05-05 14:22:07,465 INFO  TESTNG INVOKING CONFIGURATION: "Surefire test" - @AfterMethod
org.apache.brooklyn.entity.webapp.DynamicWebAppClusterTest.tearDown()
2017-05-05 14:22:07,480 INFO  TESTNG PASSED CONFIGURATION: "Surefire test" - @AfterMethod
org.apache.brooklyn.entity.webapp.DynamicWebAppClusterTest.tearDown() finished in 15 ms
2017-05-05 14:22:07,480 INFO  TESTNG INVOKING CONFIGURATION: "Surefire test" - @BeforeMethod
org.apache.brooklyn.entity.webapp.DynamicWebAppClusterTest.setUp()
2017-05-05 14:22:07,492 INFO  TESTNG PASSED CONFIGURATION: "Surefire test" - @BeforeMethod
org.apache.brooklyn.entity.webapp.DynamicWebAppClusterTest.setUp() finished in 12 ms
2017-05-05 14:22:07,492 INFO  TESTNG INVOKING: "Surefire test" - org.apache.brooklyn.entity.webapp.DynamicWebAppClusterTest.testTestJavaWebAppEntityStarts()
[GC (Allocation Failure)  254206K->21576K(772608K), 0.0056891 secs]
2017-05-05 14:22:07,642 WARN  Set no-arg constructor accessible for class org.apache.brooklyn.entity.software.base.SoftwareProcessImpl$UpdatingNotUpFromServiceProcessIsRunning
(deprecated; should have public no-arg constructor)
2017-05-05 14:22:07,642 WARN  Set no-arg constructor accessible for class org.apache.brooklyn.entity.software.base.SoftwareProcessImpl$ServiceNotUpDiagnosticsCollector
(deprecated; should have public no-arg constructor)
2017-05-05 14:22:07,647 INFO  TESTNG PASSED: "Surefire test" - org.apache.brooklyn.entity.webapp.DynamicWebAppClusterTest.testTestJavaWebAppEntityStarts()
finished in 155 ms
2017-05-05 14:22:07,648 INFO  TESTNG INVOKING CONFIGURATION: "Surefire test" - @AfterMethod
org.apache.brooklyn.entity.webapp.DynamicWebAppClusterTest.tearDown()
2017-05-05 14:22:07,655 INFO  TESTNG PASSED CONFIGURATION: "Surefire test" - @AfterMethod
org.apache.brooklyn.entity.webapp.DynamicWebAppClusterTest.tearDown() finished in 8 ms
2017-05-05 14:22:07,655 INFO  TESTNG INVOKING: "Surefire test" - org.apache.brooklyn.entity.dns.geoscaling.GeoscalingScriptGeneratorTest.testScriptGeneration()
2017-05-05 14:22:07,662 INFO  TESTNG PASSED: "Surefire test" - org.apache.brooklyn.entity.dns.geoscaling.GeoscalingScriptGeneratorTest.testScriptGeneration()
finished in 7 ms
2017-05-05 14:22:07,663 INFO  TESTNG INVOKING CONFIGURATION: "Surefire test" - @BeforeMethod
org.apache.brooklyn.entity.proxy.UrlMappingTest.setup()
2017-05-05 14:22:07,879 INFO  Rebind check: no existing state; will persist new items to /tmp/1493994127663-0
2017-05-05 14:22:07,884 INFO  No Camp-YAML parser registered for parsing catalog item DSL;
skipping DSL-parsing
2017-05-05 14:22:08,009 INFO  Resize DynamicClusterImpl{id=rnpb3q4uhw} from 0 to 2
2017-05-05 14:22:08,301 INFO  app's location managed: true
2017-05-05 14:22:08,301 INFO  clusters's location managed: true
2017-05-05 14:22:08,301 INFO  TESTNG PASSED CONFIGURATION: "Surefire test" - @BeforeMethod
org.apache.brooklyn.entity.proxy.UrlMappingTest.setup() finished in 638 ms
2017-05-05 14:22:08,301 INFO  TESTNG INVOKING: "Surefire test" - org.apache.brooklyn.entity.proxy.UrlMappingTest.testTargetMappingUpdatesAfterRebind()
2017-05-05 14:22:08,301 INFO  starting testTargetMappingUpdatesAfterRebind
2017-05-05 14:22:08,325 INFO  Rebinding app, using mementoDir /tmp/1493994127663-0; object
store null
[GC (Allocation Failure)  255560K->25659K(772096K), 0.0097527 secs]
2017-05-05 14:22:08,481 INFO  Rebinding from /tmp/1493994127663-0 for master vz6mUY8P...
2017-05-05 14:22:08,606 INFO  Rebind complete (MASTER) in 269ms: 1 app, 6 entities, 3 locations,
0 policies, 16 enrichers, 0 feeds, 0 catalog items
2017-05-05 14:22:08,607 INFO  resizing DynamicClusterImpl{id=rnpb3q4uhw} - [QuarantineGroupImpl{id=xswjfsfr36},
StubAppServerImpl{id=v2q636clc2}, StubAppServerImpl{id=et68tk02ae}]
2017-05-05 14:22:08,608 INFO  Resize DynamicClusterImpl{id=rnpb3q4uhw} from 2 to 3
2017-05-05 14:22:08,733 INFO  resized DynamicClusterImpl{id=rnpb3q4uhw} (3) - [QuarantineGroupImpl{id=xswjfsfr36},
StubAppServerImpl{id=v2q636clc2}, StubAppServerImpl{id=et68tk02ae}, StubAppServerImpl{id=j96mmf66zb}]
2017-05-05 14:22:08,734 INFO  expecting [StubAppServerImpl{id=v2q636clc2}, StubAppServerImpl{id=et68tk02ae},
StubAppServerImpl{id=j96mmf66zb}]
2017-05-05 14:22:08,734 INFO  pretending one node down
2017-05-05 14:22:08,736 INFO  unmanaging another node
2017-05-05 14:22:08,737 INFO  success - testTargetMappingUpdatesAfterRebind
2017-05-05 14:22:08,737 INFO  TESTNG PASSED: "Surefire test" - org.apache.brooklyn.entity.proxy.UrlMappingTest.testTargetMappingUpdatesAfterRebind()
finished in 436 ms
2017-05-05 14:22:08,738 INFO  TESTNG INVOKING CONFIGURATION: "Surefire test" - @AfterMethod
org.apache.brooklyn.entity.proxy.UrlMappingTest.shutdown()
2017-05-05 14:22:08,767 INFO  TESTNG PASSED CONFIGURATION: "Surefire test" - @AfterMethod
org.apache.brooklyn.entity.proxy.UrlMappingTest.shutdown() finished in 30 ms
2017-05-05 14:22:08,812 INFO  TESTNG 
===============================================
    Surefire test
    Tests run: 41, Failures: 0, Skips: 11
    Configuration Failures: 1, Skips: 0
===============================================
2017-05-05 14:22:08,813 WARN  Management Context LocalManagementContext[?-pFc6IVfe] running,
creation stacktrace:
java.lang.Throwable: for construction stacktrace
	at org.apache.brooklyn.core.mgmt.internal.LocalManagementContext.<init>(LocalManagementContext.java:142)
	at org.apache.brooklyn.core.mgmt.internal.LocalManagementContext.<init>(LocalManagementContext.java:175)
	at org.apache.brooklyn.core.mgmt.internal.LocalManagementContext.<init>(LocalManagementContext.java:167)
	at org.apache.brooklyn.core.mgmt.internal.LocalManagementContext.<init>(LocalManagementContext.java:154)
	at org.apache.brooklyn.core.test.entity.LocalManagementContextForTests.<init>(LocalManagementContextForTests.java:44)
	at org.apache.brooklyn.core.test.entity.LocalManagementContextForTests$Builder.build(LocalManagementContextForTests.java:184)
	at org.apache.brooklyn.core.test.entity.LocalManagementContextForTests.newInstance(LocalManagementContextForTests.java:199)
	at org.apache.brooklyn.core.test.BrooklynMgmtUnitTestSupport.setUp(BrooklynMgmtUnitTestSupport.java:50)
	at org.apache.brooklyn.core.test.BrooklynAppUnitTestSupport.setUp(BrooklynAppUnitTestSupport.java:38)
	at org.apache.brooklyn.entity.dns.AbstractGeoDnsServiceTest.setUp(AbstractGeoDnsServiceTest.java:98)
	at sun.reflect.NativeMethodAccessorImpl.invoke0(Native Method)
	at sun.reflect.NativeMethodAccessorImpl.invoke(NativeMethodAccessorImpl.java:62)
	at sun.reflect.DelegatingMethodAccessorImpl.invoke(DelegatingMethodAccessorImpl.java:43)
	at java.lang.reflect.Method.invoke(Method.java:498)
	at org.testng.internal.MethodInvocationHelper.invokeMethod(MethodInvocationHelper.java:104)
	at org.testng.internal.Invoker.invokeConfigurationMethod(Invoker.java:515)
	at org.testng.internal.Invoker.invokeConfigurations(Invoker.java:217)
	at org.testng.internal.Invoker.invokeMethod(Invoker.java:590)
	at org.testng.internal.Invoker.invokeTestMethod(Invoker.java:851)
	at org.testng.internal.Invoker.invokeTestMethods(Invoker.java:1177)
	at org.testng.internal.TestMethodWorker.invokeTestMethods(TestMethodWorker.java:129)
	at org.testng.internal.TestMethodWorker.run(TestMethodWorker.java:112)
	at org.testng.TestRunner.privateRun(TestRunner.java:756)
	at org.testng.TestRunner.run(TestRunner.java:610)
	at org.testng.SuiteRunner.runTest(SuiteRunner.java:387)
	at org.testng.SuiteRunner.runSequentially(SuiteRunner.java:382)
	at org.testng.SuiteRunner.privateRun(SuiteRunner.java:340)
	at org.testng.SuiteRunner.run(SuiteRunner.java:289)
	at org.testng.SuiteRunnerWorker.runSuite(SuiteRunnerWorker.java:52)
	at org.testng.SuiteRunnerWorker.run(SuiteRunnerWorker.java:86)
	at org.testng.TestNG.runSuitesSequentially(TestNG.java:1293)
	at org.testng.TestNG.runSuitesLocally(TestNG.java:1218)
	at org.testng.TestNG.runSuites(TestNG.java:1133)
	at org.testng.TestNG.run(TestNG.java:1104)
	at org.apache.maven.surefire.testng.TestNGExecutor.run(TestNGExecutor.java:132)
	at org.apache.maven.surefire.testng.TestNGDirectoryTestSuite.executeMulti(TestNGDirectoryTestSuite.java:193)
	at org.apache.maven.surefire.testng.TestNGDirectoryTestSuite.execute(TestNGDirectoryTestSuite.java:94)
	at org.apache.maven.surefire.testng.TestNGProvider.invoke(TestNGProvider.java:147)
	at org.apache.maven.surefire.booter.ForkedBooter.invokeProviderInSameClassLoader(ForkedBooter.java:290)
	at org.apache.maven.surefire.booter.ForkedBooter.runSuitesInProcess(ForkedBooter.java:242)
	at org.apache.maven.surefire.booter.ForkedBooter.main(ForkedBooter.java:121)

2017-05-05 14:22:08,813 INFO  BrooklynLeakListener.onFinish attempting to terminate all extant
ManagementContexts: name=Surefire test; includedGroups=[]; excludedGroups=[Integration, Acceptance,
Live, Live-sanity, WIP, Broken]; suiteName=Surefire suite; outDir=<https://builds.apache.org/job/brooklyn-library-master/ws/software/webapp/target/surefire-reports/Surefire>
suite: 1 ManagementContexts terminated
2017-05-05 14:22:08,815 ERROR Problem refreshing group membership: org.apache.brooklyn.util.exceptions.RuntimeInterruptedException:
java.lang.InterruptedException
org.apache.brooklyn.util.exceptions.RuntimeInterruptedException: java.lang.InterruptedException
	at org.apache.brooklyn.util.exceptions.Exceptions.propagate(Exceptions.java:124) ~[brooklyn-utils-common-0.12.0-SNAPSHOT.jar:0.12.0-SNAPSHOT]
Caused by: java.lang.InterruptedException: null
	at java.util.concurrent.FutureTask.awaitDone(FutureTask.java:404) [na:1.8.0_121]
Tests run: 42, Failures: 1, Errors: 0, Skipped: 11, Time elapsed: 50.864 sec <<<
FAILURE! - in TestSuite
tearDown(org.apache.brooklyn.entity.dns.AbstractGeoDnsServiceTest)  Time elapsed: 30.099 sec
 <<< FAILURE!
org.testng.internal.thread.ThreadTimeoutException: Method org.apache.brooklyn.core.test.BrooklynMgmtUnitTestSupport.tearDown()
didn't finish within the time-out 30000


Results :

Failed tests: 
  AbstractGeoDnsServiceTest>BrooklynMgmtUnitTestSupport.tearDown:58->BrooklynMgmtUnitTestSupport.destroyManagementContextSafely:73
ยป ThreadTimeout

Tests run: 42, Failures: 1, Errors: 0, Skipped: 11

[JENKINS] Recording test results
[INFO] ------------------------------------------------------------------------
[INFO] Reactor Summary:
[INFO] 
[INFO] Brooklyn Library Root .............................. SUCCESS [  6.159 s]
[INFO] Brooklyn CM SaltStack .............................. SUCCESS [ 40.741 s]
[INFO] Brooklyn CM Ansible ................................ SUCCESS [  5.740 s]
[INFO] Brooklyn CM Integration Root ....................... SUCCESS [  0.846 s]
[INFO] Brooklyn Network Software Entities ................. SUCCESS [  6.234 s]
[INFO] Brooklyn OSGi Software Entities .................... SUCCESS [  5.987 s]
[INFO] Brooklyn Database Software Entities ................ SUCCESS [  9.034 s]
[INFO] Brooklyn Web App Software Entities ................. FAILURE [ 57.937 s]
[INFO] Brooklyn Messaging Software Entities ............... SKIPPED
[INFO] Brooklyn NoSQL Data Store Software Entities ........ SKIPPED
[INFO] Brooklyn Monitoring Software Entities .............. SKIPPED
[INFO] Brooklyn QA ........................................ SKIPPED
[INFO] Brooklyn Examples Aggregator Project ............... SKIPPED
[INFO] Brooklyn Examples Aggregator Project - Webapps ..... SKIPPED
[INFO] hello-world-webapp Maven Webapp .................... SKIPPED
[INFO] hello-world-sql-webapp Maven Webapp ................ SKIPPED
[INFO] Brooklyn Simple Web Cluster Example ................ SKIPPED
[INFO] Brooklyn Global Web Fabric Example ................. SKIPPED
[INFO] Brooklyn Simple Messaging Publish-Subscribe Example  SKIPPED
[INFO] Brooklyn NoSQL Cluster Examples .................... SKIPPED
[INFO] Brooklyn Library Karaf integration ................. SKIPPED
[INFO] Brooklyn Library Catalog ........................... SKIPPED
[INFO] Brooklyn Library Karaf Features .................... SKIPPED
[INFO] ------------------------------------------------------------------------
[INFO] BUILD FAILURE
[INFO] ------------------------------------------------------------------------
[INFO] Total time: 02:26 min
[INFO] Finished at: 2017-05-05T14:22:14+00:00
[INFO] Final Memory: 94M/731M
[INFO] ------------------------------------------------------------------------
Waiting for Jenkins to finish collecting data
[ERROR] Failed to execute goal org.apache.maven.plugins:maven-surefire-plugin:2.19.1:test
(default-test) on project brooklyn-software-webapp: There are test failures.
[ERROR] 
[ERROR] Please refer to <https://builds.apache.org/job/brooklyn-library-master/ws/software/webapp/target/surefire-reports>
for the individual test results.
[ERROR] -> [Help 1]
[ERROR] 
[ERROR] To see the full stack trace of the errors, re-run Maven with the -e switch.
[ERROR] Re-run Maven using the -X switch to enable full debug logging.
[ERROR] 
[ERROR] For more information about the errors and possible solutions, please read the following
articles:
[ERROR] [Help 1] http://cwiki.apache.org/confluence/display/MAVEN/MojoFailureException
[ERROR] 
[ERROR] After correcting the problems, you can resume the build with the command
[ERROR]   mvn <goals> -rf :brooklyn-software-webapp
[JENKINS] Archiving <https://builds.apache.org/job/brooklyn-library-master/ws/software/cm/salt/pom.xml>
to org.apache.brooklyn/brooklyn-software-cm-salt/0.12.0-SNAPSHOT/brooklyn-software-cm-salt-0.12.0-SNAPSHOT.pom
[JENKINS] Archiving <https://builds.apache.org/job/brooklyn-library-master/ws/software/cm/salt/target/brooklyn-software-cm-salt-0.12.0-SNAPSHOT.jar>
to org.apache.brooklyn/brooklyn-software-cm-salt/0.12.0-SNAPSHOT/brooklyn-software-cm-salt-0.12.0-SNAPSHOT.jar
[JENKINS] Archiving <https://builds.apache.org/job/brooklyn-library-master/ws/software/cm/salt/target/brooklyn-software-cm-salt-0.12.0-SNAPSHOT-tests.jar>
to org.apache.brooklyn/brooklyn-software-cm-salt/0.12.0-SNAPSHOT/brooklyn-software-cm-salt-0.12.0-SNAPSHOT-tests.jar
[JENKINS] Archiving <https://builds.apache.org/job/brooklyn-library-master/ws/software/cm/salt/target/brooklyn-software-cm-salt-0.12.0-SNAPSHOT-sources.jar>
to org.apache.brooklyn/brooklyn-software-cm-salt/0.12.0-SNAPSHOT/brooklyn-software-cm-salt-0.12.0-SNAPSHOT-sources.jar
[JENKINS] Archiving <https://builds.apache.org/job/brooklyn-library-master/ws/software/cm/salt/target/brooklyn-software-cm-salt-0.12.0-SNAPSHOT-test-sources.jar>
to org.apache.brooklyn/brooklyn-software-cm-salt/0.12.0-SNAPSHOT/brooklyn-software-cm-salt-0.12.0-SNAPSHOT-test-sources.jar
[JENKINS] Archiving <https://builds.apache.org/job/brooklyn-library-master/ws/software/osgi/pom.xml>
to org.apache.brooklyn/brooklyn-software-osgi/0.12.0-SNAPSHOT/brooklyn-software-osgi-0.12.0-SNAPSHOT.pom
[JENKINS] Archiving <https://builds.apache.org/job/brooklyn-library-master/ws/software/osgi/target/brooklyn-software-osgi-0.12.0-SNAPSHOT.jar>
to org.apache.brooklyn/brooklyn-software-osgi/0.12.0-SNAPSHOT/brooklyn-software-osgi-0.12.0-SNAPSHOT.jar
[JENKINS] Archiving <https://builds.apache.org/job/brooklyn-library-master/ws/software/osgi/target/brooklyn-software-osgi-0.12.0-SNAPSHOT-tests.jar>
to org.apache.brooklyn/brooklyn-software-osgi/0.12.0-SNAPSHOT/brooklyn-software-osgi-0.12.0-SNAPSHOT-tests.jar
[JENKINS] Archiving <https://builds.apache.org/job/brooklyn-library-master/ws/software/osgi/target/brooklyn-software-osgi-0.12.0-SNAPSHOT-sources.jar>
to org.apache.brooklyn/brooklyn-software-osgi/0.12.0-SNAPSHOT/brooklyn-software-osgi-0.12.0-SNAPSHOT-sources.jar
[JENKINS] Archiving <https://builds.apache.org/job/brooklyn-library-master/ws/software/osgi/target/brooklyn-software-osgi-0.12.0-SNAPSHOT-test-sources.jar>
to org.apache.brooklyn/brooklyn-software-osgi/0.12.0-SNAPSHOT/brooklyn-software-osgi-0.12.0-SNAPSHOT-test-sources.jar
[JENKINS] Archiving <https://builds.apache.org/job/brooklyn-library-master/ws/pom.xml>
to org.apache.brooklyn/brooklyn-library/0.12.0-SNAPSHOT/brooklyn-library-0.12.0-SNAPSHOT.pom
[JENKINS] Archiving <https://builds.apache.org/job/brooklyn-library-master/ws/software/database/pom.xml>
to org.apache.brooklyn/brooklyn-software-database/0.12.0-SNAPSHOT/brooklyn-software-database-0.12.0-SNAPSHOT.pom
[JENKINS] Archiving <https://builds.apache.org/job/brooklyn-library-master/ws/software/database/target/brooklyn-software-database-0.12.0-SNAPSHOT.jar>
to org.apache.brooklyn/brooklyn-software-database/0.12.0-SNAPSHOT/brooklyn-software-database-0.12.0-SNAPSHOT.jar
[JENKINS] Archiving <https://builds.apache.org/job/brooklyn-library-master/ws/software/database/target/brooklyn-software-database-0.12.0-SNAPSHOT-tests.jar>
to org.apache.brooklyn/brooklyn-software-database/0.12.0-SNAPSHOT/brooklyn-software-database-0.12.0-SNAPSHOT-tests.jar
[JENKINS] Archiving <https://builds.apache.org/job/brooklyn-library-master/ws/software/database/target/brooklyn-software-database-0.12.0-SNAPSHOT-sources.jar>
to org.apache.brooklyn/brooklyn-software-database/0.12.0-SNAPSHOT/brooklyn-software-database-0.12.0-SNAPSHOT-sources.jar
[JENKINS] Archiving <https://builds.apache.org/job/brooklyn-library-master/ws/software/database/target/brooklyn-software-database-0.12.0-SNAPSHOT-test-sources.jar>
to org.apache.brooklyn/brooklyn-software-database/0.12.0-SNAPSHOT/brooklyn-software-database-0.12.0-SNAPSHOT-test-sources.jar
Compressed 663.69 KB of artifacts by 19.3% relative to #270
[JENKINS] Archiving <https://builds.apache.org/job/brooklyn-library-master/ws/examples/webapps/hello-world-webapp/pom.xml>
to org.apache.brooklyn.example/brooklyn-example-hello-world-webapp/0.12.0-SNAPSHOT/brooklyn-example-hello-world-webapp-0.12.0-SNAPSHOT.pom
[JENKINS] Archiving <https://builds.apache.org/job/brooklyn-library-master/ws/software/messaging/pom.xml>
to org.apache.brooklyn/brooklyn-software-messaging/0.12.0-SNAPSHOT/brooklyn-software-messaging-0.12.0-SNAPSHOT.pom
[JENKINS] Archiving <https://builds.apache.org/job/brooklyn-library-master/ws/qa/pom.xml>
to org.apache.brooklyn/brooklyn-qa/0.12.0-SNAPSHOT/brooklyn-qa-0.12.0-SNAPSHOT.pom
[JENKINS] Archiving <https://builds.apache.org/job/brooklyn-library-master/ws/software/cm/ansible/pom.xml>
to org.apache.brooklyn/brooklyn-software-cm-ansible/0.12.0-SNAPSHOT/brooklyn-software-cm-ansible-0.12.0-SNAPSHOT.pom
[JENKINS] Archiving <https://builds.apache.org/job/brooklyn-library-master/ws/software/cm/ansible/target/brooklyn-software-cm-ansible-0.12.0-SNAPSHOT.jar>
to org.apache.brooklyn/brooklyn-software-cm-ansible/0.12.0-SNAPSHOT/brooklyn-software-cm-ansible-0.12.0-SNAPSHOT.jar
[JENKINS] Archiving <https://builds.apache.org/job/brooklyn-library-master/ws/software/cm/ansible/target/brooklyn-software-cm-ansible-0.12.0-SNAPSHOT-tests.jar>
to org.apache.brooklyn/brooklyn-software-cm-ansible/0.12.0-SNAPSHOT/brooklyn-software-cm-ansible-0.12.0-SNAPSHOT-tests.jar
[JENKINS] Archiving <https://builds.apache.org/job/brooklyn-library-master/ws/software/cm/ansible/target/brooklyn-software-cm-ansible-0.12.0-SNAPSHOT-sources.jar>
to org.apache.brooklyn/brooklyn-software-cm-ansible/0.12.0-SNAPSHOT/brooklyn-software-cm-ansible-0.12.0-SNAPSHOT-sources.jar
[JENKINS] Archiving <https://builds.apache.org/job/brooklyn-library-master/ws/software/cm/ansible/target/brooklyn-software-cm-ansible-0.12.0-SNAPSHOT-test-sources.jar>
to org.apache.brooklyn/brooklyn-software-cm-ansible/0.12.0-SNAPSHOT/brooklyn-software-cm-ansible-0.12.0-SNAPSHOT-test-sources.jar
[JENKINS] Archiving <https://builds.apache.org/job/brooklyn-library-master/ws/software/monitoring/pom.xml>
to org.apache.brooklyn/brooklyn-software-monitoring/0.12.0-SNAPSHOT/brooklyn-software-monitoring-0.12.0-SNAPSHOT.pom
[JENKINS] Archiving <https://builds.apache.org/job/brooklyn-library-master/ws/examples/global-web-fabric/pom.xml>
to org.apache.brooklyn.example/brooklyn-example-global-web-fabric/0.12.0-SNAPSHOT/brooklyn-example-global-web-fabric-0.12.0-SNAPSHOT.pom
[JENKINS] Archiving <https://builds.apache.org/job/brooklyn-library-master/ws/karaf/catalog/pom.xml>
to org.apache.brooklyn/brooklyn-library-catalog/0.12.0-SNAPSHOT/brooklyn-library-catalog-0.12.0-SNAPSHOT.pom
[JENKINS] Archiving <https://builds.apache.org/job/brooklyn-library-master/ws/software/cm/pom.xml>
to org.apache.brooklyn/brooklyn-software-cm/0.12.0-SNAPSHOT/brooklyn-software-cm-0.12.0-SNAPSHOT.pom
[JENKINS] Archiving <https://builds.apache.org/job/brooklyn-library-master/ws/examples/webapps/hello-world-sql/pom.xml>
to org.apache.brooklyn.example/brooklyn-example-hello-world-sql-webapp/0.12.0-SNAPSHOT/brooklyn-example-hello-world-sql-webapp-0.12.0-SNAPSHOT.pom
[JENKINS] Archiving <https://builds.apache.org/job/brooklyn-library-master/ws/examples/simple-messaging-pubsub/pom.xml>
to org.apache.brooklyn.example/brooklyn-example-simple-messaging-pubsub/0.12.0-SNAPSHOT/brooklyn-example-simple-messaging-pubsub-0.12.0-SNAPSHOT.pom
[JENKINS] Archiving <https://builds.apache.org/job/brooklyn-library-master/ws/software/network/pom.xml>
to org.apache.brooklyn/brooklyn-software-network/0.12.0-SNAPSHOT/brooklyn-software-network-0.12.0-SNAPSHOT.pom
[JENKINS] Archiving <https://builds.apache.org/job/brooklyn-library-master/ws/software/network/target/brooklyn-software-network-0.12.0-SNAPSHOT.jar>
to org.apache.brooklyn/brooklyn-software-network/0.12.0-SNAPSHOT/brooklyn-software-network-0.12.0-SNAPSHOT.jar
[JENKINS] Archiving <https://builds.apache.org/job/brooklyn-library-master/ws/software/network/target/brooklyn-software-network-0.12.0-SNAPSHOT-tests.jar>
to org.apache.brooklyn/brooklyn-software-network/0.12.0-SNAPSHOT/brooklyn-software-network-0.12.0-SNAPSHOT-tests.jar
[JENKINS] Archiving <https://builds.apache.org/job/brooklyn-library-master/ws/software/network/target/brooklyn-software-network-0.12.0-SNAPSHOT-sources.jar>
to org.apache.brooklyn/brooklyn-software-network/0.12.0-SNAPSHOT/brooklyn-software-network-0.12.0-SNAPSHOT-sources.jar
[JENKINS] Archiving <https://builds.apache.org/job/brooklyn-library-master/ws/software/network/target/brooklyn-software-network-0.12.0-SNAPSHOT-test-sources.jar>
to org.apache.brooklyn/brooklyn-software-network/0.12.0-SNAPSHOT/brooklyn-software-network-0.12.0-SNAPSHOT-test-sources.jar
[JENKINS] Archiving <https://builds.apache.org/job/brooklyn-library-master/ws/software/webapp/pom.xml>
to org.apache.brooklyn/brooklyn-software-webapp/0.12.0-SNAPSHOT/brooklyn-software-webapp-0.12.0-SNAPSHOT.pom
[JENKINS] Archiving <https://builds.apache.org/job/brooklyn-library-master/ws/software/nosql/pom.xml>
to org.apache.brooklyn/brooklyn-software-nosql/0.12.0-SNAPSHOT/brooklyn-software-nosql-0.12.0-SNAPSHOT.pom
[JENKINS] Archiving <https://builds.apache.org/job/brooklyn-library-master/ws/karaf/features/pom.xml>
to org.apache.brooklyn/brooklyn-library-features/0.12.0-SNAPSHOT/brooklyn-library-features-0.12.0-SNAPSHOT.pom
[JENKINS] Archiving <https://builds.apache.org/job/brooklyn-library-master/ws/karaf/pom.xml>
to org.apache.brooklyn/brooklyn-library-karaf/0.12.0-SNAPSHOT/brooklyn-library-karaf-0.12.0-SNAPSHOT.pom
[JENKINS] Archiving <https://builds.apache.org/job/brooklyn-library-master/ws/examples/simple-nosql-cluster/pom.xml>
to org.apache.brooklyn.example/brooklyn-example-simple-nosql-cluster/0.12.0-SNAPSHOT/brooklyn-example-simple-nosql-cluster-0.12.0-SNAPSHOT.pom
[JENKINS] Archiving <https://builds.apache.org/job/brooklyn-library-master/ws/examples/webapps/pom.xml>
to org.apache.brooklyn.example/brooklyn-examples-webapps-parent/0.12.0-SNAPSHOT/brooklyn-examples-webapps-parent-0.12.0-SNAPSHOT.pom
[JENKINS] Archiving <https://builds.apache.org/job/brooklyn-library-master/ws/examples/simple-web-cluster/pom.xml>
to org.apache.brooklyn.example/brooklyn-example-simple-web-cluster/0.12.0-SNAPSHOT/brooklyn-example-simple-web-cluster-0.12.0-SNAPSHOT.pom
[JENKINS] Archiving <https://builds.apache.org/job/brooklyn-library-master/ws/examples/pom.xml>
to org.apache.brooklyn.example/brooklyn-examples-parent/0.12.0-SNAPSHOT/brooklyn-examples-parent-0.12.0-SNAPSHOT.pom
channel stopped

Mime
View raw message