brooklyn-dev mailing list archives

Site index · List index
Message view « Date » · « Thread »
Top « Date » · « Thread »
From Apache Jenkins Server <jenk...@builds.apache.org>
Subject Build failed in Jenkins: brooklyn-server-master #541
Date Fri, 21 Apr 2017 23:17:02 GMT
See <https://builds.apache.org/job/brooklyn-server-master/541/display/redirect?page=changes>

Changes:

[geoff.macartney] Osgi loader change

[geoff.macartney] Add nested catalog item ids to AbstractBrooklynObjectSpec.

[geoff.macartney] Add catalog item super id support.

[geoff.macartney] Fixes to get CatalogYamlEntityTest.testCatalogItemIdInReferencedItems

[geoff.macartney] Test with a 'catalog sandwich'.

[geoff.macartney] Do resource lookup from nested catalog ids.

[geoff.macartney] Use entity classloader as well as specified libraries.

[geoff.macartney] Implement getCatalogItemSuperIds in CatalogItemDtoAbstract.

[geoff.macartney] Add (disabled) rebind test for deep catalog item nesting.

[geoff.macartney] Add support for catalogItemSuperIds to rebind.

[geoff.macartney] Fix ActivePartialRebindVersionTest breakage from previous change.

[geoff.macartney] Fix testRebindWithCatalogAndApp with mode == DELETE_CATALOG.

[geoff.macartney] Fix testRebindWithCatalogAndApp with mode ==

[geoff.macartney] Add (some) tests of rebind of previously persisted state.

[geoff.macartney] Some code tidy-up.

[geoff.macartney] Warning on primaries not needed.

[geoff.macartney] catalogItemIdIfNotNull is no longer used

[geoff.macartney] Add start of a test framework test for the catalog behaviour.

[geoff.macartney] Fix mistake in merge with master

[geoff.macartney] Fix tests after rebase with master

[geoff.macartney] Updates for the following review comments.

[geoff.macartney] Updates for the following review comments.

[geoff.macartney] Fall through only if loader fails with the available catalog items.

[geoff.macartney] Address the following review comments.

[geoff.macartney] Review comment. Remove confusing default value.

[geoff.macartney] Delete original change from 0ab9b37b55fce9eaf3eef319ea2fc77e41e7ba8e

[geoff.macartney] Use newClassLoadingContextForCatalogItems where possible.

[geoff.macartney] Return a generic context from newClassLoadingContextForCatalogItems

[geoff.macartney] Changes to move to catalogItemId + search path.

[geoff.macartney] Correct testRebindWithCatalogAndAppRebindCatalogItemIds

[geoff.macartney] XPathHelper.getStringList fix and formatting, hashcode/equals fixes.

[geoff.macartney] Add searchPath to Entities.dumpInfo.

[geoff.macartney] Set searchPath in JavaCatalogToSpecTransformer.

[geoff.macartney] Update comments on catalogItemId().

[geoff.macartney] Do setCatalogItemIdAndSearchPath instead of just set search path.

[alex.heneveld] minor cleanups following #338

------------------------------------------
[...truncated 5.95 MB...]
2017-04-21 23:15:30,630 INFO  TESTNG INVOKING: "Surefire test" - org.apache.brooklyn.camp.brooklyn.ReferencedOsgiYamlTest.testCatalogReferenceByExplicitUrl()
2017-04-21 23:15:30,631 INFO  TESTNG SKIPPED: "Surefire test" - org.apache.brooklyn.camp.brooklyn.ReferencedOsgiYamlTest.testCatalogReferenceByExplicitUrl()
finished in 0 ms
java.lang.OutOfMemoryError: GC overhead limit exceeded
2017-04-21 23:15:30,631 INFO  TESTNG INVOKING CONFIGURATION: "Surefire test" - @AfterMethod
org.apache.brooklyn.camp.brooklyn.AbstractYamlTest.tearDown()
2017-04-21 23:15:30,631 INFO  TESTNG PASSED CONFIGURATION: "Surefire test" - @AfterMethod
org.apache.brooklyn.camp.brooklyn.AbstractYamlTest.tearDown() finished in 0 ms
2017-04-21 23:15:30,631 INFO  TESTNG INVOKING CONFIGURATION: "Surefire test" - @BeforeMethod
org.apache.brooklyn.camp.brooklyn.AbstractYamlTest.setUp()
[Full GC (Ergonomics)  662584K->661764K(725504K), 0.3523567 secs]
[Full GC (Ergonomics)  662602K->662016K(725504K), 0.3470812 secs]
[Full GC (Ergonomics)  662597K->661825K(725504K), 0.3490320 secs]
[Full GC (Ergonomics)  662568K->661822K(725504K), 0.3518827 secs]
[Full GC (Ergonomics)  662607K->661876K(725504K), 0.3409722 secs]
2017-04-21 23:15:32,389 INFO  TESTNG FAILED CONFIGURATION: "Surefire test" - @BeforeMethod
org.apache.brooklyn.camp.brooklyn.AbstractYamlTest.setUp() finished in 0 ms
java.lang.OutOfMemoryError: GC overhead limit exceeded
2017-04-21 23:15:32,390 INFO  TESTNG INVOKING: "Surefire test" - org.apache.brooklyn.camp.brooklyn.ReferencedOsgiYamlTest.testCatalogReferenceByMultipleUrls()
2017-04-21 23:15:32,390 INFO  TESTNG SKIPPED: "Surefire test" - org.apache.brooklyn.camp.brooklyn.ReferencedOsgiYamlTest.testCatalogReferenceByMultipleUrls()
finished in 0 ms
java.lang.OutOfMemoryError: GC overhead limit exceeded
2017-04-21 23:15:32,391 INFO  TESTNG INVOKING CONFIGURATION: "Surefire test" - @AfterMethod
org.apache.brooklyn.camp.brooklyn.AbstractYamlTest.tearDown()
2017-04-21 23:15:32,391 INFO  TESTNG PASSED CONFIGURATION: "Surefire test" - @AfterMethod
org.apache.brooklyn.camp.brooklyn.AbstractYamlTest.tearDown() finished in 1 ms
2017-04-21 23:15:32,391 INFO  TESTNG INVOKING CONFIGURATION: "Surefire test" - @BeforeMethod
org.apache.brooklyn.camp.brooklyn.AbstractYamlTest.setUp()
[Full GC (Ergonomics)  662595K->661757K(725504K), 0.3525599 secs]
[Full GC (Ergonomics)  662594K->662009K(725504K), 0.3509147 secs]
[Full GC (Ergonomics)  662590K->661820K(725504K), 0.3646843 secs]
[Full GC (Ergonomics)  662564K->661823K(725504K), 0.3612240 secs]
[Full GC (Ergonomics)  662607K->661876K(725504K), 0.3599058 secs]
2017-04-21 23:15:34,198 INFO  TESTNG FAILED CONFIGURATION: "Surefire test" - @BeforeMethod
org.apache.brooklyn.camp.brooklyn.AbstractYamlTest.setUp() finished in 0 ms
java.lang.OutOfMemoryError: GC overhead limit exceeded
2017-04-21 23:15:34,199 INFO  TESTNG INVOKING: "Surefire test" - org.apache.brooklyn.camp.brooklyn.ReferencedOsgiYamlTest.testCatalogReferenceByMultipleUrlsSimplerSyntax()
2017-04-21 23:15:34,200 INFO  TESTNG SKIPPED: "Surefire test" - org.apache.brooklyn.camp.brooklyn.ReferencedOsgiYamlTest.testCatalogReferenceByMultipleUrlsSimplerSyntax()
finished in 0 ms
java.lang.OutOfMemoryError: GC overhead limit exceeded
2017-04-21 23:15:34,200 INFO  TESTNG INVOKING CONFIGURATION: "Surefire test" - @AfterMethod
org.apache.brooklyn.camp.brooklyn.AbstractYamlTest.tearDown()
2017-04-21 23:15:34,200 INFO  TESTNG PASSED CONFIGURATION: "Surefire test" - @AfterMethod
org.apache.brooklyn.camp.brooklyn.AbstractYamlTest.tearDown() finished in 0 ms
2017-04-21 23:15:34,200 INFO  TESTNG INVOKING CONFIGURATION: "Surefire test" - @BeforeMethod
org.apache.brooklyn.camp.brooklyn.AbstractYamlTest.setUp()
[Full GC (Ergonomics)  662605K->661664K(725504K), 0.3664611 secs]
[Full GC (Ergonomics)  662552K->661908K(725504K), 0.3667438 secs]
[Full GC (Ergonomics)  662577K->661753K(725504K), 0.3621327 secs]
[Full GC (Ergonomics)  662562K->661820K(725504K), 0.3646680 secs]
[Full GC (Ergonomics)  662607K->661874K(725504K), 0.3515100 secs]
2017-04-21 23:15:36,029 INFO  TESTNG FAILED CONFIGURATION: "Surefire test" - @BeforeMethod
org.apache.brooklyn.camp.brooklyn.AbstractYamlTest.setUp() finished in 0 ms
java.lang.OutOfMemoryError: GC overhead limit exceeded
2017-04-21 23:15:36,030 INFO  TESTNG INVOKING: "Surefire test" - org.apache.brooklyn.camp.brooklyn.ReferencedOsgiYamlTest.testCatalogReferenceMixesMetaAndUrl()
2017-04-21 23:15:36,030 INFO  TESTNG SKIPPED: "Surefire test" - org.apache.brooklyn.camp.brooklyn.ReferencedOsgiYamlTest.testCatalogReferenceMixesMetaAndUrl()
finished in 1 ms
java.lang.OutOfMemoryError: GC overhead limit exceeded
2017-04-21 23:15:36,030 INFO  TESTNG INVOKING CONFIGURATION: "Surefire test" - @AfterMethod
org.apache.brooklyn.camp.brooklyn.AbstractYamlTest.tearDown()
2017-04-21 23:15:36,030 INFO  TESTNG PASSED CONFIGURATION: "Surefire test" - @AfterMethod
org.apache.brooklyn.camp.brooklyn.AbstractYamlTest.tearDown() finished in 0 ms
2017-04-21 23:15:36,030 INFO  TESTNG INVOKING CONFIGURATION: "Surefire test" - @BeforeMethod
org.apache.brooklyn.camp.brooklyn.AbstractYamlTest.setUp()
[Full GC (Ergonomics)  662592K->661755K(725504K), 0.3457676 secs]
[Full GC (Ergonomics)  662579K->662007K(725504K), 0.3554786 secs]
[Full GC (Ergonomics)  662606K->661786K(725504K), 0.3620692 secs]
[Full GC (Ergonomics)  662594K->661854K(725504K), 0.3436436 secs]
[Full GC (Ergonomics)  662607K->661906K(725504K), 0.3548597 secs]
2017-04-21 23:15:37,811 INFO  TESTNG FAILED CONFIGURATION: "Surefire test" - @BeforeMethod
org.apache.brooklyn.camp.brooklyn.AbstractYamlTest.setUp() finished in 0 ms
java.lang.OutOfMemoryError: GC overhead limit exceeded
2017-04-21 23:15:37,812 INFO  TESTNG INVOKING: "Surefire test" - org.apache.brooklyn.camp.brooklyn.ReferencedOsgiYamlTest.testCatalogReferenceSeesPreviousItems()
2017-04-21 23:15:37,812 INFO  TESTNG SKIPPED: "Surefire test" - org.apache.brooklyn.camp.brooklyn.ReferencedOsgiYamlTest.testCatalogReferenceSeesPreviousItems()
finished in 0 ms
java.lang.OutOfMemoryError: GC overhead limit exceeded
2017-04-21 23:15:37,812 INFO  TESTNG INVOKING CONFIGURATION: "Surefire test" - @AfterMethod
org.apache.brooklyn.camp.brooklyn.AbstractYamlTest.tearDown()
2017-04-21 23:15:37,813 INFO  TESTNG PASSED CONFIGURATION: "Surefire test" - @AfterMethod
org.apache.brooklyn.camp.brooklyn.AbstractYamlTest.tearDown() finished in 1 ms
2017-04-21 23:15:37,813 INFO  TESTNG INVOKING CONFIGURATION: "Surefire test" - @BeforeMethod
org.apache.brooklyn.camp.brooklyn.AbstractYamlTest.setUp()
[Full GC (Ergonomics)  662607K->661759K(725504K), 1.0750332 secs]
[Full GC (Ergonomics)  662574K->661987K(725504K), 0.3540492 secs]
[Full GC (Ergonomics)  662528K->661735K(725504K), 0.3560332 secs]
[Full GC (Ergonomics)  662575K->661866K(725504K), 0.3509182 secs]
[Full GC (Ergonomics)  662583K->661827K(725504K), 0.3505863 secs]
2017-04-21 23:15:40,317 INFO  TESTNG FAILED CONFIGURATION: "Surefire test" - @BeforeMethod
org.apache.brooklyn.camp.brooklyn.AbstractYamlTest.setUp() finished in 0 ms
java.lang.OutOfMemoryError: GC overhead limit exceeded
2017-04-21 23:15:40,317 INFO  TESTNG INVOKING: "Surefire test" - org.apache.brooklyn.camp.brooklyn.ReferencedOsgiYamlTest.testCatalogReferencingYamlUrlFromOsgiBundle()
2017-04-21 23:15:40,318 INFO  TESTNG SKIPPED: "Surefire test" - org.apache.brooklyn.camp.brooklyn.ReferencedOsgiYamlTest.testCatalogReferencingYamlUrlFromOsgiBundle()
finished in 1 ms
java.lang.OutOfMemoryError: GC overhead limit exceeded
2017-04-21 23:15:40,318 INFO  TESTNG INVOKING CONFIGURATION: "Surefire test" - @AfterMethod
org.apache.brooklyn.camp.brooklyn.AbstractYamlTest.tearDown()
2017-04-21 23:15:40,318 INFO  TESTNG PASSED CONFIGURATION: "Surefire test" - @AfterMethod
org.apache.brooklyn.camp.brooklyn.AbstractYamlTest.tearDown() finished in 0 ms
[Full GC (Ergonomics)  662583K->661639K(725504K), 1.4911616 secs]
[Full GC (Ergonomics)  662571K->661608K(725504K), 0.3451809 secs]
[Full GC (Ergonomics)  662566K->661634K(725504K), 0.3509660 secs]
[Full GC (Ergonomics)  662563K->661602K(725504K), 0.3498494 secs]
[Full GC (Ergonomics)  662571K->661644K(725504K), 0.6522369 secs]
[Full GC (Ergonomics)  662571K->661600K(725504K), 1.5133441 secs]
[Full GC (Ergonomics)  662556K->661545K(725504K), 1.7135446 secs]

Results :

Tests run: 0, Failures: 0, Errors: 0, Skipped: 0

[JENKINS] Recording test results
[INFO] ------------------------------------------------------------------------
[INFO] Reactor Summary:
[INFO] 
[INFO] Brooklyn Server Root ............................... SUCCESS [  1.685 s]
[INFO] Brooklyn Parent Project ............................ SUCCESS [  4.068 s]
[INFO] Brooklyn Test Support Utilities .................... SUCCESS [  5.960 s]
[INFO] Brooklyn Logback Includable Configuration .......... SUCCESS [  1.713 s]
[INFO] Brooklyn Common Utilities .......................... SUCCESS [ 29.189 s]
[INFO] Brooklyn API ....................................... SUCCESS [  3.190 s]
[INFO] CAMP Server Parent Project ......................... SUCCESS [  1.248 s]
[INFO] CAMP Base .......................................... SUCCESS [  4.039 s]
[INFO] Brooklyn Test Support .............................. SUCCESS [  2.389 s]
[INFO] Brooklyn REST Swagger Apidoc Utilities ............. SUCCESS [  2.835 s]
[INFO] Brooklyn Logback Configuration ..................... SUCCESS [  1.345 s]
[INFO] CAMP Server ........................................ SUCCESS [  8.987 s]
[INFO] Brooklyn Felix Runtime ............................. SUCCESS [  5.073 s]
[INFO] Brooklyn Groovy Utilities .......................... SUCCESS [  3.986 s]
[INFO] Brooklyn Core ...................................... SUCCESS [04:19 min]
[INFO] Brooklyn Policies .................................. SUCCESS [ 59.886 s]
[INFO] Brooklyn WinRM Software Entities ................... SUCCESS [  8.613 s]
[INFO] Brooklyn Secure JMXMP Agent ........................ SUCCESS [ 10.217 s]
[INFO] Brooklyn JMX RMI Agent ............................. SUCCESS [  2.285 s]
[INFO] Brooklyn Jclouds Location Targets .................. SUCCESS [ 45.100 s]
[INFO] Brooklyn Software Base ............................. SUCCESS [01:35 min]
[INFO] Brooklyn CAMP ...................................... FAILURE [09:45 min]
[INFO] Brooklyn Hazelcast Storage ......................... SKIPPED
[INFO] Brooklyn Launcher Common ........................... SKIPPED
[INFO] Brooklyn REST API .................................. SKIPPED
[INFO] Brooklyn REST Resources ............................ SKIPPED
[INFO] Brooklyn REST Server ............................... SKIPPED
[INFO] Brooklyn Launcher .................................. SKIPPED
[INFO] Brooklyn Command Line Interface .................... SKIPPED
[INFO] Brooklyn Test Framework ............................ SKIPPED
[INFO] Brooklyn OSGi init ................................. SKIPPED
[INFO] Brooklyn Karaf ..................................... SKIPPED
[INFO] Jetty config fragment .............................. SKIPPED
[INFO] Apache Http Component extension .................... SKIPPED
[INFO] Brooklyn Karaf Features ............................ SKIPPED
[INFO] Brooklyn Karaf Shell Commands ...................... SKIPPED
[INFO] Brooklyn Karaf Tests ............................... SKIPPED
[INFO] ------------------------------------------------------------------------
[INFO] BUILD FAILURE
[INFO] ------------------------------------------------------------------------
[INFO] Total time: 19:35 min
[INFO] Finished at: 2017-04-21T23:15:59+00:00
[INFO] Final Memory: 94M/808M
[INFO] ------------------------------------------------------------------------
Waiting for Jenkins to finish collecting data
[ERROR] Failed to execute goal org.apache.maven.plugins:maven-surefire-plugin:2.19.1:test
(default-test) on project brooklyn-camp: Execution default-test of goal org.apache.maven.plugins:maven-surefire-plugin:2.19.1:test
failed: There was an error in the forked process
[ERROR] java.lang.OutOfMemoryError: GC overhead limit exceeded
[ERROR] -> [Help 1]
[ERROR] 
[ERROR] To see the full stack trace of the errors, re-run Maven with the -e switch.
[ERROR] Re-run Maven using the -X switch to enable full debug logging.
[ERROR] 
[ERROR] For more information about the errors and possible solutions, please read the following
articles:
[ERROR] [Help 1] http://cwiki.apache.org/confluence/display/MAVEN/PluginExecutionException
[ERROR] 
[ERROR] After correcting the problems, you can resume the build with the command
[ERROR]   mvn <goals> -rf :brooklyn-camp
[JENKINS] Archiving <https://builds.apache.org/job/brooklyn-server-master/ws/camp/pom.xml>
to org.apache.brooklyn.camp/camp-parent/0.12.0-SNAPSHOT/camp-parent-0.12.0-SNAPSHOT.pom
[JENKINS] Archiving <https://builds.apache.org/job/brooklyn-server-master/ws/utils/rt-felix/pom.xml>
to org.apache.brooklyn/brooklyn-rt-felix/0.12.0-SNAPSHOT/brooklyn-rt-felix-0.12.0-SNAPSHOT.pom
[JENKINS] Archiving <https://builds.apache.org/job/brooklyn-server-master/ws/utils/rt-felix/target/brooklyn-rt-felix-0.12.0-SNAPSHOT.jar>
to org.apache.brooklyn/brooklyn-rt-felix/0.12.0-SNAPSHOT/brooklyn-rt-felix-0.12.0-SNAPSHOT.jar
[JENKINS] Archiving <https://builds.apache.org/job/brooklyn-server-master/ws/utils/rt-felix/target/brooklyn-rt-felix-0.12.0-SNAPSHOT-tests.jar>
to org.apache.brooklyn/brooklyn-rt-felix/0.12.0-SNAPSHOT/brooklyn-rt-felix-0.12.0-SNAPSHOT-tests.jar
[JENKINS] Archiving <https://builds.apache.org/job/brooklyn-server-master/ws/utils/rt-felix/target/brooklyn-rt-felix-0.12.0-SNAPSHOT-sources.jar>
to org.apache.brooklyn/brooklyn-rt-felix/0.12.0-SNAPSHOT/brooklyn-rt-felix-0.12.0-SNAPSHOT-sources.jar
[JENKINS] Archiving <https://builds.apache.org/job/brooklyn-server-master/ws/utils/rt-felix/target/brooklyn-rt-felix-0.12.0-SNAPSHOT-test-sources.jar>
to org.apache.brooklyn/brooklyn-rt-felix/0.12.0-SNAPSHOT/brooklyn-rt-felix-0.12.0-SNAPSHOT-test-sources.jar
[JENKINS] Archiving <https://builds.apache.org/job/brooklyn-server-master/ws/test-framework/pom.xml>
to org.apache.brooklyn/brooklyn-test-framework/0.12.0-SNAPSHOT/brooklyn-test-framework-0.12.0-SNAPSHOT.pom
[JENKINS] Archiving <https://builds.apache.org/job/brooklyn-server-master/ws/core/pom.xml>
to org.apache.brooklyn/brooklyn-core/0.12.0-SNAPSHOT/brooklyn-core-0.12.0-SNAPSHOT.pom
[JENKINS] Archiving <https://builds.apache.org/job/brooklyn-server-master/ws/core/target/brooklyn-core-0.12.0-SNAPSHOT.jar>
to org.apache.brooklyn/brooklyn-core/0.12.0-SNAPSHOT/brooklyn-core-0.12.0-SNAPSHOT.jar
[JENKINS] Archiving <https://builds.apache.org/job/brooklyn-server-master/ws/core/target/brooklyn-core-0.12.0-SNAPSHOT-tests.jar>
to org.apache.brooklyn/brooklyn-core/0.12.0-SNAPSHOT/brooklyn-core-0.12.0-SNAPSHOT-tests.jar
[JENKINS] Archiving <https://builds.apache.org/job/brooklyn-server-master/ws/core/target/brooklyn-core-0.12.0-SNAPSHOT-sources.jar>
to org.apache.brooklyn/brooklyn-core/0.12.0-SNAPSHOT/brooklyn-core-0.12.0-SNAPSHOT-sources.jar
[JENKINS] Archiving <https://builds.apache.org/job/brooklyn-server-master/ws/core/target/brooklyn-core-0.12.0-SNAPSHOT-test-sources.jar>
to org.apache.brooklyn/brooklyn-core/0.12.0-SNAPSHOT/brooklyn-core-0.12.0-SNAPSHOT-test-sources.jar
[JENKINS] Archiving <https://builds.apache.org/job/brooklyn-server-master/ws/camp/camp-server/pom.xml>
to org.apache.brooklyn.camp/camp-server/0.12.0-SNAPSHOT/camp-server-0.12.0-SNAPSHOT.pom
[JENKINS] Archiving <https://builds.apache.org/job/brooklyn-server-master/ws/camp/camp-server/target/camp-server-0.12.0-SNAPSHOT.jar>
to org.apache.brooklyn.camp/camp-server/0.12.0-SNAPSHOT/camp-server-0.12.0-SNAPSHOT.jar
[JENKINS] Archiving <https://builds.apache.org/job/brooklyn-server-master/ws/camp/camp-server/target/camp-server-0.12.0-SNAPSHOT-tests.jar>
to org.apache.brooklyn.camp/camp-server/0.12.0-SNAPSHOT/camp-server-0.12.0-SNAPSHOT-tests.jar
[JENKINS] Archiving <https://builds.apache.org/job/brooklyn-server-master/ws/camp/camp-server/target/camp-server-0.12.0-SNAPSHOT-sources.jar>
to org.apache.brooklyn.camp/camp-server/0.12.0-SNAPSHOT/camp-server-0.12.0-SNAPSHOT-sources.jar
[JENKINS] Archiving <https://builds.apache.org/job/brooklyn-server-master/ws/camp/camp-server/target/camp-server-0.12.0-SNAPSHOT-test-sources.jar>
to org.apache.brooklyn.camp/camp-server/0.12.0-SNAPSHOT/camp-server-0.12.0-SNAPSHOT-test-sources.jar
[JENKINS] Archiving <https://builds.apache.org/job/brooklyn-server-master/ws/launcher/pom.xml>
to org.apache.brooklyn/brooklyn-launcher/0.12.0-SNAPSHOT/brooklyn-launcher-0.12.0-SNAPSHOT.pom
[JENKINS] Archiving <https://builds.apache.org/job/brooklyn-server-master/ws/karaf/pom.xml>
to org.apache.brooklyn/brooklyn-karaf/0.12.0-SNAPSHOT/brooklyn-karaf-0.12.0-SNAPSHOT.pom
[JENKINS] Archiving <https://builds.apache.org/job/brooklyn-server-master/ws/karaf/httpcomponent-extension/pom.xml>
to org.apache.brooklyn/brooklyn-karaf-httpcomponents-extension/0.12.0-SNAPSHOT/brooklyn-karaf-httpcomponents-extension-0.12.0-SNAPSHOT.pom
[JENKINS] Archiving <https://builds.apache.org/job/brooklyn-server-master/ws/utils/test-support/pom.xml>
to org.apache.brooklyn/brooklyn-utils-test-support/0.12.0-SNAPSHOT/brooklyn-utils-test-support-0.12.0-SNAPSHOT.pom
[JENKINS] Archiving <https://builds.apache.org/job/brooklyn-server-master/ws/utils/test-support/target/brooklyn-utils-test-support-0.12.0-SNAPSHOT.jar>
to org.apache.brooklyn/brooklyn-utils-test-support/0.12.0-SNAPSHOT/brooklyn-utils-test-support-0.12.0-SNAPSHOT.jar
[JENKINS] Archiving <https://builds.apache.org/job/brooklyn-server-master/ws/utils/test-support/target/brooklyn-utils-test-support-0.12.0-SNAPSHOT-sources.jar>
to org.apache.brooklyn/brooklyn-utils-test-support/0.12.0-SNAPSHOT/brooklyn-utils-test-support-0.12.0-SNAPSHOT-sources.jar
[JENKINS] Archiving <https://builds.apache.org/job/brooklyn-server-master/ws/utils/test-support/target/brooklyn-utils-test-support-0.12.0-SNAPSHOT-test-sources.jar>
to org.apache.brooklyn/brooklyn-utils-test-support/0.12.0-SNAPSHOT/brooklyn-utils-test-support-0.12.0-SNAPSHOT-test-sources.jar
[JENKINS] Archiving <https://builds.apache.org/job/brooklyn-server-master/ws/software/base/pom.xml>
to org.apache.brooklyn/brooklyn-software-base/0.12.0-SNAPSHOT/brooklyn-software-base-0.12.0-SNAPSHOT.pom
[JENKINS] Archiving <https://builds.apache.org/job/brooklyn-server-master/ws/software/base/target/brooklyn-software-base-0.12.0-SNAPSHOT.jar>
to org.apache.brooklyn/brooklyn-software-base/0.12.0-SNAPSHOT/brooklyn-software-base-0.12.0-SNAPSHOT.jar
[JENKINS] Archiving <https://builds.apache.org/job/brooklyn-server-master/ws/software/base/target/brooklyn-software-base-0.12.0-SNAPSHOT-tests.jar>
to org.apache.brooklyn/brooklyn-software-base/0.12.0-SNAPSHOT/brooklyn-software-base-0.12.0-SNAPSHOT-tests.jar
[JENKINS] Archiving <https://builds.apache.org/job/brooklyn-server-master/ws/software/base/target/brooklyn-software-base-0.12.0-SNAPSHOT-sources.jar>
to org.apache.brooklyn/brooklyn-software-base/0.12.0-SNAPSHOT/brooklyn-software-base-0.12.0-SNAPSHOT-sources.jar
[JENKINS] Archiving <https://builds.apache.org/job/brooklyn-server-master/ws/software/base/target/brooklyn-software-base-0.12.0-SNAPSHOT-test-sources.jar>
to org.apache.brooklyn/brooklyn-software-base/0.12.0-SNAPSHOT/brooklyn-software-base-0.12.0-SNAPSHOT-test-sources.jar
[JENKINS] Archiving <https://builds.apache.org/job/brooklyn-server-master/ws/utils/groovy/pom.xml>
to org.apache.brooklyn/brooklyn-utils-groovy/0.12.0-SNAPSHOT/brooklyn-utils-groovy-0.12.0-SNAPSHOT.pom
[JENKINS] Archiving <https://builds.apache.org/job/brooklyn-server-master/ws/utils/groovy/target/brooklyn-utils-groovy-0.12.0-SNAPSHOT.jar>
to org.apache.brooklyn/brooklyn-utils-groovy/0.12.0-SNAPSHOT/brooklyn-utils-groovy-0.12.0-SNAPSHOT.jar
[JENKINS] Archiving <https://builds.apache.org/job/brooklyn-server-master/ws/utils/groovy/target/brooklyn-utils-groovy-0.12.0-SNAPSHOT-tests.jar>
to org.apache.brooklyn/brooklyn-utils-groovy/0.12.0-SNAPSHOT/brooklyn-utils-groovy-0.12.0-SNAPSHOT-tests.jar
[JENKINS] Archiving <https://builds.apache.org/job/brooklyn-server-master/ws/utils/groovy/target/brooklyn-utils-groovy-0.12.0-SNAPSHOT-sources.jar>
to org.apache.brooklyn/brooklyn-utils-groovy/0.12.0-SNAPSHOT/brooklyn-utils-groovy-0.12.0-SNAPSHOT-sources.jar
[JENKINS] Archiving <https://builds.apache.org/job/brooklyn-server-master/ws/utils/groovy/target/brooklyn-utils-groovy-0.12.0-SNAPSHOT-test-sources.jar>
to org.apache.brooklyn/brooklyn-utils-groovy/0.12.0-SNAPSHOT/brooklyn-utils-groovy-0.12.0-SNAPSHOT-test-sources.jar
[JENKINS] Archiving <https://builds.apache.org/job/brooklyn-server-master/ws/utils/rest-swagger/pom.xml>
to org.apache.brooklyn/brooklyn-utils-rest-swagger/0.12.0-SNAPSHOT/brooklyn-utils-rest-swagger-0.12.0-SNAPSHOT.pom
[JENKINS] Archiving <https://builds.apache.org/job/brooklyn-server-master/ws/utils/rest-swagger/target/brooklyn-utils-rest-swagger-0.12.0-SNAPSHOT.jar>
to org.apache.brooklyn/brooklyn-utils-rest-swagger/0.12.0-SNAPSHOT/brooklyn-utils-rest-swagger-0.12.0-SNAPSHOT.jar
[JENKINS] Archiving <https://builds.apache.org/job/brooklyn-server-master/ws/utils/rest-swagger/target/brooklyn-utils-rest-swagger-0.12.0-SNAPSHOT-sources.jar>
to org.apache.brooklyn/brooklyn-utils-rest-swagger/0.12.0-SNAPSHOT/brooklyn-utils-rest-swagger-0.12.0-SNAPSHOT-sources.jar
[JENKINS] Archiving <https://builds.apache.org/job/brooklyn-server-master/ws/utils/rest-swagger/target/brooklyn-utils-rest-swagger-0.12.0-SNAPSHOT-test-sources.jar>
to org.apache.brooklyn/brooklyn-utils-rest-swagger/0.12.0-SNAPSHOT/brooklyn-utils-rest-swagger-0.12.0-SNAPSHOT-test-sources.jar
[JENKINS] Archiving <https://builds.apache.org/job/brooklyn-server-master/ws/launcher-common/pom.xml>
to org.apache.brooklyn/brooklyn-launcher-common/0.12.0-SNAPSHOT/brooklyn-launcher-common-0.12.0-SNAPSHOT.pom
[JENKINS] Archiving <https://builds.apache.org/job/brooklyn-server-master/ws/camp/camp-base/pom.xml>
to org.apache.brooklyn.camp/camp-base/0.12.0-SNAPSHOT/camp-base-0.12.0-SNAPSHOT.pom
[JENKINS] Archiving <https://builds.apache.org/job/brooklyn-server-master/ws/camp/camp-base/target/camp-base-0.12.0-SNAPSHOT.jar>
to org.apache.brooklyn.camp/camp-base/0.12.0-SNAPSHOT/camp-base-0.12.0-SNAPSHOT.jar
[JENKINS] Archiving <https://builds.apache.org/job/brooklyn-server-master/ws/camp/camp-base/target/camp-base-0.12.0-SNAPSHOT-tests.jar>
to org.apache.brooklyn.camp/camp-base/0.12.0-SNAPSHOT/camp-base-0.12.0-SNAPSHOT-tests.jar
[JENKINS] Archiving <https://builds.apache.org/job/brooklyn-server-master/ws/camp/camp-base/target/camp-base-0.12.0-SNAPSHOT-sources.jar>
to org.apache.brooklyn.camp/camp-base/0.12.0-SNAPSHOT/camp-base-0.12.0-SNAPSHOT-sources.jar
[JENKINS] Archiving <https://builds.apache.org/job/brooklyn-server-master/ws/camp/camp-base/target/camp-base-0.12.0-SNAPSHOT-test-sources.jar>
to org.apache.brooklyn.camp/camp-base/0.12.0-SNAPSHOT/camp-base-0.12.0-SNAPSHOT-test-sources.jar
[JENKINS] Archiving <https://builds.apache.org/job/brooklyn-server-master/ws/camp/camp-brooklyn/pom.xml>
to org.apache.brooklyn/brooklyn-camp/0.12.0-SNAPSHOT/brooklyn-camp-0.12.0-SNAPSHOT.pom
[JENKINS] Archiving <https://builds.apache.org/job/brooklyn-server-master/ws/karaf/jetty-config/pom.xml>
to org.apache.brooklyn/brooklyn-karaf-jetty-config/0.12.0-SNAPSHOT/brooklyn-karaf-jetty-config-0.12.0-SNAPSHOT.pom
[JENKINS] Archiving <https://builds.apache.org/job/brooklyn-server-master/ws/server-cli/pom.xml>
to org.apache.brooklyn/brooklyn-cli/0.12.0-SNAPSHOT/brooklyn-cli-0.12.0-SNAPSHOT.pom
[JENKINS] Archiving <https://builds.apache.org/job/brooklyn-server-master/ws/logging/logback-xml/pom.xml>
to org.apache.brooklyn/brooklyn-logback-xml/0.12.0-SNAPSHOT/brooklyn-logback-xml-0.12.0-SNAPSHOT.pom
[JENKINS] Archiving <https://builds.apache.org/job/brooklyn-server-master/ws/logging/logback-xml/target/brooklyn-logback-xml-0.12.0-SNAPSHOT.jar>
to org.apache.brooklyn/brooklyn-logback-xml/0.12.0-SNAPSHOT/brooklyn-logback-xml-0.12.0-SNAPSHOT.jar
[JENKINS] Archiving <https://builds.apache.org/job/brooklyn-server-master/ws/logging/logback-xml/target/brooklyn-logback-xml-0.12.0-SNAPSHOT-sources.jar>
to org.apache.brooklyn/brooklyn-logback-xml/0.12.0-SNAPSHOT/brooklyn-logback-xml-0.12.0-SNAPSHOT-sources.jar
[JENKINS] Archiving <https://builds.apache.org/job/brooklyn-server-master/ws/logging/logback-xml/target/brooklyn-logback-xml-0.12.0-SNAPSHOT-test-sources.jar>
to org.apache.brooklyn/brooklyn-logback-xml/0.12.0-SNAPSHOT/brooklyn-logback-xml-0.12.0-SNAPSHOT-test-sources.jar
[JENKINS] Archiving <https://builds.apache.org/job/brooklyn-server-master/ws/karaf/itests/pom.xml>
to org.apache.brooklyn/brooklyn-features-itests/0.12.0-SNAPSHOT/brooklyn-features-itests-0.12.0-SNAPSHOT.pom
[JENKINS] Archiving <https://builds.apache.org/job/brooklyn-server-master/ws/test-support/pom.xml>
to org.apache.brooklyn/brooklyn-test-support/0.12.0-SNAPSHOT/brooklyn-test-support-0.12.0-SNAPSHOT.pom
[JENKINS] Archiving <https://builds.apache.org/job/brooklyn-server-master/ws/test-support/target/brooklyn-test-support-0.12.0-SNAPSHOT.jar>
to org.apache.brooklyn/brooklyn-test-support/0.12.0-SNAPSHOT/brooklyn-test-support-0.12.0-SNAPSHOT.jar
[JENKINS] Archiving <https://builds.apache.org/job/brooklyn-server-master/ws/test-support/target/brooklyn-test-support-0.12.0-SNAPSHOT-sources.jar>
to org.apache.brooklyn/brooklyn-test-support/0.12.0-SNAPSHOT/brooklyn-test-support-0.12.0-SNAPSHOT-sources.jar
[JENKINS] Archiving <https://builds.apache.org/job/brooklyn-server-master/ws/test-support/target/brooklyn-test-support-0.12.0-SNAPSHOT-test-sources.jar>
to org.apache.brooklyn/brooklyn-test-support/0.12.0-SNAPSHOT/brooklyn-test-support-0.12.0-SNAPSHOT-test-sources.jar
[JENKINS] Archiving <https://builds.apache.org/job/brooklyn-server-master/ws/rest/rest-server/pom.xml>
to org.apache.brooklyn/brooklyn-rest-server/0.12.0-SNAPSHOT/brooklyn-rest-server-0.12.0-SNAPSHOT.pom
[JENKINS] Archiving <https://builds.apache.org/job/brooklyn-server-master/ws/api/pom.xml>
to org.apache.brooklyn/brooklyn-api/0.12.0-SNAPSHOT/brooklyn-api-0.12.0-SNAPSHOT.pom
[JENKINS] Archiving <https://builds.apache.org/job/brooklyn-server-master/ws/api/target/brooklyn-api-0.12.0-SNAPSHOT.jar>
to org.apache.brooklyn/brooklyn-api/0.12.0-SNAPSHOT/brooklyn-api-0.12.0-SNAPSHOT.jar
[JENKINS] Archiving <https://builds.apache.org/job/brooklyn-server-master/ws/api/target/brooklyn-api-0.12.0-SNAPSHOT-sources.jar>
to org.apache.brooklyn/brooklyn-api/0.12.0-SNAPSHOT/brooklyn-api-0.12.0-SNAPSHOT-sources.jar
[JENKINS] Archiving <https://builds.apache.org/job/brooklyn-server-master/ws/api/target/brooklyn-api-0.12.0-SNAPSHOT-test-sources.jar>
to org.apache.brooklyn/brooklyn-api/0.12.0-SNAPSHOT/brooklyn-api-0.12.0-SNAPSHOT-test-sources.jar
[JENKINS] Archiving <https://builds.apache.org/job/brooklyn-server-master/ws/pom.xml>
to org.apache.brooklyn/brooklyn-server/0.12.0-SNAPSHOT/brooklyn-server-0.12.0-SNAPSHOT.pom
[JENKINS] Archiving <https://builds.apache.org/job/brooklyn-server-master/ws/locations/jclouds/pom.xml>
to org.apache.brooklyn/brooklyn-locations-jclouds/0.12.0-SNAPSHOT/brooklyn-locations-jclouds-0.12.0-SNAPSHOT.pom
[JENKINS] Archiving <https://builds.apache.org/job/brooklyn-server-master/ws/locations/jclouds/target/brooklyn-locations-jclouds-0.12.0-SNAPSHOT.jar>
to org.apache.brooklyn/brooklyn-locations-jclouds/0.12.0-SNAPSHOT/brooklyn-locations-jclouds-0.12.0-SNAPSHOT.jar
[JENKINS] Archiving <https://builds.apache.org/job/brooklyn-server-master/ws/locations/jclouds/target/brooklyn-locations-jclouds-0.12.0-SNAPSHOT-tests.jar>
to org.apache.brooklyn/brooklyn-locations-jclouds/0.12.0-SNAPSHOT/brooklyn-locations-jclouds-0.12.0-SNAPSHOT-tests.jar
[JENKINS] Archiving <https://builds.apache.org/job/brooklyn-server-master/ws/locations/jclouds/target/brooklyn-locations-jclouds-0.12.0-SNAPSHOT-sources.jar>
to org.apache.brooklyn/brooklyn-locations-jclouds/0.12.0-SNAPSHOT/brooklyn-locations-jclouds-0.12.0-SNAPSHOT-sources.jar
[JENKINS] Archiving <https://builds.apache.org/job/brooklyn-server-master/ws/locations/jclouds/target/brooklyn-locations-jclouds-0.12.0-SNAPSHOT-test-sources.jar>
to org.apache.brooklyn/brooklyn-locations-jclouds/0.12.0-SNAPSHOT/brooklyn-locations-jclouds-0.12.0-SNAPSHOT-test-sources.jar
[JENKINS] Archiving <https://builds.apache.org/job/brooklyn-server-master/ws/utils/common/pom.xml>
to org.apache.brooklyn/brooklyn-utils-common/0.12.0-SNAPSHOT/brooklyn-utils-common-0.12.0-SNAPSHOT.pom
[JENKINS] Archiving <https://builds.apache.org/job/brooklyn-server-master/ws/utils/common/target/brooklyn-utils-common-0.12.0-SNAPSHOT.jar>
to org.apache.brooklyn/brooklyn-utils-common/0.12.0-SNAPSHOT/brooklyn-utils-common-0.12.0-SNAPSHOT.jar
[JENKINS] Archiving <https://builds.apache.org/job/brooklyn-server-master/ws/utils/common/target/brooklyn-utils-common-0.12.0-SNAPSHOT-tests.jar>
to org.apache.brooklyn/brooklyn-utils-common/0.12.0-SNAPSHOT/brooklyn-utils-common-0.12.0-SNAPSHOT-tests.jar
[JENKINS] Archiving <https://builds.apache.org/job/brooklyn-server-master/ws/utils/common/target/brooklyn-utils-common-0.12.0-SNAPSHOT-sources.jar>
to org.apache.brooklyn/brooklyn-utils-common/0.12.0-SNAPSHOT/brooklyn-utils-common-0.12.0-SNAPSHOT-sources.jar
[JENKINS] Archiving <https://builds.apache.org/job/brooklyn-server-master/ws/utils/common/target/brooklyn-utils-common-0.12.0-SNAPSHOT-test-sources.jar>
to org.apache.brooklyn/brooklyn-utils-common/0.12.0-SNAPSHOT/brooklyn-utils-common-0.12.0-SNAPSHOT-test-sources.jar
[JENKINS] Archiving <https://builds.apache.org/job/brooklyn-server-master/ws/karaf/features/pom.xml>
to org.apache.brooklyn/brooklyn-features/0.12.0-SNAPSHOT/brooklyn-features-0.12.0-SNAPSHOT.pom
[JENKINS] Archiving <https://builds.apache.org/job/brooklyn-server-master/ws/rest/rest-api/pom.xml>
to org.apache.brooklyn/brooklyn-rest-api/0.12.0-SNAPSHOT/brooklyn-rest-api-0.12.0-SNAPSHOT.pom
[JENKINS] Archiving <https://builds.apache.org/job/brooklyn-server-master/ws/utils/jmx/jmxrmi-agent/pom.xml>
to org.apache.brooklyn/brooklyn-jmxrmi-agent/0.12.0-SNAPSHOT/brooklyn-jmxrmi-agent-0.12.0-SNAPSHOT.pom
[JENKINS] Archiving <https://builds.apache.org/job/brooklyn-server-master/ws/utils/jmx/jmxrmi-agent/target/brooklyn-jmxrmi-agent-0.12.0-SNAPSHOT.jar>
to org.apache.brooklyn/brooklyn-jmxrmi-agent/0.12.0-SNAPSHOT/brooklyn-jmxrmi-agent-0.12.0-SNAPSHOT.jar
[JENKINS] Archiving <https://builds.apache.org/job/brooklyn-server-master/ws/utils/jmx/jmxrmi-agent/target/brooklyn-jmxrmi-agent-0.12.0-SNAPSHOT-tests.jar>
to org.apache.brooklyn/brooklyn-jmxrmi-agent/0.12.0-SNAPSHOT/brooklyn-jmxrmi-agent-0.12.0-SNAPSHOT-tests.jar
[JENKINS] Archiving <https://builds.apache.org/job/brooklyn-server-master/ws/utils/jmx/jmxrmi-agent/target/brooklyn-jmxrmi-agent-0.12.0-SNAPSHOT-sources.jar>
to org.apache.brooklyn/brooklyn-jmxrmi-agent/0.12.0-SNAPSHOT/brooklyn-jmxrmi-agent-0.12.0-SNAPSHOT-sources.jar
[JENKINS] Archiving <https://builds.apache.org/job/brooklyn-server-master/ws/utils/jmx/jmxrmi-agent/target/brooklyn-jmxrmi-agent-0.12.0-SNAPSHOT-test-sources.jar>
to org.apache.brooklyn/brooklyn-jmxrmi-agent/0.12.0-SNAPSHOT/brooklyn-jmxrmi-agent-0.12.0-SNAPSHOT-test-sources.jar
[JENKINS] Archiving <https://builds.apache.org/job/brooklyn-server-master/ws/policy/pom.xml>
to org.apache.brooklyn/brooklyn-policy/0.12.0-SNAPSHOT/brooklyn-policy-0.12.0-SNAPSHOT.pom
[JENKINS] Archiving <https://builds.apache.org/job/brooklyn-server-master/ws/policy/target/brooklyn-policy-0.12.0-SNAPSHOT.jar>
to org.apache.brooklyn/brooklyn-policy/0.12.0-SNAPSHOT/brooklyn-policy-0.12.0-SNAPSHOT.jar
[JENKINS] Archiving <https://builds.apache.org/job/brooklyn-server-master/ws/policy/target/brooklyn-policy-0.12.0-SNAPSHOT-tests.jar>
to org.apache.brooklyn/brooklyn-policy/0.12.0-SNAPSHOT/brooklyn-policy-0.12.0-SNAPSHOT-tests.jar
[JENKINS] Archiving <https://builds.apache.org/job/brooklyn-server-master/ws/policy/target/brooklyn-policy-0.12.0-SNAPSHOT-sources.jar>
to org.apache.brooklyn/brooklyn-policy/0.12.0-SNAPSHOT/brooklyn-policy-0.12.0-SNAPSHOT-sources.jar
[JENKINS] Archiving <https://builds.apache.org/job/brooklyn-server-master/ws/policy/target/brooklyn-policy-0.12.0-SNAPSHOT-test-sources.jar>
to org.apache.brooklyn/brooklyn-policy/0.12.0-SNAPSHOT/brooklyn-policy-0.12.0-SNAPSHOT-test-sources.jar
[JENKINS] Archiving <https://builds.apache.org/job/brooklyn-server-master/ws/karaf/init/pom.xml>
to org.apache.brooklyn/brooklyn-karaf-init/0.12.0-SNAPSHOT/brooklyn-karaf-init-0.12.0-SNAPSHOT.pom
[JENKINS] Archiving <https://builds.apache.org/job/brooklyn-server-master/ws/karaf/commands/pom.xml>
to org.apache.brooklyn/brooklyn-commands/0.12.0-SNAPSHOT/brooklyn-commands-0.12.0-SNAPSHOT.pom
[JENKINS] Archiving <https://builds.apache.org/job/brooklyn-server-master/ws/storage/hazelcast/pom.xml>
to org.apache.brooklyn/brooklyn-storage-hazelcast/0.12.0-SNAPSHOT/brooklyn-storage-hazelcast-0.12.0-SNAPSHOT.pom
[JENKINS] Archiving <https://builds.apache.org/job/brooklyn-server-master/ws/logging/logback-includes/pom.xml>
to org.apache.brooklyn/brooklyn-logback-includes/0.12.0-SNAPSHOT/brooklyn-logback-includes-0.12.0-SNAPSHOT.pom
[JENKINS] Archiving <https://builds.apache.org/job/brooklyn-server-master/ws/logging/logback-includes/target/brooklyn-logback-includes-0.12.0-SNAPSHOT.jar>
to org.apache.brooklyn/brooklyn-logback-includes/0.12.0-SNAPSHOT/brooklyn-logback-includes-0.12.0-SNAPSHOT.jar
[JENKINS] Archiving <https://builds.apache.org/job/brooklyn-server-master/ws/logging/logback-includes/target/brooklyn-logback-includes-0.12.0-SNAPSHOT-sources.jar>
to org.apache.brooklyn/brooklyn-logback-includes/0.12.0-SNAPSHOT/brooklyn-logback-includes-0.12.0-SNAPSHOT-sources.jar
[JENKINS] Archiving <https://builds.apache.org/job/brooklyn-server-master/ws/logging/logback-includes/target/brooklyn-logback-includes-0.12.0-SNAPSHOT-test-sources.jar>
to org.apache.brooklyn/brooklyn-logback-includes/0.12.0-SNAPSHOT/brooklyn-logback-includes-0.12.0-SNAPSHOT-test-sources.jar
[JENKINS] Archiving <https://builds.apache.org/job/brooklyn-server-master/ws/rest/rest-resources/pom.xml>
to org.apache.brooklyn/brooklyn-rest-resources/0.12.0-SNAPSHOT/brooklyn-rest-resources-0.12.0-SNAPSHOT.pom
[JENKINS] Archiving <https://builds.apache.org/job/brooklyn-server-master/ws/utils/jmx/jmxmp-ssl-agent/pom.xml>
to org.apache.brooklyn/brooklyn-jmxmp-agent/0.12.0-SNAPSHOT/brooklyn-jmxmp-agent-0.12.0-SNAPSHOT.pom
[JENKINS] Archiving <https://builds.apache.org/job/brooklyn-server-master/ws/utils/jmx/jmxmp-ssl-agent/target/brooklyn-jmxmp-agent-0.12.0-SNAPSHOT.jar>
to org.apache.brooklyn/brooklyn-jmxmp-agent/0.12.0-SNAPSHOT/brooklyn-jmxmp-agent-0.12.0-SNAPSHOT.jar
[JENKINS] Archiving <https://builds.apache.org/job/brooklyn-server-master/ws/utils/jmx/jmxmp-ssl-agent/target/brooklyn-jmxmp-agent-0.12.0-SNAPSHOT-tests.jar>
to org.apache.brooklyn/brooklyn-jmxmp-agent/0.12.0-SNAPSHOT/brooklyn-jmxmp-agent-0.12.0-SNAPSHOT-tests.jar
[JENKINS] Archiving <https://builds.apache.org/job/brooklyn-server-master/ws/utils/jmx/jmxmp-ssl-agent/target/brooklyn-jmxmp-agent-shaded-0.12.0-SNAPSHOT.jar>
to org.apache.brooklyn/brooklyn-jmxmp-agent/0.12.0-SNAPSHOT/brooklyn-jmxmp-agent-0.12.0-SNAPSHOT-with-dependencies.jar
[JENKINS] Archiving <https://builds.apache.org/job/brooklyn-server-master/ws/utils/jmx/jmxmp-ssl-agent/target/brooklyn-jmxmp-agent-0.12.0-SNAPSHOT-sources.jar>
to org.apache.brooklyn/brooklyn-jmxmp-agent/0.12.0-SNAPSHOT/brooklyn-jmxmp-agent-0.12.0-SNAPSHOT-sources.jar
[JENKINS] Archiving <https://builds.apache.org/job/brooklyn-server-master/ws/utils/jmx/jmxmp-ssl-agent/target/brooklyn-jmxmp-agent-0.12.0-SNAPSHOT-test-sources.jar>
to org.apache.brooklyn/brooklyn-jmxmp-agent/0.12.0-SNAPSHOT/brooklyn-jmxmp-agent-0.12.0-SNAPSHOT-test-sources.jar
[JENKINS] Archiving <https://builds.apache.org/job/brooklyn-server-master/ws/parent/pom.xml>
to org.apache.brooklyn/brooklyn-parent/0.12.0-SNAPSHOT/brooklyn-parent-0.12.0-SNAPSHOT.pom
Compressed 80.35 KB of artifacts by 79.7% relative to #540
[JENKINS] Archiving <https://builds.apache.org/job/brooklyn-server-master/ws/software/winrm/pom.xml>
to org.apache.brooklyn/brooklyn-software-winrm/0.12.0-SNAPSHOT/brooklyn-software-winrm-0.12.0-SNAPSHOT.pom
[JENKINS] Archiving <https://builds.apache.org/job/brooklyn-server-master/ws/software/winrm/target/brooklyn-software-winrm-0.12.0-SNAPSHOT.jar>
to org.apache.brooklyn/brooklyn-software-winrm/0.12.0-SNAPSHOT/brooklyn-software-winrm-0.12.0-SNAPSHOT.jar
[JENKINS] Archiving <https://builds.apache.org/job/brooklyn-server-master/ws/software/winrm/target/brooklyn-software-winrm-0.12.0-SNAPSHOT-tests.jar>
to org.apache.brooklyn/brooklyn-software-winrm/0.12.0-SNAPSHOT/brooklyn-software-winrm-0.12.0-SNAPSHOT-tests.jar
[JENKINS] Archiving <https://builds.apache.org/job/brooklyn-server-master/ws/software/winrm/target/brooklyn-software-winrm-0.12.0-SNAPSHOT-sources.jar>
to org.apache.brooklyn/brooklyn-software-winrm/0.12.0-SNAPSHOT/brooklyn-software-winrm-0.12.0-SNAPSHOT-sources.jar
[JENKINS] Archiving <https://builds.apache.org/job/brooklyn-server-master/ws/software/winrm/target/brooklyn-software-winrm-0.12.0-SNAPSHOT-test-sources.jar>
to org.apache.brooklyn/brooklyn-software-winrm/0.12.0-SNAPSHOT/brooklyn-software-winrm-0.12.0-SNAPSHOT-test-sources.jar
channel stopped

Mime
View raw message