brooklyn-dev mailing list archives

Site index · List index
Message view « Date » · « Thread »
Top « Date » · « Thread »
From Apache Jenkins Server <jenk...@builds.apache.org>
Subject Build failed in Jenkins: brooklyn-server-master #539
Date Thu, 20 Apr 2017 08:43:50 GMT
See <https://builds.apache.org/job/brooklyn-server-master/539/display/redirect?page=changes>

Changes:

[richard] LICENSE updates

------------------------------------------
[...truncated 5.68 MB...]
[GC (Allocation Failure)  639702K->514333K(719872K), 0.0245620 secs]
[GC (Allocation Failure)  643357K->517311K(722432K), 0.0109029 secs]
[GC (Allocation Failure)  649919K->518117K(720896K), 0.0091277 secs]
2017-04-20 08:41:55,998 INFO  TESTNG PASSED CONFIGURATION: "Surefire test" - @BeforeClass
org.apache.brooklyn.camp.brooklyn.catalog.CatalogMakeOsgiBundleTest.setUp() finished in 826
ms
2017-04-20 08:41:55,998 INFO  TESTNG INVOKING: "Surefire test" - org.apache.brooklyn.camp.brooklyn.catalog.CatalogMakeOsgiBundleTest.testCatalogBomFromBundleWithManifest()
2017-04-20 08:41:56,029 WARN  Request for bundle 'org/apache/brooklyn/camp/brooklyn/catalog/osgi/catalog-bundle-1/META-INF/MANIFEST.MF/Manifest-Version'
will be ignored, loading ' 1.0' as no framework available
[GC (Allocation Failure)  650725K->519414K(727552K), 0.0165605 secs]
2017-04-20 08:41:56,128 INFO  Started application BasicApplicationImpl{id=iqjy6j8va0}
2017-04-20 08:41:56,131 INFO  TESTNG FAILED: "Surefire test" - org.apache.brooklyn.camp.brooklyn.catalog.CatalogMakeOsgiBundleTest.testCatalogBomFromBundleWithManifest()
finished in 131 ms
java.lang.AssertionError: attribute=Sensor: a.sensor (java.lang.String); val=null
	at org.apache.brooklyn.test.Asserts.fail(Asserts.java:758)
	at org.apache.brooklyn.test.Asserts.assertTrue(Asserts.java:737)
	at org.apache.brooklyn.core.entity.EntityAsserts.assertAttribute(EntityAsserts.java:103)
	at org.apache.brooklyn.camp.brooklyn.catalog.CatalogMakeOsgiBundleTest.assertBasic1DeploysAndHasSensor(CatalogMakeOsgiBundleTest.java:138)
	at org.apache.brooklyn.camp.brooklyn.catalog.CatalogMakeOsgiBundleTest.testCatalogBomFromBundleWithManifest(CatalogMakeOsgiBundleTest.java:129)
2017-04-20 08:41:56,139 INFO  TESTNG INVOKING CONFIGURATION: "Surefire test" - @AfterMethod
org.apache.brooklyn.camp.brooklyn.catalog.CatalogMakeOsgiBundleTest.cleanUpButKeepMgmt()
2017-04-20 08:41:56,139 INFO  Stopping application BasicApplicationImpl{id=iqjy6j8va0}
2017-04-20 08:41:56,140 INFO  Stopped application BasicApplicationImpl{id=iqjy6j8va0}
2017-04-20 08:41:56,143 INFO  TESTNG PASSED CONFIGURATION: "Surefire test" - @AfterMethod
org.apache.brooklyn.camp.brooklyn.catalog.CatalogMakeOsgiBundleTest.cleanUpButKeepMgmt() finished
in 4 ms
2017-04-20 08:41:56,143 INFO  TESTNG INVOKING CONFIGURATION: "Surefire test" - @AfterMethod
org.apache.brooklyn.camp.brooklyn.catalog.CatalogMakeOsgiBundleTest.clearFeatureEnablement()
2017-04-20 08:41:56,143 INFO  TESTNG PASSED CONFIGURATION: "Surefire test" - @AfterMethod
org.apache.brooklyn.camp.brooklyn.catalog.CatalogMakeOsgiBundleTest.clearFeatureEnablement()
finished in 0 ms
2017-04-20 08:41:56,144 INFO  TESTNG INVOKING: "Surefire test" - org.apache.brooklyn.camp.brooklyn.catalog.CatalogMakeOsgiBundleTest.testCatalogBomFromBundleWithManualManifest()
2017-04-20 08:41:56,151 WARN  Request for bundle 'org/apache/brooklyn/camp/brooklyn/catalog/osgi/catalog-bundle-1/META-INF/MANIFEST.MF/Manifest-Version'
will be ignored, loading ' 1.0' as no framework available
2017-04-20 08:41:56,248 INFO  Started application BasicApplicationImpl{id=ofq2k86st3}
2017-04-20 08:41:56,248 INFO  TESTNG PASSED: "Surefire test" - org.apache.brooklyn.camp.brooklyn.catalog.CatalogMakeOsgiBundleTest.testCatalogBomFromBundleWithManualManifest()
finished in 104 ms
2017-04-20 08:41:56,249 INFO  TESTNG INVOKING CONFIGURATION: "Surefire test" - @AfterMethod
org.apache.brooklyn.camp.brooklyn.catalog.CatalogMakeOsgiBundleTest.cleanUpButKeepMgmt()
2017-04-20 08:41:56,249 INFO  Stopping application BasicApplicationImpl{id=ofq2k86st3}
2017-04-20 08:41:56,254 INFO  Stopped application BasicApplicationImpl{id=ofq2k86st3}
2017-04-20 08:41:56,256 INFO  TESTNG PASSED CONFIGURATION: "Surefire test" - @AfterMethod
org.apache.brooklyn.camp.brooklyn.catalog.CatalogMakeOsgiBundleTest.cleanUpButKeepMgmt() finished
in 7 ms
2017-04-20 08:41:56,256 INFO  TESTNG INVOKING CONFIGURATION: "Surefire test" - @AfterMethod
org.apache.brooklyn.camp.brooklyn.catalog.CatalogMakeOsgiBundleTest.clearFeatureEnablement()
2017-04-20 08:41:56,256 INFO  TESTNG PASSED CONFIGURATION: "Surefire test" - @AfterMethod
org.apache.brooklyn.camp.brooklyn.catalog.CatalogMakeOsgiBundleTest.clearFeatureEnablement()
finished in 0 ms
2017-04-20 08:41:56,256 INFO  TESTNG INVOKING: "Surefire test" - org.apache.brooklyn.camp.brooklyn.catalog.CatalogMakeOsgiBundleTest.testCatalogBomLoadsFileInBundle()
2017-04-20 08:41:56,260 WARN  Request for bundle 'org/apache/brooklyn/camp/brooklyn/catalog/osgi/catalog-bundle-1/META-INF/MANIFEST.MF/Manifest-Version'
will be ignored, loading ' 1.0' as no framework available
2017-04-20 08:41:56,338 INFO  Started application BasicApplicationImpl{id=pch2spak3x}
2017-04-20 08:41:56,343 INFO  TESTNG PASSED: "Surefire test" - org.apache.brooklyn.camp.brooklyn.catalog.CatalogMakeOsgiBundleTest.testCatalogBomLoadsFileInBundle()
finished in 87 ms
2017-04-20 08:41:56,344 INFO  TESTNG INVOKING CONFIGURATION: "Surefire test" - @AfterMethod
org.apache.brooklyn.camp.brooklyn.catalog.CatalogMakeOsgiBundleTest.cleanUpButKeepMgmt()
2017-04-20 08:41:56,344 INFO  Stopping application BasicApplicationImpl{id=pch2spak3x}
2017-04-20 08:41:56,345 INFO  Stopped application BasicApplicationImpl{id=pch2spak3x}
2017-04-20 08:41:56,347 INFO  TESTNG PASSED CONFIGURATION: "Surefire test" - @AfterMethod
org.apache.brooklyn.camp.brooklyn.catalog.CatalogMakeOsgiBundleTest.cleanUpButKeepMgmt() finished
in 3 ms
2017-04-20 08:41:56,347 INFO  TESTNG INVOKING CONFIGURATION: "Surefire test" - @AfterMethod
org.apache.brooklyn.camp.brooklyn.catalog.CatalogMakeOsgiBundleTest.clearFeatureEnablement()
2017-04-20 08:41:56,348 INFO  TESTNG PASSED CONFIGURATION: "Surefire test" - @AfterMethod
org.apache.brooklyn.camp.brooklyn.catalog.CatalogMakeOsgiBundleTest.clearFeatureEnablement()
finished in 1 ms
2017-04-20 08:41:56,348 INFO  TESTNG INVOKING CONFIGURATION: "Surefire test" - @AfterClass
org.apache.brooklyn.camp.brooklyn.catalog.CatalogMakeOsgiBundleTest.tearDown()
2017-04-20 08:41:56,386 INFO  TESTNG PASSED CONFIGURATION: "Surefire test" - @AfterClass org.apache.brooklyn.camp.brooklyn.catalog.CatalogMakeOsgiBundleTest.tearDown()
finished in 38 ms
2017-04-20 08:41:56,387 INFO  TESTNG INVOKING CONFIGURATION: "Surefire test" - @BeforeMethod
org.apache.brooklyn.camp.brooklyn.AbstractYamlTest.setUp()
2017-04-20 08:41:56,388 INFO  TESTNG PASSED CONFIGURATION: "Surefire test" - @BeforeMethod
org.apache.brooklyn.camp.brooklyn.AbstractYamlTest.setUp() finished in 1 ms
2017-04-20 08:41:56,389 INFO  TESTNG INVOKING: "Surefire test" - org.apache.brooklyn.camp.brooklyn.catalog.SpecParameterParsingTest.testYamlInputsParsed()
2017-04-20 08:41:56,406 INFO  TESTNG PASSED: "Surefire test" - org.apache.brooklyn.camp.brooklyn.catalog.SpecParameterParsingTest.testYamlInputsParsed()
finished in 16 ms
2017-04-20 08:41:56,406 INFO  TESTNG INVOKING CONFIGURATION: "Surefire test" - @AfterMethod
org.apache.brooklyn.camp.brooklyn.AbstractYamlTest.tearDown()
2017-04-20 08:41:56,407 INFO  TESTNG PASSED CONFIGURATION: "Surefire test" - @AfterMethod
org.apache.brooklyn.camp.brooklyn.AbstractYamlTest.tearDown() finished in 1 ms
2017-04-20 08:41:56,407 INFO  TESTNG INVOKING CONFIGURATION: "Surefire test" - @BeforeMethod
org.apache.brooklyn.camp.brooklyn.AbstractYamlTest.setUp()
[GC (Allocation Failure)  661238K->521908K(724992K), 0.0139982 secs]
[GC (Allocation Failure)  663463K->525519K(733696K), 0.0255092 secs]
[GC (Allocation Failure)  678607K->527900K(730112K), 0.0655729 secs]
2017-04-20 08:41:57,057 INFO  TESTNG PASSED CONFIGURATION: "Surefire test" - @BeforeMethod
org.apache.brooklyn.camp.brooklyn.AbstractYamlTest.setUp() finished in 650 ms
2017-04-20 08:41:57,057 INFO  TESTNG INVOKING: "Surefire test" - org.apache.brooklyn.camp.brooklyn.catalog.CatalogXmlOsgiTest.testOsgiItem()
2017-04-20 08:41:57,100 INFO  Started application SimpleApplicationImpl{id=bxuak3ku00}
2017-04-20 08:41:57,101 INFO  TESTNG PASSED: "Surefire test" - org.apache.brooklyn.camp.brooklyn.catalog.CatalogXmlOsgiTest.testOsgiItem()
finished in 44 ms
2017-04-20 08:41:57,101 INFO  TESTNG INVOKING CONFIGURATION: "Surefire test" - @AfterMethod
org.apache.brooklyn.camp.brooklyn.AbstractYamlTest.tearDown()
2017-04-20 08:41:57,103 INFO  Stopping application SimpleApplicationImpl{id=bxuak3ku00}
2017-04-20 08:41:57,103 INFO  Stopped application SimpleApplicationImpl{id=bxuak3ku00}
2017-04-20 08:41:57,140 INFO  TESTNG PASSED CONFIGURATION: "Surefire test" - @AfterMethod
org.apache.brooklyn.camp.brooklyn.AbstractYamlTest.tearDown() finished in 39 ms
2017-04-20 08:41:57,225 INFO  TESTNG 
===============================================
    Surefire test
    Tests run: 608, Failures: 1, Skips: 0
===============================================
[GC (Allocation Failure)  680988K->528167K(739328K), 0.0182944 secs]
Tests run: 608, Failures: 1, Errors: 0, Skipped: 0, Time elapsed: 226.313 sec <<<
FAILURE! - in TestSuite
testCatalogBomFromBundleWithManifest(org.apache.brooklyn.camp.brooklyn.catalog.CatalogMakeOsgiBundleTest)
 Time elapsed: 0.142 sec  <<< FAILURE!
java.lang.AssertionError: attribute=Sensor: a.sensor (java.lang.String); val=null
	at org.apache.brooklyn.camp.brooklyn.catalog.CatalogMakeOsgiBundleTest.assertBasic1DeploysAndHasSensor(CatalogMakeOsgiBundleTest.java:138)
	at org.apache.brooklyn.camp.brooklyn.catalog.CatalogMakeOsgiBundleTest.testCatalogBomFromBundleWithManifest(CatalogMakeOsgiBundleTest.java:129)


Results :

Failed tests: 
  CatalogMakeOsgiBundleTest.testCatalogBomFromBundleWithManifest:129->assertBasic1DeploysAndHasSensor:138
attribute=Sensor: a.sensor (java.lang.String); val=null

Tests run: 608, Failures: 1, Errors: 0, Skipped: 0

[JENKINS] Recording test results
[INFO] ------------------------------------------------------------------------
[INFO] Reactor Summary:
[INFO] 
[INFO] Brooklyn Server Root ............................... SUCCESS [  2.208 s]
[INFO] Brooklyn Parent Project ............................ SUCCESS [  3.913 s]
[INFO] Brooklyn Test Support Utilities .................... SUCCESS [  6.510 s]
[INFO] Brooklyn Logback Includable Configuration .......... SUCCESS [  2.176 s]
[INFO] Brooklyn Common Utilities .......................... SUCCESS [ 29.677 s]
[INFO] Brooklyn API ....................................... SUCCESS [  3.970 s]
[INFO] CAMP Server Parent Project ......................... SUCCESS [  2.080 s]
[INFO] CAMP Base .......................................... SUCCESS [  5.322 s]
[INFO] Brooklyn Test Support .............................. SUCCESS [  2.437 s]
[INFO] Brooklyn REST Swagger Apidoc Utilities ............. SUCCESS [  2.372 s]
[INFO] Brooklyn Logback Configuration ..................... SUCCESS [  1.505 s]
[INFO] CAMP Server ........................................ SUCCESS [  9.592 s]
[INFO] Brooklyn Felix Runtime ............................. SUCCESS [  4.829 s]
[INFO] Brooklyn Groovy Utilities .......................... SUCCESS [  4.526 s]
[INFO] Brooklyn Core ...................................... SUCCESS [03:43 min]
[INFO] Brooklyn Policies .................................. SUCCESS [ 54.214 s]
[INFO] Brooklyn WinRM Software Entities ................... SUCCESS [  8.549 s]
[INFO] Brooklyn Secure JMXMP Agent ........................ SUCCESS [ 10.902 s]
[INFO] Brooklyn JMX RMI Agent ............................. SUCCESS [  4.641 s]
[INFO] Brooklyn Jclouds Location Targets .................. SUCCESS [ 48.829 s]
[INFO] Brooklyn Software Base ............................. SUCCESS [01:36 min]
[INFO] Brooklyn CAMP ...................................... FAILURE [03:52 min]
[INFO] Brooklyn Hazelcast Storage ......................... SKIPPED
[INFO] Brooklyn Launcher Common ........................... SKIPPED
[INFO] Brooklyn REST API .................................. SKIPPED
[INFO] Brooklyn REST Resources ............................ SKIPPED
[INFO] Brooklyn REST Server ............................... SKIPPED
[INFO] Brooklyn Launcher .................................. SKIPPED
[INFO] Brooklyn Command Line Interface .................... SKIPPED
[INFO] Brooklyn Test Framework ............................ SKIPPED
[INFO] Brooklyn OSGi init ................................. SKIPPED
[INFO] Brooklyn Karaf ..................................... SKIPPED
[INFO] Jetty config fragment .............................. SKIPPED
[INFO] Apache Http Component extension .................... SKIPPED
[INFO] Brooklyn Karaf Features ............................ SKIPPED
[INFO] Brooklyn Karaf Shell Commands ...................... SKIPPED
[INFO] Brooklyn Karaf Tests ............................... SKIPPED
[INFO] ------------------------------------------------------------------------
[INFO] BUILD FAILURE
[INFO] ------------------------------------------------------------------------
[INFO] Total time: 13:23 min
[INFO] Finished at: 2017-04-20T08:42:07+00:00
[INFO] Final Memory: 111M/844M
[INFO] ------------------------------------------------------------------------
Waiting for Jenkins to finish collecting data
[ERROR] Failed to execute goal org.apache.maven.plugins:maven-surefire-plugin:2.19.1:test
(default-test) on project brooklyn-camp: There are test failures.
[ERROR] 
[ERROR] Please refer to <https://builds.apache.org/job/brooklyn-server-master/ws/camp/camp-brooklyn/target/surefire-reports>
for the individual test results.
[ERROR] -> [Help 1]
[ERROR] 
[ERROR] To see the full stack trace of the errors, re-run Maven with the -e switch.
[ERROR] Re-run Maven using the -X switch to enable full debug logging.
[ERROR] 
[ERROR] For more information about the errors and possible solutions, please read the following
articles:
[ERROR] [Help 1] http://cwiki.apache.org/confluence/display/MAVEN/MojoFailureException
[ERROR] 
[ERROR] After correcting the problems, you can resume the build with the command
[ERROR]   mvn <goals> -rf :brooklyn-camp
[JENKINS] Archiving <https://builds.apache.org/job/brooklyn-server-master/ws/camp/pom.xml>
to org.apache.brooklyn.camp/camp-parent/0.12.0-SNAPSHOT/camp-parent-0.12.0-SNAPSHOT.pom
[JENKINS] Archiving <https://builds.apache.org/job/brooklyn-server-master/ws/utils/rt-felix/pom.xml>
to org.apache.brooklyn/brooklyn-rt-felix/0.12.0-SNAPSHOT/brooklyn-rt-felix-0.12.0-SNAPSHOT.pom
[JENKINS] Archiving <https://builds.apache.org/job/brooklyn-server-master/ws/utils/rt-felix/target/brooklyn-rt-felix-0.12.0-SNAPSHOT.jar>
to org.apache.brooklyn/brooklyn-rt-felix/0.12.0-SNAPSHOT/brooklyn-rt-felix-0.12.0-SNAPSHOT.jar
[JENKINS] Archiving <https://builds.apache.org/job/brooklyn-server-master/ws/utils/rt-felix/target/brooklyn-rt-felix-0.12.0-SNAPSHOT-tests.jar>
to org.apache.brooklyn/brooklyn-rt-felix/0.12.0-SNAPSHOT/brooklyn-rt-felix-0.12.0-SNAPSHOT-tests.jar
[JENKINS] Archiving <https://builds.apache.org/job/brooklyn-server-master/ws/utils/rt-felix/target/brooklyn-rt-felix-0.12.0-SNAPSHOT-sources.jar>
to org.apache.brooklyn/brooklyn-rt-felix/0.12.0-SNAPSHOT/brooklyn-rt-felix-0.12.0-SNAPSHOT-sources.jar
[JENKINS] Archiving <https://builds.apache.org/job/brooklyn-server-master/ws/utils/rt-felix/target/brooklyn-rt-felix-0.12.0-SNAPSHOT-test-sources.jar>
to org.apache.brooklyn/brooklyn-rt-felix/0.12.0-SNAPSHOT/brooklyn-rt-felix-0.12.0-SNAPSHOT-test-sources.jar
[JENKINS] Archiving <https://builds.apache.org/job/brooklyn-server-master/ws/test-framework/pom.xml>
to org.apache.brooklyn/brooklyn-test-framework/0.12.0-SNAPSHOT/brooklyn-test-framework-0.12.0-SNAPSHOT.pom
[JENKINS] Archiving <https://builds.apache.org/job/brooklyn-server-master/ws/core/pom.xml>
to org.apache.brooklyn/brooklyn-core/0.12.0-SNAPSHOT/brooklyn-core-0.12.0-SNAPSHOT.pom
[JENKINS] Archiving <https://builds.apache.org/job/brooklyn-server-master/ws/core/target/brooklyn-core-0.12.0-SNAPSHOT.jar>
to org.apache.brooklyn/brooklyn-core/0.12.0-SNAPSHOT/brooklyn-core-0.12.0-SNAPSHOT.jar
[JENKINS] Archiving <https://builds.apache.org/job/brooklyn-server-master/ws/core/target/brooklyn-core-0.12.0-SNAPSHOT-tests.jar>
to org.apache.brooklyn/brooklyn-core/0.12.0-SNAPSHOT/brooklyn-core-0.12.0-SNAPSHOT-tests.jar
[JENKINS] Archiving <https://builds.apache.org/job/brooklyn-server-master/ws/core/target/brooklyn-core-0.12.0-SNAPSHOT-sources.jar>
to org.apache.brooklyn/brooklyn-core/0.12.0-SNAPSHOT/brooklyn-core-0.12.0-SNAPSHOT-sources.jar
[JENKINS] Archiving <https://builds.apache.org/job/brooklyn-server-master/ws/core/target/brooklyn-core-0.12.0-SNAPSHOT-test-sources.jar>
to org.apache.brooklyn/brooklyn-core/0.12.0-SNAPSHOT/brooklyn-core-0.12.0-SNAPSHOT-test-sources.jar
[JENKINS] Archiving <https://builds.apache.org/job/brooklyn-server-master/ws/camp/camp-server/pom.xml>
to org.apache.brooklyn.camp/camp-server/0.12.0-SNAPSHOT/camp-server-0.12.0-SNAPSHOT.pom
[JENKINS] Archiving <https://builds.apache.org/job/brooklyn-server-master/ws/camp/camp-server/target/camp-server-0.12.0-SNAPSHOT.jar>
to org.apache.brooklyn.camp/camp-server/0.12.0-SNAPSHOT/camp-server-0.12.0-SNAPSHOT.jar
[JENKINS] Archiving <https://builds.apache.org/job/brooklyn-server-master/ws/camp/camp-server/target/camp-server-0.12.0-SNAPSHOT-tests.jar>
to org.apache.brooklyn.camp/camp-server/0.12.0-SNAPSHOT/camp-server-0.12.0-SNAPSHOT-tests.jar
[JENKINS] Archiving <https://builds.apache.org/job/brooklyn-server-master/ws/camp/camp-server/target/camp-server-0.12.0-SNAPSHOT-sources.jar>
to org.apache.brooklyn.camp/camp-server/0.12.0-SNAPSHOT/camp-server-0.12.0-SNAPSHOT-sources.jar
[JENKINS] Archiving <https://builds.apache.org/job/brooklyn-server-master/ws/camp/camp-server/target/camp-server-0.12.0-SNAPSHOT-test-sources.jar>
to org.apache.brooklyn.camp/camp-server/0.12.0-SNAPSHOT/camp-server-0.12.0-SNAPSHOT-test-sources.jar
[JENKINS] Archiving <https://builds.apache.org/job/brooklyn-server-master/ws/launcher/pom.xml>
to org.apache.brooklyn/brooklyn-launcher/0.12.0-SNAPSHOT/brooklyn-launcher-0.12.0-SNAPSHOT.pom
[JENKINS] Archiving <https://builds.apache.org/job/brooklyn-server-master/ws/karaf/pom.xml>
to org.apache.brooklyn/brooklyn-karaf/0.12.0-SNAPSHOT/brooklyn-karaf-0.12.0-SNAPSHOT.pom
[JENKINS] Archiving <https://builds.apache.org/job/brooklyn-server-master/ws/karaf/httpcomponent-extension/pom.xml>
to org.apache.brooklyn/brooklyn-karaf-httpcomponents-extension/0.12.0-SNAPSHOT/brooklyn-karaf-httpcomponents-extension-0.12.0-SNAPSHOT.pom
[JENKINS] Archiving <https://builds.apache.org/job/brooklyn-server-master/ws/utils/test-support/pom.xml>
to org.apache.brooklyn/brooklyn-utils-test-support/0.12.0-SNAPSHOT/brooklyn-utils-test-support-0.12.0-SNAPSHOT.pom
[JENKINS] Archiving <https://builds.apache.org/job/brooklyn-server-master/ws/utils/test-support/target/brooklyn-utils-test-support-0.12.0-SNAPSHOT.jar>
to org.apache.brooklyn/brooklyn-utils-test-support/0.12.0-SNAPSHOT/brooklyn-utils-test-support-0.12.0-SNAPSHOT.jar
[JENKINS] Archiving <https://builds.apache.org/job/brooklyn-server-master/ws/utils/test-support/target/brooklyn-utils-test-support-0.12.0-SNAPSHOT-sources.jar>
to org.apache.brooklyn/brooklyn-utils-test-support/0.12.0-SNAPSHOT/brooklyn-utils-test-support-0.12.0-SNAPSHOT-sources.jar
[JENKINS] Archiving <https://builds.apache.org/job/brooklyn-server-master/ws/utils/test-support/target/brooklyn-utils-test-support-0.12.0-SNAPSHOT-test-sources.jar>
to org.apache.brooklyn/brooklyn-utils-test-support/0.12.0-SNAPSHOT/brooklyn-utils-test-support-0.12.0-SNAPSHOT-test-sources.jar
[JENKINS] Archiving <https://builds.apache.org/job/brooklyn-server-master/ws/software/base/pom.xml>
to org.apache.brooklyn/brooklyn-software-base/0.12.0-SNAPSHOT/brooklyn-software-base-0.12.0-SNAPSHOT.pom
[JENKINS] Archiving <https://builds.apache.org/job/brooklyn-server-master/ws/software/base/target/brooklyn-software-base-0.12.0-SNAPSHOT.jar>
to org.apache.brooklyn/brooklyn-software-base/0.12.0-SNAPSHOT/brooklyn-software-base-0.12.0-SNAPSHOT.jar
[JENKINS] Archiving <https://builds.apache.org/job/brooklyn-server-master/ws/software/base/target/brooklyn-software-base-0.12.0-SNAPSHOT-tests.jar>
to org.apache.brooklyn/brooklyn-software-base/0.12.0-SNAPSHOT/brooklyn-software-base-0.12.0-SNAPSHOT-tests.jar
[JENKINS] Archiving <https://builds.apache.org/job/brooklyn-server-master/ws/software/base/target/brooklyn-software-base-0.12.0-SNAPSHOT-sources.jar>
to org.apache.brooklyn/brooklyn-software-base/0.12.0-SNAPSHOT/brooklyn-software-base-0.12.0-SNAPSHOT-sources.jar
[JENKINS] Archiving <https://builds.apache.org/job/brooklyn-server-master/ws/software/base/target/brooklyn-software-base-0.12.0-SNAPSHOT-test-sources.jar>
to org.apache.brooklyn/brooklyn-software-base/0.12.0-SNAPSHOT/brooklyn-software-base-0.12.0-SNAPSHOT-test-sources.jar
[JENKINS] Archiving <https://builds.apache.org/job/brooklyn-server-master/ws/utils/groovy/pom.xml>
to org.apache.brooklyn/brooklyn-utils-groovy/0.12.0-SNAPSHOT/brooklyn-utils-groovy-0.12.0-SNAPSHOT.pom
[JENKINS] Archiving <https://builds.apache.org/job/brooklyn-server-master/ws/utils/groovy/target/brooklyn-utils-groovy-0.12.0-SNAPSHOT.jar>
to org.apache.brooklyn/brooklyn-utils-groovy/0.12.0-SNAPSHOT/brooklyn-utils-groovy-0.12.0-SNAPSHOT.jar
[JENKINS] Archiving <https://builds.apache.org/job/brooklyn-server-master/ws/utils/groovy/target/brooklyn-utils-groovy-0.12.0-SNAPSHOT-tests.jar>
to org.apache.brooklyn/brooklyn-utils-groovy/0.12.0-SNAPSHOT/brooklyn-utils-groovy-0.12.0-SNAPSHOT-tests.jar
[JENKINS] Archiving <https://builds.apache.org/job/brooklyn-server-master/ws/utils/groovy/target/brooklyn-utils-groovy-0.12.0-SNAPSHOT-sources.jar>
to org.apache.brooklyn/brooklyn-utils-groovy/0.12.0-SNAPSHOT/brooklyn-utils-groovy-0.12.0-SNAPSHOT-sources.jar
[JENKINS] Archiving <https://builds.apache.org/job/brooklyn-server-master/ws/utils/groovy/target/brooklyn-utils-groovy-0.12.0-SNAPSHOT-test-sources.jar>
to org.apache.brooklyn/brooklyn-utils-groovy/0.12.0-SNAPSHOT/brooklyn-utils-groovy-0.12.0-SNAPSHOT-test-sources.jar
[JENKINS] Archiving <https://builds.apache.org/job/brooklyn-server-master/ws/utils/rest-swagger/pom.xml>
to org.apache.brooklyn/brooklyn-utils-rest-swagger/0.12.0-SNAPSHOT/brooklyn-utils-rest-swagger-0.12.0-SNAPSHOT.pom
[JENKINS] Archiving <https://builds.apache.org/job/brooklyn-server-master/ws/utils/rest-swagger/target/brooklyn-utils-rest-swagger-0.12.0-SNAPSHOT.jar>
to org.apache.brooklyn/brooklyn-utils-rest-swagger/0.12.0-SNAPSHOT/brooklyn-utils-rest-swagger-0.12.0-SNAPSHOT.jar
[JENKINS] Archiving <https://builds.apache.org/job/brooklyn-server-master/ws/utils/rest-swagger/target/brooklyn-utils-rest-swagger-0.12.0-SNAPSHOT-sources.jar>
to org.apache.brooklyn/brooklyn-utils-rest-swagger/0.12.0-SNAPSHOT/brooklyn-utils-rest-swagger-0.12.0-SNAPSHOT-sources.jar
[JENKINS] Archiving <https://builds.apache.org/job/brooklyn-server-master/ws/utils/rest-swagger/target/brooklyn-utils-rest-swagger-0.12.0-SNAPSHOT-test-sources.jar>
to org.apache.brooklyn/brooklyn-utils-rest-swagger/0.12.0-SNAPSHOT/brooklyn-utils-rest-swagger-0.12.0-SNAPSHOT-test-sources.jar
[JENKINS] Archiving <https://builds.apache.org/job/brooklyn-server-master/ws/launcher-common/pom.xml>
to org.apache.brooklyn/brooklyn-launcher-common/0.12.0-SNAPSHOT/brooklyn-launcher-common-0.12.0-SNAPSHOT.pom
[JENKINS] Archiving <https://builds.apache.org/job/brooklyn-server-master/ws/camp/camp-base/pom.xml>
to org.apache.brooklyn.camp/camp-base/0.12.0-SNAPSHOT/camp-base-0.12.0-SNAPSHOT.pom
[JENKINS] Archiving <https://builds.apache.org/job/brooklyn-server-master/ws/camp/camp-base/target/camp-base-0.12.0-SNAPSHOT.jar>
to org.apache.brooklyn.camp/camp-base/0.12.0-SNAPSHOT/camp-base-0.12.0-SNAPSHOT.jar
[JENKINS] Archiving <https://builds.apache.org/job/brooklyn-server-master/ws/camp/camp-base/target/camp-base-0.12.0-SNAPSHOT-tests.jar>
to org.apache.brooklyn.camp/camp-base/0.12.0-SNAPSHOT/camp-base-0.12.0-SNAPSHOT-tests.jar
[JENKINS] Archiving <https://builds.apache.org/job/brooklyn-server-master/ws/camp/camp-base/target/camp-base-0.12.0-SNAPSHOT-sources.jar>
to org.apache.brooklyn.camp/camp-base/0.12.0-SNAPSHOT/camp-base-0.12.0-SNAPSHOT-sources.jar
[JENKINS] Archiving <https://builds.apache.org/job/brooklyn-server-master/ws/camp/camp-base/target/camp-base-0.12.0-SNAPSHOT-test-sources.jar>
to org.apache.brooklyn.camp/camp-base/0.12.0-SNAPSHOT/camp-base-0.12.0-SNAPSHOT-test-sources.jar
[JENKINS] Archiving <https://builds.apache.org/job/brooklyn-server-master/ws/camp/camp-brooklyn/pom.xml>
to org.apache.brooklyn/brooklyn-camp/0.12.0-SNAPSHOT/brooklyn-camp-0.12.0-SNAPSHOT.pom
[JENKINS] Archiving <https://builds.apache.org/job/brooklyn-server-master/ws/karaf/jetty-config/pom.xml>
to org.apache.brooklyn/brooklyn-karaf-jetty-config/0.12.0-SNAPSHOT/brooklyn-karaf-jetty-config-0.12.0-SNAPSHOT.pom
[JENKINS] Archiving <https://builds.apache.org/job/brooklyn-server-master/ws/server-cli/pom.xml>
to org.apache.brooklyn/brooklyn-cli/0.12.0-SNAPSHOT/brooklyn-cli-0.12.0-SNAPSHOT.pom
[JENKINS] Archiving <https://builds.apache.org/job/brooklyn-server-master/ws/logging/logback-xml/pom.xml>
to org.apache.brooklyn/brooklyn-logback-xml/0.12.0-SNAPSHOT/brooklyn-logback-xml-0.12.0-SNAPSHOT.pom
[JENKINS] Archiving <https://builds.apache.org/job/brooklyn-server-master/ws/logging/logback-xml/target/brooklyn-logback-xml-0.12.0-SNAPSHOT.jar>
to org.apache.brooklyn/brooklyn-logback-xml/0.12.0-SNAPSHOT/brooklyn-logback-xml-0.12.0-SNAPSHOT.jar
[JENKINS] Archiving <https://builds.apache.org/job/brooklyn-server-master/ws/logging/logback-xml/target/brooklyn-logback-xml-0.12.0-SNAPSHOT-sources.jar>
to org.apache.brooklyn/brooklyn-logback-xml/0.12.0-SNAPSHOT/brooklyn-logback-xml-0.12.0-SNAPSHOT-sources.jar
[JENKINS] Archiving <https://builds.apache.org/job/brooklyn-server-master/ws/logging/logback-xml/target/brooklyn-logback-xml-0.12.0-SNAPSHOT-test-sources.jar>
to org.apache.brooklyn/brooklyn-logback-xml/0.12.0-SNAPSHOT/brooklyn-logback-xml-0.12.0-SNAPSHOT-test-sources.jar
[JENKINS] Archiving <https://builds.apache.org/job/brooklyn-server-master/ws/karaf/itests/pom.xml>
to org.apache.brooklyn/brooklyn-features-itests/0.12.0-SNAPSHOT/brooklyn-features-itests-0.12.0-SNAPSHOT.pom
[JENKINS] Archiving <https://builds.apache.org/job/brooklyn-server-master/ws/test-support/pom.xml>
to org.apache.brooklyn/brooklyn-test-support/0.12.0-SNAPSHOT/brooklyn-test-support-0.12.0-SNAPSHOT.pom
[JENKINS] Archiving <https://builds.apache.org/job/brooklyn-server-master/ws/test-support/target/brooklyn-test-support-0.12.0-SNAPSHOT.jar>
to org.apache.brooklyn/brooklyn-test-support/0.12.0-SNAPSHOT/brooklyn-test-support-0.12.0-SNAPSHOT.jar
[JENKINS] Archiving <https://builds.apache.org/job/brooklyn-server-master/ws/test-support/target/brooklyn-test-support-0.12.0-SNAPSHOT-sources.jar>
to org.apache.brooklyn/brooklyn-test-support/0.12.0-SNAPSHOT/brooklyn-test-support-0.12.0-SNAPSHOT-sources.jar
[JENKINS] Archiving <https://builds.apache.org/job/brooklyn-server-master/ws/test-support/target/brooklyn-test-support-0.12.0-SNAPSHOT-test-sources.jar>
to org.apache.brooklyn/brooklyn-test-support/0.12.0-SNAPSHOT/brooklyn-test-support-0.12.0-SNAPSHOT-test-sources.jar
[JENKINS] Archiving <https://builds.apache.org/job/brooklyn-server-master/ws/rest/rest-server/pom.xml>
to org.apache.brooklyn/brooklyn-rest-server/0.12.0-SNAPSHOT/brooklyn-rest-server-0.12.0-SNAPSHOT.pom
[JENKINS] Archiving <https://builds.apache.org/job/brooklyn-server-master/ws/api/pom.xml>
to org.apache.brooklyn/brooklyn-api/0.12.0-SNAPSHOT/brooklyn-api-0.12.0-SNAPSHOT.pom
[JENKINS] Archiving <https://builds.apache.org/job/brooklyn-server-master/ws/api/target/brooklyn-api-0.12.0-SNAPSHOT.jar>
to org.apache.brooklyn/brooklyn-api/0.12.0-SNAPSHOT/brooklyn-api-0.12.0-SNAPSHOT.jar
[JENKINS] Archiving <https://builds.apache.org/job/brooklyn-server-master/ws/api/target/brooklyn-api-0.12.0-SNAPSHOT-sources.jar>
to org.apache.brooklyn/brooklyn-api/0.12.0-SNAPSHOT/brooklyn-api-0.12.0-SNAPSHOT-sources.jar
[JENKINS] Archiving <https://builds.apache.org/job/brooklyn-server-master/ws/api/target/brooklyn-api-0.12.0-SNAPSHOT-test-sources.jar>
to org.apache.brooklyn/brooklyn-api/0.12.0-SNAPSHOT/brooklyn-api-0.12.0-SNAPSHOT-test-sources.jar
[JENKINS] Archiving <https://builds.apache.org/job/brooklyn-server-master/ws/pom.xml>
to org.apache.brooklyn/brooklyn-server/0.12.0-SNAPSHOT/brooklyn-server-0.12.0-SNAPSHOT.pom
[JENKINS] Archiving <https://builds.apache.org/job/brooklyn-server-master/ws/locations/jclouds/pom.xml>
to org.apache.brooklyn/brooklyn-locations-jclouds/0.12.0-SNAPSHOT/brooklyn-locations-jclouds-0.12.0-SNAPSHOT.pom
[JENKINS] Archiving <https://builds.apache.org/job/brooklyn-server-master/ws/locations/jclouds/target/brooklyn-locations-jclouds-0.12.0-SNAPSHOT.jar>
to org.apache.brooklyn/brooklyn-locations-jclouds/0.12.0-SNAPSHOT/brooklyn-locations-jclouds-0.12.0-SNAPSHOT.jar
[JENKINS] Archiving <https://builds.apache.org/job/brooklyn-server-master/ws/locations/jclouds/target/brooklyn-locations-jclouds-0.12.0-SNAPSHOT-tests.jar>
to org.apache.brooklyn/brooklyn-locations-jclouds/0.12.0-SNAPSHOT/brooklyn-locations-jclouds-0.12.0-SNAPSHOT-tests.jar
[JENKINS] Archiving <https://builds.apache.org/job/brooklyn-server-master/ws/locations/jclouds/target/brooklyn-locations-jclouds-0.12.0-SNAPSHOT-sources.jar>
to org.apache.brooklyn/brooklyn-locations-jclouds/0.12.0-SNAPSHOT/brooklyn-locations-jclouds-0.12.0-SNAPSHOT-sources.jar
[JENKINS] Archiving <https://builds.apache.org/job/brooklyn-server-master/ws/locations/jclouds/target/brooklyn-locations-jclouds-0.12.0-SNAPSHOT-test-sources.jar>
to org.apache.brooklyn/brooklyn-locations-jclouds/0.12.0-SNAPSHOT/brooklyn-locations-jclouds-0.12.0-SNAPSHOT-test-sources.jar
[JENKINS] Archiving <https://builds.apache.org/job/brooklyn-server-master/ws/utils/common/pom.xml>
to org.apache.brooklyn/brooklyn-utils-common/0.12.0-SNAPSHOT/brooklyn-utils-common-0.12.0-SNAPSHOT.pom
[JENKINS] Archiving <https://builds.apache.org/job/brooklyn-server-master/ws/utils/common/target/brooklyn-utils-common-0.12.0-SNAPSHOT.jar>
to org.apache.brooklyn/brooklyn-utils-common/0.12.0-SNAPSHOT/brooklyn-utils-common-0.12.0-SNAPSHOT.jar
[JENKINS] Archiving <https://builds.apache.org/job/brooklyn-server-master/ws/utils/common/target/brooklyn-utils-common-0.12.0-SNAPSHOT-tests.jar>
to org.apache.brooklyn/brooklyn-utils-common/0.12.0-SNAPSHOT/brooklyn-utils-common-0.12.0-SNAPSHOT-tests.jar
[JENKINS] Archiving <https://builds.apache.org/job/brooklyn-server-master/ws/utils/common/target/brooklyn-utils-common-0.12.0-SNAPSHOT-sources.jar>
to org.apache.brooklyn/brooklyn-utils-common/0.12.0-SNAPSHOT/brooklyn-utils-common-0.12.0-SNAPSHOT-sources.jar
[JENKINS] Archiving <https://builds.apache.org/job/brooklyn-server-master/ws/utils/common/target/brooklyn-utils-common-0.12.0-SNAPSHOT-test-sources.jar>
to org.apache.brooklyn/brooklyn-utils-common/0.12.0-SNAPSHOT/brooklyn-utils-common-0.12.0-SNAPSHOT-test-sources.jar
[JENKINS] Archiving <https://builds.apache.org/job/brooklyn-server-master/ws/karaf/features/pom.xml>
to org.apache.brooklyn/brooklyn-features/0.12.0-SNAPSHOT/brooklyn-features-0.12.0-SNAPSHOT.pom
[JENKINS] Archiving <https://builds.apache.org/job/brooklyn-server-master/ws/rest/rest-api/pom.xml>
to org.apache.brooklyn/brooklyn-rest-api/0.12.0-SNAPSHOT/brooklyn-rest-api-0.12.0-SNAPSHOT.pom
[JENKINS] Archiving <https://builds.apache.org/job/brooklyn-server-master/ws/utils/jmx/jmxrmi-agent/pom.xml>
to org.apache.brooklyn/brooklyn-jmxrmi-agent/0.12.0-SNAPSHOT/brooklyn-jmxrmi-agent-0.12.0-SNAPSHOT.pom
[JENKINS] Archiving <https://builds.apache.org/job/brooklyn-server-master/ws/utils/jmx/jmxrmi-agent/target/brooklyn-jmxrmi-agent-0.12.0-SNAPSHOT.jar>
to org.apache.brooklyn/brooklyn-jmxrmi-agent/0.12.0-SNAPSHOT/brooklyn-jmxrmi-agent-0.12.0-SNAPSHOT.jar
[JENKINS] Archiving <https://builds.apache.org/job/brooklyn-server-master/ws/utils/jmx/jmxrmi-agent/target/brooklyn-jmxrmi-agent-0.12.0-SNAPSHOT-tests.jar>
to org.apache.brooklyn/brooklyn-jmxrmi-agent/0.12.0-SNAPSHOT/brooklyn-jmxrmi-agent-0.12.0-SNAPSHOT-tests.jar
[JENKINS] Archiving <https://builds.apache.org/job/brooklyn-server-master/ws/utils/jmx/jmxrmi-agent/target/brooklyn-jmxrmi-agent-0.12.0-SNAPSHOT-sources.jar>
to org.apache.brooklyn/brooklyn-jmxrmi-agent/0.12.0-SNAPSHOT/brooklyn-jmxrmi-agent-0.12.0-SNAPSHOT-sources.jar
[JENKINS] Archiving <https://builds.apache.org/job/brooklyn-server-master/ws/utils/jmx/jmxrmi-agent/target/brooklyn-jmxrmi-agent-0.12.0-SNAPSHOT-test-sources.jar>
to org.apache.brooklyn/brooklyn-jmxrmi-agent/0.12.0-SNAPSHOT/brooklyn-jmxrmi-agent-0.12.0-SNAPSHOT-test-sources.jar
[JENKINS] Archiving <https://builds.apache.org/job/brooklyn-server-master/ws/policy/pom.xml>
to org.apache.brooklyn/brooklyn-policy/0.12.0-SNAPSHOT/brooklyn-policy-0.12.0-SNAPSHOT.pom
[JENKINS] Archiving <https://builds.apache.org/job/brooklyn-server-master/ws/policy/target/brooklyn-policy-0.12.0-SNAPSHOT.jar>
to org.apache.brooklyn/brooklyn-policy/0.12.0-SNAPSHOT/brooklyn-policy-0.12.0-SNAPSHOT.jar
[JENKINS] Archiving <https://builds.apache.org/job/brooklyn-server-master/ws/policy/target/brooklyn-policy-0.12.0-SNAPSHOT-tests.jar>
to org.apache.brooklyn/brooklyn-policy/0.12.0-SNAPSHOT/brooklyn-policy-0.12.0-SNAPSHOT-tests.jar
[JENKINS] Archiving <https://builds.apache.org/job/brooklyn-server-master/ws/policy/target/brooklyn-policy-0.12.0-SNAPSHOT-sources.jar>
to org.apache.brooklyn/brooklyn-policy/0.12.0-SNAPSHOT/brooklyn-policy-0.12.0-SNAPSHOT-sources.jar
[JENKINS] Archiving <https://builds.apache.org/job/brooklyn-server-master/ws/policy/target/brooklyn-policy-0.12.0-SNAPSHOT-test-sources.jar>
to org.apache.brooklyn/brooklyn-policy/0.12.0-SNAPSHOT/brooklyn-policy-0.12.0-SNAPSHOT-test-sources.jar
[JENKINS] Archiving <https://builds.apache.org/job/brooklyn-server-master/ws/karaf/init/pom.xml>
to org.apache.brooklyn/brooklyn-karaf-init/0.12.0-SNAPSHOT/brooklyn-karaf-init-0.12.0-SNAPSHOT.pom
[JENKINS] Archiving <https://builds.apache.org/job/brooklyn-server-master/ws/karaf/commands/pom.xml>
to org.apache.brooklyn/brooklyn-commands/0.12.0-SNAPSHOT/brooklyn-commands-0.12.0-SNAPSHOT.pom
[JENKINS] Archiving <https://builds.apache.org/job/brooklyn-server-master/ws/storage/hazelcast/pom.xml>
to org.apache.brooklyn/brooklyn-storage-hazelcast/0.12.0-SNAPSHOT/brooklyn-storage-hazelcast-0.12.0-SNAPSHOT.pom
[JENKINS] Archiving <https://builds.apache.org/job/brooklyn-server-master/ws/logging/logback-includes/pom.xml>
to org.apache.brooklyn/brooklyn-logback-includes/0.12.0-SNAPSHOT/brooklyn-logback-includes-0.12.0-SNAPSHOT.pom
[JENKINS] Archiving <https://builds.apache.org/job/brooklyn-server-master/ws/logging/logback-includes/target/brooklyn-logback-includes-0.12.0-SNAPSHOT.jar>
to org.apache.brooklyn/brooklyn-logback-includes/0.12.0-SNAPSHOT/brooklyn-logback-includes-0.12.0-SNAPSHOT.jar
[JENKINS] Archiving <https://builds.apache.org/job/brooklyn-server-master/ws/logging/logback-includes/target/brooklyn-logback-includes-0.12.0-SNAPSHOT-sources.jar>
to org.apache.brooklyn/brooklyn-logback-includes/0.12.0-SNAPSHOT/brooklyn-logback-includes-0.12.0-SNAPSHOT-sources.jar
[JENKINS] Archiving <https://builds.apache.org/job/brooklyn-server-master/ws/logging/logback-includes/target/brooklyn-logback-includes-0.12.0-SNAPSHOT-test-sources.jar>
to org.apache.brooklyn/brooklyn-logback-includes/0.12.0-SNAPSHOT/brooklyn-logback-includes-0.12.0-SNAPSHOT-test-sources.jar
[JENKINS] Archiving <https://builds.apache.org/job/brooklyn-server-master/ws/rest/rest-resources/pom.xml>
to org.apache.brooklyn/brooklyn-rest-resources/0.12.0-SNAPSHOT/brooklyn-rest-resources-0.12.0-SNAPSHOT.pom
[JENKINS] Archiving <https://builds.apache.org/job/brooklyn-server-master/ws/utils/jmx/jmxmp-ssl-agent/pom.xml>
to org.apache.brooklyn/brooklyn-jmxmp-agent/0.12.0-SNAPSHOT/brooklyn-jmxmp-agent-0.12.0-SNAPSHOT.pom
[JENKINS] Archiving <https://builds.apache.org/job/brooklyn-server-master/ws/utils/jmx/jmxmp-ssl-agent/target/brooklyn-jmxmp-agent-0.12.0-SNAPSHOT.jar>
to org.apache.brooklyn/brooklyn-jmxmp-agent/0.12.0-SNAPSHOT/brooklyn-jmxmp-agent-0.12.0-SNAPSHOT.jar
[JENKINS] Archiving <https://builds.apache.org/job/brooklyn-server-master/ws/utils/jmx/jmxmp-ssl-agent/target/brooklyn-jmxmp-agent-0.12.0-SNAPSHOT-tests.jar>
to org.apache.brooklyn/brooklyn-jmxmp-agent/0.12.0-SNAPSHOT/brooklyn-jmxmp-agent-0.12.0-SNAPSHOT-tests.jar
[JENKINS] Archiving <https://builds.apache.org/job/brooklyn-server-master/ws/utils/jmx/jmxmp-ssl-agent/target/brooklyn-jmxmp-agent-shaded-0.12.0-SNAPSHOT.jar>
to org.apache.brooklyn/brooklyn-jmxmp-agent/0.12.0-SNAPSHOT/brooklyn-jmxmp-agent-0.12.0-SNAPSHOT-with-dependencies.jar
[JENKINS] Archiving <https://builds.apache.org/job/brooklyn-server-master/ws/utils/jmx/jmxmp-ssl-agent/target/brooklyn-jmxmp-agent-0.12.0-SNAPSHOT-sources.jar>
to org.apache.brooklyn/brooklyn-jmxmp-agent/0.12.0-SNAPSHOT/brooklyn-jmxmp-agent-0.12.0-SNAPSHOT-sources.jar
[JENKINS] Archiving <https://builds.apache.org/job/brooklyn-server-master/ws/utils/jmx/jmxmp-ssl-agent/target/brooklyn-jmxmp-agent-0.12.0-SNAPSHOT-test-sources.jar>
to org.apache.brooklyn/brooklyn-jmxmp-agent/0.12.0-SNAPSHOT/brooklyn-jmxmp-agent-0.12.0-SNAPSHOT-test-sources.jar
[JENKINS] Archiving <https://builds.apache.org/job/brooklyn-server-master/ws/parent/pom.xml>
to org.apache.brooklyn/brooklyn-parent/0.12.0-SNAPSHOT/brooklyn-parent-0.12.0-SNAPSHOT.pom
Compressed 80.35 KB of artifacts by 79.7% relative to #538
[JENKINS] Archiving <https://builds.apache.org/job/brooklyn-server-master/ws/software/winrm/pom.xml>
to org.apache.brooklyn/brooklyn-software-winrm/0.12.0-SNAPSHOT/brooklyn-software-winrm-0.12.0-SNAPSHOT.pom
[JENKINS] Archiving <https://builds.apache.org/job/brooklyn-server-master/ws/software/winrm/target/brooklyn-software-winrm-0.12.0-SNAPSHOT.jar>
to org.apache.brooklyn/brooklyn-software-winrm/0.12.0-SNAPSHOT/brooklyn-software-winrm-0.12.0-SNAPSHOT.jar
[JENKINS] Archiving <https://builds.apache.org/job/brooklyn-server-master/ws/software/winrm/target/brooklyn-software-winrm-0.12.0-SNAPSHOT-tests.jar>
to org.apache.brooklyn/brooklyn-software-winrm/0.12.0-SNAPSHOT/brooklyn-software-winrm-0.12.0-SNAPSHOT-tests.jar
[JENKINS] Archiving <https://builds.apache.org/job/brooklyn-server-master/ws/software/winrm/target/brooklyn-software-winrm-0.12.0-SNAPSHOT-sources.jar>
to org.apache.brooklyn/brooklyn-software-winrm/0.12.0-SNAPSHOT/brooklyn-software-winrm-0.12.0-SNAPSHOT-sources.jar
[JENKINS] Archiving <https://builds.apache.org/job/brooklyn-server-master/ws/software/winrm/target/brooklyn-software-winrm-0.12.0-SNAPSHOT-test-sources.jar>
to org.apache.brooklyn/brooklyn-software-winrm/0.12.0-SNAPSHOT/brooklyn-software-winrm-0.12.0-SNAPSHOT-test-sources.jar
channel stopped

Mime
View raw message