brooklyn-dev mailing list archives

Site index · List index
Message view « Date » · « Thread »
Top « Date » · « Thread »
From Apache Jenkins Server <jenk...@builds.apache.org>
Subject Build failed in Jenkins: brooklyn-dist-master #79
Date Wed, 08 Mar 2017 14:44:17 GMT
See <https://builds.apache.org/job/brooklyn-dist-master/79/display/redirect>

------------------------------------------
[...truncated 546.47 KB...]
[INFO] Exclude: **/brooklyn*.log.*
[INFO] Exclude: **/target/**
[INFO] Exclude: **/nbactions.xml
[INFO] Exclude: **/nb-configuration.xml
[INFO] Exclude: ignored/**
[INFO] Exclude: LICENSE.md
[INFO] Exclude: .mvn/jvm.config
[INFO] Exclude: **/src/main/license/**
[INFO] Exclude: **/src/test/license/**
[INFO] Exclude: **/MANIFEST.MF
[INFO] Exclude: **/test-output/**
[INFO] Exclude: **/*.pem.pub
[INFO] Exclude: **/*.pem
[INFO] Exclude: **/*_rsa.pub
[INFO] Exclude: **/*_rsa
[INFO] Exclude: **/*.svg
[INFO] Exclude: **/*.crt
[INFO] Exclude: **/*.csr
[INFO] Exclude: **/*.key
[INFO] Exclude: **/*.key.org
[INFO] Exclude: **/*.psd
[INFO] Exclude: **/*.json
[INFO] Exclude: **/*.plxarc
[INFO] Exclude: **/src/test/resources/org/apache/brooklyn/entity/software/base/template_with_extra_substitutions.txt
[INFO] Exclude: **/src/main/resources/banner.txt
[INFO] Exclude: **/src/test/resources/ssl/certs/localhost/info.txt
[INFO] Exclude: **/src/main/history/dependencies.xml
[INFO] Exclude: **/sandbox/examples/src/main/scripts/amis.txt
[INFO] Exclude: docs/**
[INFO] Exclude: scripts/README.md
[INFO] Exclude: docker/README.md
[INFO] 9 resources included (use -debug for more details)
[INFO] Rat check: Summary over all files. Unapproved: 0, unknown: 0, generated: 0, approved:
9 licenses.
[INFO] 
[INFO] --- maven-source-plugin:2.4:jar-no-fork (attach-sources) @ shared-packaging ---
[INFO] Building jar: <https://builds.apache.org/job/brooklyn-dist-master/ws/shared-packaging/target/shared-packaging-0.11.0-SNAPSHOT-sources.jar>
[INFO] 
[INFO] --- maven-source-plugin:2.4:test-jar-no-fork (attach-sources) @ shared-packaging ---
[INFO] Building jar: <https://builds.apache.org/job/brooklyn-dist-master/ws/shared-packaging/target/shared-packaging-0.11.0-SNAPSHOT-test-sources.jar>
[INFO] 
[INFO] --- maven-install-plugin:2.5.2:install (default-install) @ shared-packaging ---
[INFO] Installing <https://builds.apache.org/job/brooklyn-dist-master/ws/shared-packaging/target/shared-packaging-0.11.0-SNAPSHOT.jar>
to /home/jenkins/jenkins-slave/maven-repositories/1/org/apache/brooklyn/shared-packaging/0.11.0-SNAPSHOT/shared-packaging-0.11.0-SNAPSHOT.jar
[INFO] Installing <https://builds.apache.org/job/brooklyn-dist-master/ws/shared-packaging/pom.xml>
to /home/jenkins/jenkins-slave/maven-repositories/1/org/apache/brooklyn/shared-packaging/0.11.0-SNAPSHOT/shared-packaging-0.11.0-SNAPSHOT.pom
[INFO] Installing <https://builds.apache.org/job/brooklyn-dist-master/ws/shared-packaging/target/shared-packaging-0.11.0-SNAPSHOT-tests.jar>
to /home/jenkins/jenkins-slave/maven-repositories/1/org/apache/brooklyn/shared-packaging/0.11.0-SNAPSHOT/shared-packaging-0.11.0-SNAPSHOT-tests.jar
[INFO] Installing <https://builds.apache.org/job/brooklyn-dist-master/ws/shared-packaging/target/shared-packaging-0.11.0-SNAPSHOT-sources.jar>
to /home/jenkins/jenkins-slave/maven-repositories/1/org/apache/brooklyn/shared-packaging/0.11.0-SNAPSHOT/shared-packaging-0.11.0-SNAPSHOT-sources.jar
[INFO] Installing <https://builds.apache.org/job/brooklyn-dist-master/ws/shared-packaging/target/shared-packaging-0.11.0-SNAPSHOT-test-sources.jar>
to /home/jenkins/jenkins-slave/maven-repositories/1/org/apache/brooklyn/shared-packaging/0.11.0-SNAPSHOT/shared-packaging-0.11.0-SNAPSHOT-test-sources.jar
[INFO]                                                                         
[INFO] ------------------------------------------------------------------------
[INFO] Building Brooklyn DEB Package 0.11.0-SNAPSHOT
[INFO] ------------------------------------------------------------------------
[INFO] 
[INFO] --- maven-clean-plugin:2.6.1:clean (default-clean) @ deb-packaging ---
[INFO] Deleting <https://builds.apache.org/job/brooklyn-dist-master/ws/deb-packaging/target>
[INFO] Deleting <https://builds.apache.org/job/brooklyn-dist-master/ws/deb-packaging>
(includes = [brooklyn*.log, brooklyn*.log.*, stacktrace.log, test-output, prodDb.*], excludes
= [])
[INFO] 
[INFO] --- maven-replacer-plugin:1.4.1:replace (fix-eclipse-dot-classpath-mangling) @ deb-packaging
---
[INFO] Ignoring missing file
[INFO] Replacement run on 0 file.
[INFO] 
[INFO] --- buildnumber-maven-plugin:1.3:create (default) @ deb-packaging ---
[INFO] 
[INFO] --- maven-enforcer-plugin:1.4.1:enforce (brooklyn-build-req) @ deb-packaging ---
[INFO] 
[INFO] --- maven-remote-resources-plugin:1.5:process (default) @ deb-packaging ---
[INFO] 
[INFO] --- maven-checkstyle-plugin:2.13:check (verify-style) @ deb-packaging ---
[INFO] 
[INFO] 
[INFO] --- maven-site-plugin:3.4:attach-descriptor (attach-descriptor) @ deb-packaging ---
[INFO] 
[INFO] --- maven-dependency-plugin:2.8:unpack (unpack) @ deb-packaging ---
[INFO] Configured Artifact: org.apache.brooklyn:brooklyn-dist:dist:0.11.0-SNAPSHOT:tar.gz
[INFO] Configured Artifact: org.apache.brooklyn:shared-packaging:0.11.0-SNAPSHOT:jar
[INFO] Unpacking <https://builds.apache.org/job/brooklyn-dist-master/ws/dist/target/brooklyn-dist-0.11.0-SNAPSHOT-dist.tar.gz>
to <https://builds.apache.org/job/brooklyn-dist-master/ws/deb-packaging/target/deps>
with includes "" and excludes ""
[INFO] Expanding: <https://builds.apache.org/job/brooklyn-dist-master/ws/dist/target/brooklyn-dist-0.11.0-SNAPSHOT-dist.tar.gz>
into <https://builds.apache.org/job/brooklyn-dist-master/ws/deb-packaging/target/deps>
[INFO] Unpacking <https://builds.apache.org/job/brooklyn-dist-master/ws/shared-packaging/target/shared-packaging-0.11.0-SNAPSHOT.jar>
to <https://builds.apache.org/job/brooklyn-dist-master/ws/deb-packaging/target/deps/shared-packaging>
with includes "" and excludes ""
[INFO] 
[INFO] --- jdeb:1.5:jdeb (default) @ deb-packaging ---
[INFO] Creating debian package: <https://builds.apache.org/job/brooklyn-dist-master/ws/deb-packaging/target/apache-brooklyn_0.11.0-SNAPSHOT_all.deb>
[INFO] Building conffiles
[INFO] Adding conffile: etc/brooklyn/brooklyn.conf
[INFO] Adding conffile: etc/brooklyn/logback.xml
[INFO] Creating changes file: <https://builds.apache.org/job/brooklyn-dist-master/ws/deb-packaging/target/deb-packaging_0.11.0~SNAPSHOT_all.changes>
[INFO] Attaching created debian package <https://builds.apache.org/job/brooklyn-dist-master/ws/deb-packaging/target/apache-brooklyn_0.11.0-SNAPSHOT_all.deb>
[INFO] 
[INFO] --- apache-rat-plugin:0.12:check (default) @ deb-packaging ---
[INFO] Enabled default license matchers.
[INFO] Will parse SCM ignores for exclusions...
[INFO] Finished adding exclusions from SCM ignore files.
[INFO] 61 implicit excludes (use -debug for more details).
[INFO] Exclude: sandbox/**
[INFO] Exclude: release/**
[INFO] Exclude: README.md
[INFO] Exclude: **/.git/**
[INFO] Exclude: **/.gitignore
[INFO] Exclude: **/.repository/**
[INFO] Exclude: **/.idea/**
[INFO] Exclude: **/*.iml
[INFO] Exclude: **/.classpath/**
[INFO] Exclude: **/.project
[INFO] Exclude: **/.settings/**
[INFO] Exclude: **/*.log
[INFO] Exclude: **/brooklyn*.log.*
[INFO] Exclude: **/target/**
[INFO] Exclude: **/nbactions.xml
[INFO] Exclude: **/nb-configuration.xml
[INFO] Exclude: ignored/**
[INFO] Exclude: LICENSE.md
[INFO] Exclude: .mvn/jvm.config
[INFO] Exclude: **/src/main/license/**
[INFO] Exclude: **/src/test/license/**
[INFO] Exclude: **/MANIFEST.MF
[INFO] Exclude: **/test-output/**
[INFO] Exclude: **/*.pem.pub
[INFO] Exclude: **/*.pem
[INFO] Exclude: **/*_rsa.pub
[INFO] Exclude: **/*_rsa
[INFO] Exclude: **/*.svg
[INFO] Exclude: **/*.crt
[INFO] Exclude: **/*.csr
[INFO] Exclude: **/*.key
[INFO] Exclude: **/*.key.org
[INFO] Exclude: **/*.psd
[INFO] Exclude: **/*.json
[INFO] Exclude: **/*.plxarc
[INFO] Exclude: **/src/test/resources/org/apache/brooklyn/entity/software/base/template_with_extra_substitutions.txt
[INFO] Exclude: **/src/main/resources/banner.txt
[INFO] Exclude: **/src/test/resources/ssl/certs/localhost/info.txt
[INFO] Exclude: **/src/main/history/dependencies.xml
[INFO] Exclude: **/sandbox/examples/src/main/scripts/amis.txt
[INFO] Exclude: docs/**
[INFO] Exclude: scripts/README.md
[INFO] Exclude: docker/README.md
[INFO] 5 resources included (use -debug for more details)
[INFO] Rat check: Summary over all files. Unapproved: 0, unknown: 0, generated: 0, approved:
5 licenses.
[INFO] 
[INFO] --- maven-source-plugin:2.4:jar-no-fork (attach-sources) @ deb-packaging ---
[INFO] 
[INFO] --- maven-source-plugin:2.4:test-jar-no-fork (attach-sources) @ deb-packaging ---
[INFO] 
[INFO] --- maven-install-plugin:2.5.2:install (default-install) @ deb-packaging ---
[INFO] Installing <https://builds.apache.org/job/brooklyn-dist-master/ws/deb-packaging/pom.xml>
to /home/jenkins/jenkins-slave/maven-repositories/1/org/apache/brooklyn/deb-packaging/0.11.0-SNAPSHOT/deb-packaging-0.11.0-SNAPSHOT.pom
[INFO] Installing <https://builds.apache.org/job/brooklyn-dist-master/ws/deb-packaging/target/apache-brooklyn_0.11.0-SNAPSHOT_all.deb>
to /home/jenkins/jenkins-slave/maven-repositories/1/org/apache/brooklyn/deb-packaging/0.11.0-SNAPSHOT/deb-packaging-0.11.0-SNAPSHOT.deb
[INFO] ------------------------------------------------------------------------
[INFO] Reactor Summary:
[INFO] 
[INFO] Brooklyn Downstream Project Parent ................. SUCCESS [  6.723 s]
[INFO] Brooklyn Dist Root ................................. SUCCESS [  8.395 s]
[INFO] Brooklyn All Things ................................ SUCCESS [ 12.084 s]
[INFO] Brooklyn Distribution .............................. SUCCESS [ 51.369 s]
[INFO] Brooklyn Karaf Distribution Parent ................. SUCCESS [  2.395 s]
[INFO] Brooklyn Karaf Server Configuration ................ SUCCESS [  4.720 s]
[INFO] Brooklyn Dist Karaf Features ....................... SUCCESS [  3.730 s]
[INFO] Brooklyn Karaf Distribution ........................ SUCCESS [ 16.546 s]
[INFO] Brooklyn Karaf pax-exam itest ...................... SUCCESS [ 35.234 s]
[INFO] Brooklyn Vagrant Getting Started Environment ....... SUCCESS [  3.425 s]
[INFO] Brooklyn Quick-Start Project Archetype ............. SUCCESS [ 25.319 s]
[INFO] Brooklyn Shared Package Files ...................... SUCCESS [  4.094 s]
[INFO] Brooklyn DEB Package ............................... SUCCESS [ 18.389 s]
[INFO] ------------------------------------------------------------------------
[INFO] BUILD SUCCESS
[INFO] ------------------------------------------------------------------------
[INFO] Total time: 04:46 min
[INFO] Finished at: 2017-03-08T14:37:51+00:00
[INFO] Final Memory: 94M/609M
[INFO] ------------------------------------------------------------------------
Waiting for Jenkins to finish collecting data
[JENKINS] Archiving <https://builds.apache.org/job/brooklyn-dist-master/ws/pom.xml>
to org.apache.brooklyn/brooklyn-dist-root/0.11.0-SNAPSHOT/brooklyn-dist-root-0.11.0-SNAPSHOT.pom
[JENKINS] Archiving <https://builds.apache.org/job/brooklyn-dist-master/ws/all/pom.xml>
to org.apache.brooklyn/brooklyn-all/0.11.0-SNAPSHOT/brooklyn-all-0.11.0-SNAPSHOT.pom
[JENKINS] Archiving <https://builds.apache.org/job/brooklyn-dist-master/ws/all/target/brooklyn-all-0.11.0-SNAPSHOT.jar>
to org.apache.brooklyn/brooklyn-all/0.11.0-SNAPSHOT/brooklyn-all-0.11.0-SNAPSHOT.jar
[JENKINS] Archiving <https://builds.apache.org/job/brooklyn-dist-master/ws/all/target/brooklyn-all-0.11.0-SNAPSHOT-sources.jar>
to org.apache.brooklyn/brooklyn-all/0.11.0-SNAPSHOT/brooklyn-all-0.11.0-SNAPSHOT-sources.jar
[JENKINS] Archiving <https://builds.apache.org/job/brooklyn-dist-master/ws/all/target/brooklyn-all-0.11.0-SNAPSHOT-test-sources.jar>
to org.apache.brooklyn/brooklyn-all/0.11.0-SNAPSHOT/brooklyn-all-0.11.0-SNAPSHOT-test-sources.jar
[JENKINS] Archiving <https://builds.apache.org/job/brooklyn-dist-master/ws/karaf/apache-brooklyn/pom.xml>
to org.apache.brooklyn/apache-brooklyn/0.11.0-SNAPSHOT/apache-brooklyn-0.11.0-SNAPSHOT.pom
[JENKINS] Archiving <https://builds.apache.org/job/brooklyn-dist-master/ws/karaf/apache-brooklyn/target/apache-brooklyn-0.11.0-SNAPSHOT.tar.gz>
to org.apache.brooklyn/apache-brooklyn/0.11.0-SNAPSHOT/apache-brooklyn-0.11.0-SNAPSHOT.tar.gz
[JENKINS] Archiving <https://builds.apache.org/job/brooklyn-dist-master/ws/karaf/apache-brooklyn/target/apache-brooklyn-0.11.0-SNAPSHOT.zip>
to org.apache.brooklyn/apache-brooklyn/0.11.0-SNAPSHOT/apache-brooklyn-0.11.0-SNAPSHOT.zip
No artifacts from brooklyn-dist-master ยป Brooklyn Karaf Distribution #78 to compare, so performing
full copy of artifacts
Build timed out (after 20 minutes). Marking the build as aborted.
ERROR: Failed to parse POMs
java.io.IOException: java.io.IOException: Failed to extract <https://builds.apache.org/job/brooklyn-dist-master/ws/karaf/apache-brooklyn/transfer>
of 3 files
	at hudson.FilePath.readFromTar(FilePath.java:2289)
	at hudson.FilePath.copyRecursiveTo(FilePath.java:2199)
	at jenkins.model.StandardArtifactManager.archive(StandardArtifactManager.java:61)
	at com.cloudbees.jenkins.plugins.jsync.archiver.JSyncArtifactManager.remoteSync(JSyncArtifactManager.java:128)
	at com.cloudbees.jenkins.plugins.jsync.archiver.JSyncArtifactManager.archive(JSyncArtifactManager.java:76)
	at hudson.maven.MavenBuild$ProxyImpl.performArchiving(MavenBuild.java:486)
	at hudson.maven.MavenModuleSetBuild$MavenModuleSetBuildExecution.doRun(MavenModuleSetBuild.java:875)
	at hudson.model.AbstractBuild$AbstractBuildExecution.run(AbstractBuild.java:534)
	at hudson.model.Run.execute(Run.java:1728)
	at hudson.maven.MavenModuleSetBuild.run(MavenModuleSetBuild.java:544)
	at hudson.model.ResourceController.execute(ResourceController.java:98)
	at hudson.model.Executor.run(Executor.java:404)
Caused by: java.io.IOException: java.lang.InterruptedException
	at hudson.remoting.FastPipedInputStream.read(FastPipedInputStream.java:177)
	at hudson.util.HeadBufferingStream.read(HeadBufferingStream.java:61)
	at com.jcraft.jzlib.InflaterInputStream.fill(InflaterInputStream.java:175)
	at com.jcraft.jzlib.InflaterInputStream.read(InflaterInputStream.java:106)
	at org.apache.commons.compress.archivers.tar.TarArchiveInputStream.read(TarArchiveInputStream.java:614)
	at java.io.InputStream.read(InputStream.java:101)
	at org.apache.commons.io.IOUtils.copyLarge(IOUtils.java:1792)
	at org.apache.commons.io.IOUtils.copyLarge(IOUtils.java:1769)
	at org.apache.commons.io.IOUtils.copy(IOUtils.java:1744)
	at hudson.util.IOUtils.copy(IOUtils.java:40)
	at hudson.FilePath.readFromTar(FilePath.java:2279)
	... 11 more
Caused by: java.lang.InterruptedException
	at java.lang.Object.wait(Native Method)
	at hudson.remoting.FastPipedInputStream.read(FastPipedInputStream.java:175)
	... 21 more

	at hudson.FilePath.copyRecursiveTo(FilePath.java:2206)
	at jenkins.model.StandardArtifactManager.archive(StandardArtifactManager.java:61)
	at com.cloudbees.jenkins.plugins.jsync.archiver.JSyncArtifactManager.remoteSync(JSyncArtifactManager.java:128)
	at com.cloudbees.jenkins.plugins.jsync.archiver.JSyncArtifactManager.archive(JSyncArtifactManager.java:76)
	at hudson.maven.MavenBuild$ProxyImpl.performArchiving(MavenBuild.java:486)
	at hudson.maven.MavenModuleSetBuild$MavenModuleSetBuildExecution.doRun(MavenModuleSetBuild.java:875)
	at hudson.model.AbstractBuild$AbstractBuildExecution.run(AbstractBuild.java:534)
	at hudson.model.Run.execute(Run.java:1728)
	at hudson.maven.MavenModuleSetBuild.run(MavenModuleSetBuild.java:544)
	at hudson.model.ResourceController.execute(ResourceController.java:98)
	at hudson.model.Executor.run(Executor.java:404)
Caused by: java.util.concurrent.ExecutionException: java.io.IOException: This archives contains
unclosed entries.
	at hudson.remoting.Channel$2.adapt(Channel.java:854)
	at hudson.remoting.Channel$2.adapt(Channel.java:849)
	at hudson.remoting.FutureAdapter.get(FutureAdapter.java:59)
	at hudson.FilePath.copyRecursiveTo(FilePath.java:2202)
	... 10 more
Caused by: java.io.IOException: This archives contains unclosed entries.
	at org.apache.commons.compress.archivers.tar.TarArchiveOutputStream.finish(TarArchiveOutputStream.java:225)
	at org.apache.commons.compress.archivers.tar.TarArchiveOutputStream.close(TarArchiveOutputStream.java:241)
	at hudson.util.io.TarArchiver.close(TarArchiver.java:121)
	at hudson.FilePath.writeToTar(FilePath.java:2253)
	at hudson.FilePath.access$2100(FilePath.java:195)
	at hudson.FilePath$45.invoke(FilePath.java:2194)
	at hudson.FilePath$45.invoke(FilePath.java:2190)
	at hudson.FilePath$FileCallableWrapper.call(FilePath.java:2731)
	at hudson.remoting.UserRequest.perform(UserRequest.java:153)
	at hudson.remoting.UserRequest.perform(UserRequest.java:50)
	at hudson.remoting.Request$2.run(Request.java:336)
	at hudson.remoting.InterceptingExecutorService$1.call(InterceptingExecutorService.java:68)
	at java.util.concurrent.FutureTask.run(FutureTask.java:266)
	at java.util.concurrent.ThreadPoolExecutor.runWorker(ThreadPoolExecutor.java:1142)
	at java.util.concurrent.ThreadPoolExecutor$Worker.run(ThreadPoolExecutor.java:617)
	at java.lang.Thread.run(Thread.java:745)
	at ......remote call to H23(Native Method)
	at hudson.remoting.Channel.attachCallSiteStackTrace(Channel.java:1537)
	at hudson.remoting.UserResponse.retrieve(UserRequest.java:253)
	at hudson.remoting.Channel$2.adapt(Channel.java:852)
	... 13 more
channel stopped

Mime
View raw message