brooklyn-dev mailing list archives

Site index · List index
Message view « Date » · « Thread »
Top « Date » · « Thread »
From Apache Jenkins Server <jenk...@builds.apache.org>
Subject Build failed in Jenkins: brooklyn-library-master #204
Date Tue, 07 Mar 2017 21:14:44 GMT
See <https://builds.apache.org/job/brooklyn-library-master/204/display/redirect?page=changes>

Changes:

[alex.heneveld] bump http version

------------------------------------------
Started by an SCM change
[EnvInject] - Loading node environment variables.
Building remotely on H14 (ubuntu) in workspace <https://builds.apache.org/job/brooklyn-library-master/ws/>
 > git rev-parse --is-inside-work-tree # timeout=10
Fetching changes from the remote Git repository
 > git config remote.origin.url https://git-wip-us.apache.org/repos/asf/brooklyn-library.git
# timeout=10
Fetching upstream changes from https://git-wip-us.apache.org/repos/asf/brooklyn-library.git
 > git --version # timeout=10
 > git fetch --tags --progress https://git-wip-us.apache.org/repos/asf/brooklyn-library.git
+refs/heads/*:refs/remotes/origin/*
 > git rev-parse origin/master^{commit} # timeout=10
Checking out Revision d7bf1595127dc96cd63bc845084fd44bad94df94 (origin/master)
 > git config core.sparsecheckout # timeout=10
 > git checkout -f d7bf1595127dc96cd63bc845084fd44bad94df94
 > git rev-list 269c0436aaf891d5dbc12855b85c5ec659c1d3b3 # timeout=10
Parsing POMs
Downloaded artifact http://repository.apache.org/snapshots/org/apache/brooklyn/brooklyn-parent/0.11.0-SNAPSHOT/maven-metadata.xml
Downloaded artifact http://repository.apache.org/snapshots/org/apache/brooklyn/brooklyn-parent/0.11.0-SNAPSHOT/brooklyn-parent-0.11.0-20170306.154934-82.pom
Downloaded artifact http://repository.apache.org/snapshots/org/apache/brooklyn/brooklyn-server/0.11.0-SNAPSHOT/maven-metadata.xml
Downloaded artifact http://repository.apache.org/snapshots/org/apache/brooklyn/brooklyn-server/0.11.0-SNAPSHOT/brooklyn-server-0.11.0-20170306.155117-82.pom
Failed to transfer Could not find metadata org.apache.brooklyn:brooklyn-parent:0.11.0-SNAPSHOT/maven-metadata.xml
in clojars.org (http://clojars.org/repo)
Failed to transfer Could not find metadata org.apache.brooklyn:brooklyn-server:0.11.0-SNAPSHOT/maven-metadata.xml
in clojars.org (http://clojars.org/repo)
Failed to transfer Could not find metadata org.apache.brooklyn:brooklyn-parent:0.11.0-SNAPSHOT/maven-metadata.xml
in oracle (http://download.oracle.com/maven)
Failed to transfer Could not find metadata org.apache.brooklyn:brooklyn-server:0.11.0-SNAPSHOT/maven-metadata.xml
in oracle (http://download.oracle.com/maven)
ERROR: Failed to parse POMs
java.io.IOException: remote file operation failed: <https://builds.apache.org/job/brooklyn-library-master/ws/>
at hudson.remoting.Channel@2cb5f247:H14: hudson.remoting.ProxyException: hudson.maven.MavenModuleSetBuild$MavenExecutionException:
org.apache.maven.project.ProjectBuildingException: Some problems were encountered while processing
the POMs:
[ERROR] 'dependencies.dependency.version' for org.apache.httpcomponents:httpclient:jar must
be a valid version but is '${httpcomponents.httpclient.version}'. @ line 63, column 22

	at hudson.FilePath.act(FilePath.java:992)
	at hudson.FilePath.act(FilePath.java:974)
	at hudson.maven.MavenModuleSetBuild$MavenModuleSetBuildExecution.parsePoms(MavenModuleSetBuild.java:980)
	at hudson.maven.MavenModuleSetBuild$MavenModuleSetBuildExecution.doRun(MavenModuleSetBuild.java:692)
	at hudson.model.AbstractBuild$AbstractBuildExecution.run(AbstractBuild.java:534)
	at hudson.model.Run.execute(Run.java:1728)
	at hudson.maven.MavenModuleSetBuild.run(MavenModuleSetBuild.java:544)
	at hudson.model.ResourceController.execute(ResourceController.java:98)
	at hudson.model.Executor.run(Executor.java:404)
Caused by: hudson.remoting.ProxyException: hudson.maven.MavenModuleSetBuild$MavenExecutionException:
org.apache.maven.project.ProjectBuildingException: Some problems were encountered while processing
the POMs:
[ERROR] 'dependencies.dependency.version' for org.apache.httpcomponents:httpclient:jar must
be a valid version but is '${httpcomponents.httpclient.version}'. @ line 63, column 22

	at hudson.maven.MavenModuleSetBuild$PomParser.invoke(MavenModuleSetBuild.java:1384)
	at hudson.maven.MavenModuleSetBuild$PomParser.invoke(MavenModuleSetBuild.java:1118)
	at hudson.FilePath$FileCallableWrapper.call(FilePath.java:2731)
	at hudson.remoting.UserRequest.perform(UserRequest.java:153)
	at hudson.remoting.UserRequest.perform(UserRequest.java:50)
	at hudson.remoting.Request$2.run(Request.java:336)
	at hudson.remoting.InterceptingExecutorService$1.call(InterceptingExecutorService.java:68)
	at java.util.concurrent.FutureTask.run(FutureTask.java:262)
	at java.util.concurrent.ThreadPoolExecutor.runWorker(ThreadPoolExecutor.java:1145)
	at java.util.concurrent.ThreadPoolExecutor$Worker.run(ThreadPoolExecutor.java:615)
	at java.lang.Thread.run(Thread.java:745)
	at ......remote call to H14(Native Method)
	at hudson.remoting.Channel.attachCallSiteStackTrace(Channel.java:1537)
	at hudson.remoting.UserResponse.retrieve(UserRequest.java:253)
	at hudson.remoting.Channel.call(Channel.java:822)
	at hudson.FilePath.act(FilePath.java:985)
	... 8 more
Caused by: hudson.remoting.ProxyException: org.apache.maven.project.ProjectBuildingException:
Some problems were encountered while processing the POMs:
[ERROR] 'dependencies.dependency.version' for org.apache.httpcomponents:httpclient:jar must
be a valid version but is '${httpcomponents.httpclient.version}'. @ line 63, column 22

	at org.apache.maven.project.DefaultProjectBuilder.build(DefaultProjectBuilder.java:364)
	at hudson.maven.MavenEmbedder.buildProjects(MavenEmbedder.java:361)
	at hudson.maven.MavenEmbedder.readProjects(MavenEmbedder.java:331)
	at hudson.maven.MavenModuleSetBuild$PomParser.invoke(MavenModuleSetBuild.java:1321)
	at hudson.maven.MavenModuleSetBuild$PomParser.invoke(MavenModuleSetBuild.java:1118)
	at hudson.FilePath$FileCallableWrapper.call(FilePath.java:2731)
	at hudson.remoting.UserRequest.perform(UserRequest.java:153)
	at hudson.remoting.UserRequest.perform(UserRequest.java:50)
	at hudson.remoting.Request$2.run(Request.java:336)
	at hudson.remoting.InterceptingExecutorService$1.call(InterceptingExecutorService.java:68)
	at java.util.concurrent.FutureTask.run(FutureTask.java:262)
	at java.util.concurrent.ThreadPoolExecutor.runWorker(ThreadPoolExecutor.java:1145)
	at java.util.concurrent.ThreadPoolExecutor$Worker.run(ThreadPoolExecutor.java:615)
	at java.lang.Thread.run(Thread.java:745)

Mime
View raw message