brooklyn-dev mailing list archives

Site index · List index
Message view « Date » · « Thread »
Top « Date » · « Thread »
From Apache Jenkins Server <jenk...@builds.apache.org>
Subject Build failed in Jenkins: brooklyn-server-master #474
Date Thu, 02 Mar 2017 18:20:52 GMT
See <https://builds.apache.org/job/brooklyn-server-master/474/display/redirect?page=changes>

Changes:

[svetoslav.neykov] Set the username for Windows locations correctly

------------------------------------------
[...truncated 5.26 MB...]
[Full GC 641648K->549176K(714240K), 0.3973800 secs]
[Full GC 642003K->551236K(714240K), 0.9292680 secs]
[Full GC 641441K->544067K(714240K), 0.3181490 secs]
2017-03-02 18:19:35,412 INFO  TESTNG PASSED CONFIGURATION: "Surefire test" - @BeforeMethod
org.apache.brooklyn.camp.brooklyn.AbstractYamlTest.setUp() finished in 3006 ms
2017-03-02 18:19:35,412 INFO  TESTNG INVOKING: "Surefire test" - org.apache.brooklyn.camp.brooklyn.catalog.CatalogXmlVersionTest.testXmlCatalogItem(java.lang.String)(value(s):
"org.apache.brooklyn.entity.stock.BasicApplication:2.0")
2017-03-02 18:19:35,451 INFO  Started application BasicApplicationImpl{id=mm69se6wfx}
2017-03-02 18:19:35,451 INFO  TESTNG PASSED: "Surefire test" - org.apache.brooklyn.camp.brooklyn.catalog.CatalogXmlVersionTest.testXmlCatalogItem(java.lang.String)(value(s):
"org.apache.brooklyn.entity.stock.BasicApplication:2.0") finished in 39 ms
2017-03-02 18:19:35,451 INFO  TESTNG INVOKING CONFIGURATION: "Surefire test" - @AfterMethod
org.apache.brooklyn.camp.brooklyn.AbstractYamlTest.tearDown()
2017-03-02 18:19:35,453 INFO  Stopping application BasicApplicationImpl{id=mm69se6wfx}
2017-03-02 18:19:35,454 INFO  Stopped application BasicApplicationImpl{id=mm69se6wfx}
2017-03-02 18:19:35,481 INFO  TESTNG PASSED CONFIGURATION: "Surefire test" - @AfterMethod
org.apache.brooklyn.camp.brooklyn.AbstractYamlTest.tearDown() finished in 30 ms
2017-03-02 18:19:35,481 INFO  TESTNG INVOKING CONFIGURATION: "Surefire test" - @BeforeMethod
org.apache.brooklyn.camp.brooklyn.AbstractYamlTest.setUp()
[Full GC 641660K->536278K(714240K), 0.2876400 secs]
[Full GC 641835K->539807K(714240K), 0.8620590 secs]
[Full GC 641825K->541917K(714240K), 0.8072400 secs]
[Full GC 641236K->535628K(714240K), 0.3183030 secs]
2017-03-02 18:19:38,488 INFO  TESTNG PASSED CONFIGURATION: "Surefire test" - @BeforeMethod
org.apache.brooklyn.camp.brooklyn.AbstractYamlTest.setUp() finished in 3007 ms
2017-03-02 18:19:38,488 INFO  TESTNG INVOKING: "Surefire test" - org.apache.brooklyn.camp.brooklyn.catalog.CatalogXmlVersionTest.testXmlCatalogItem(java.lang.String)(value(s):
"BasicApp")
2017-03-02 18:19:38,547 INFO  Started application BasicApplicationImpl{id=s3utpnwhk9}
2017-03-02 18:19:38,547 INFO  TESTNG PASSED: "Surefire test" - org.apache.brooklyn.camp.brooklyn.catalog.CatalogXmlVersionTest.testXmlCatalogItem(java.lang.String)(value(s):
"BasicApp") finished in 59 ms
2017-03-02 18:19:38,548 INFO  TESTNG INVOKING CONFIGURATION: "Surefire test" - @AfterMethod
org.apache.brooklyn.camp.brooklyn.AbstractYamlTest.tearDown()
2017-03-02 18:19:38,549 INFO  Stopping application BasicApplicationImpl{id=s3utpnwhk9}
2017-03-02 18:19:38,551 INFO  Stopped application BasicApplicationImpl{id=s3utpnwhk9}
2017-03-02 18:19:38,588 INFO  TESTNG PASSED CONFIGURATION: "Surefire test" - @AfterMethod
org.apache.brooklyn.camp.brooklyn.AbstractYamlTest.tearDown() finished in 41 ms
2017-03-02 18:19:38,589 INFO  TESTNG INVOKING CONFIGURATION: "Surefire test" - @BeforeMethod
org.apache.brooklyn.camp.brooklyn.AbstractYamlTest.setUp()
[Full GC 641940K->527409K(714240K), 0.2905950 secs]
[Full GC 641786K->522319K(714240K), 0.2596640 secs]
[Full GC 640079K->525462K(714240K), 0.2424510 secs]
[Full GC 641657K->526773K(714240K), 0.8443490 secs]
2017-03-02 18:19:40,689 INFO  TESTNG PASSED CONFIGURATION: "Surefire test" - @BeforeMethod
org.apache.brooklyn.camp.brooklyn.AbstractYamlTest.setUp() finished in 2100 ms
2017-03-02 18:19:40,690 INFO  TESTNG INVOKING: "Surefire test" - org.apache.brooklyn.camp.brooklyn.catalog.CatalogXmlVersionTest.testXmlCatalogItem(java.lang.String)(value(s):
"BasicApp:0.0.0.SNAPSHOT")
2017-03-02 18:19:40,729 INFO  Started application BasicApplicationImpl{id=l0tddii0ee}
2017-03-02 18:19:40,730 INFO  TESTNG PASSED: "Surefire test" - org.apache.brooklyn.camp.brooklyn.catalog.CatalogXmlVersionTest.testXmlCatalogItem(java.lang.String)(value(s):
"BasicApp:0.0.0.SNAPSHOT") finished in 41 ms
2017-03-02 18:19:40,730 INFO  TESTNG INVOKING CONFIGURATION: "Surefire test" - @AfterMethod
org.apache.brooklyn.camp.brooklyn.AbstractYamlTest.tearDown()
2017-03-02 18:19:40,731 INFO  Stopping application BasicApplicationImpl{id=l0tddii0ee}
2017-03-02 18:19:40,734 INFO  Stopped application BasicApplicationImpl{id=l0tddii0ee}
2017-03-02 18:19:40,762 INFO  TESTNG PASSED CONFIGURATION: "Surefire test" - @AfterMethod
org.apache.brooklyn.camp.brooklyn.AbstractYamlTest.tearDown() finished in 32 ms
2017-03-02 18:19:40,762 INFO  TESTNG INVOKING CONFIGURATION: "Surefire test" - @BeforeMethod
org.apache.brooklyn.camp.brooklyn.AbstractYamlTest.setUp()
[Full GC 642039K->520191K(714240K), 0.3056070 secs]
[Full GC 637773K->506789K(714240K), 0.2502760 secs]
[GC 623720K->512512K(711168K), 0.0124500 secs]
[GC 627577K->515375K(648704K), 0.0125950 secs]
2017-03-02 18:19:41,827 INFO  TESTNG PASSED CONFIGURATION: "Surefire test" - @BeforeMethod
org.apache.brooklyn.camp.brooklyn.AbstractYamlTest.setUp() finished in 1065 ms
2017-03-02 18:19:41,827 INFO  TESTNG INVOKING: "Surefire test" - org.apache.brooklyn.camp.brooklyn.catalog.CatalogXmlVersionTest.testXmlCatalogItem(java.lang.String)(value(s):
"BasicApp:2.0")
2017-03-02 18:19:41,867 INFO  Started application BasicApplicationImpl{id=sthbf06qyo}
2017-03-02 18:19:41,867 INFO  TESTNG PASSED: "Surefire test" - org.apache.brooklyn.camp.brooklyn.catalog.CatalogXmlVersionTest.testXmlCatalogItem(java.lang.String)(value(s):
"BasicApp:2.0") finished in 40 ms
2017-03-02 18:19:41,867 INFO  TESTNG INVOKING CONFIGURATION: "Surefire test" - @AfterMethod
org.apache.brooklyn.camp.brooklyn.AbstractYamlTest.tearDown()
2017-03-02 18:19:41,869 INFO  Stopping application BasicApplicationImpl{id=sthbf06qyo}
2017-03-02 18:19:41,871 INFO  Stopped application BasicApplicationImpl{id=sthbf06qyo}
2017-03-02 18:19:41,903 INFO  TESTNG PASSED CONFIGURATION: "Surefire test" - @AfterMethod
org.apache.brooklyn.camp.brooklyn.AbstractYamlTest.tearDown() finished in 36 ms
2017-03-02 18:19:41,903 INFO  TESTNG INVOKING CONFIGURATION: "Surefire test" - @BeforeMethod
org.apache.brooklyn.camp.brooklyn.AbstractYamlTest.setUp()
[GC 631087K->516726K(712192K), 0.0174030 secs]
[GC 630390K->519648K(712192K), 0.0156010 secs]
[GC 633312K->521968K(715776K), 0.0138180 secs]
2017-03-02 18:19:42,420 INFO  TESTNG PASSED CONFIGURATION: "Surefire test" - @BeforeMethod
org.apache.brooklyn.camp.brooklyn.AbstractYamlTest.setUp() finished in 517 ms
2017-03-02 18:19:42,420 INFO  TESTNG INVOKING: "Surefire test" - org.apache.brooklyn.camp.brooklyn.catalog.CatalogXmlVersionTest.testXmlCatalogItem(java.lang.String)(value(s):
"org.apache.brooklyn.test.osgi.entities.SimpleApplication")
[GC 640752K->522541K(713728K), 0.0163830 secs]
2017-03-02 18:19:42,493 INFO  Started application SimpleApplicationImpl{id=yfkbdreaf2}
2017-03-02 18:19:42,493 INFO  TESTNG PASSED: "Surefire test" - org.apache.brooklyn.camp.brooklyn.catalog.CatalogXmlVersionTest.testXmlCatalogItem(java.lang.String)(value(s):
"org.apache.brooklyn.test.osgi.entities.SimpleApplication") finished in 73 ms
2017-03-02 18:19:42,494 INFO  TESTNG INVOKING CONFIGURATION: "Surefire test" - @AfterMethod
org.apache.brooklyn.camp.brooklyn.AbstractYamlTest.tearDown()
2017-03-02 18:19:42,496 INFO  Stopping application SimpleApplicationImpl{id=yfkbdreaf2}
2017-03-02 18:19:42,497 INFO  Stopped application SimpleApplicationImpl{id=yfkbdreaf2}
2017-03-02 18:19:42,550 INFO  TESTNG PASSED CONFIGURATION: "Surefire test" - @AfterMethod
org.apache.brooklyn.camp.brooklyn.AbstractYamlTest.tearDown() finished in 56 ms
2017-03-02 18:19:42,660 INFO  TESTNG 
===============================================
    Surefire test
    Tests run: 575, Failures: 1, Skips: 0
===============================================
[GC 641325K->523386K(720384K), 0.0156740 secs]
Tests run: 575, Failures: 1, Errors: 0, Skipped: 0, Time elapsed: 222.294 sec <<<
FAILURE! - in TestSuite
testCatalogBomFromBundleWithManualManifest(org.apache.brooklyn.camp.brooklyn.catalog.CatalogMakeOsgiBundleTest)
 Time elapsed: 0.136 sec  <<< FAILURE!
java.lang.AssertionError: attribute=Sensor: a.sensor (java.lang.String); val=null
	at org.apache.brooklyn.camp.brooklyn.catalog.CatalogMakeOsgiBundleTest.assertBasic1DeploysAndHasSensor(CatalogMakeOsgiBundleTest.java:138)
	at org.apache.brooklyn.camp.brooklyn.catalog.CatalogMakeOsgiBundleTest.testCatalogBomFromBundleWithManualManifest(CatalogMakeOsgiBundleTest.java:163)


Results :

Failed tests: 
  CatalogMakeOsgiBundleTest.testCatalogBomFromBundleWithManualManifest:163->assertBasic1DeploysAndHasSensor:138
attribute=Sensor: a.sensor (java.lang.String); val=null

Tests run: 575, Failures: 1, Errors: 0, Skipped: 0

[JENKINS] Recording test results
[INFO] ------------------------------------------------------------------------
[INFO] Reactor Summary:
[INFO] 
[INFO] Brooklyn Server Root ............................... SUCCESS [  4.168 s]
[INFO] Brooklyn Parent Project ............................ SUCCESS [  5.536 s]
[INFO] Brooklyn Test Support Utilities .................... SUCCESS [  9.333 s]
[INFO] Brooklyn Logback Includable Configuration .......... SUCCESS [  2.052 s]
[INFO] Brooklyn Common Utilities .......................... SUCCESS [ 32.850 s]
[INFO] Brooklyn API ....................................... SUCCESS [  4.692 s]
[INFO] CAMP Server Parent Project ......................... SUCCESS [  1.390 s]
[INFO] CAMP Base .......................................... SUCCESS [  5.116 s]
[INFO] Brooklyn Test Support .............................. SUCCESS [  3.605 s]
[INFO] Brooklyn REST Swagger Apidoc Utilities ............. SUCCESS [  2.985 s]
[INFO] Brooklyn Logback Configuration ..................... SUCCESS [  1.613 s]
[INFO] CAMP Server ........................................ SUCCESS [  6.543 s]
[INFO] Brooklyn Felix Runtime ............................. SUCCESS [  8.331 s]
[INFO] Brooklyn Groovy Utilities .......................... SUCCESS [  3.729 s]
[INFO] Brooklyn Core ...................................... SUCCESS [03:56 min]
[INFO] Brooklyn Policies .................................. SUCCESS [ 58.080 s]
[INFO] Brooklyn WinRM Software Entities ................... SUCCESS [  7.780 s]
[INFO] Brooklyn Secure JMXMP Agent ........................ SUCCESS [ 11.144 s]
[INFO] Brooklyn JMX RMI Agent ............................. SUCCESS [  1.820 s]
[INFO] Brooklyn Jclouds Location Targets .................. SUCCESS [ 47.442 s]
[INFO] Brooklyn Software Base ............................. SUCCESS [01:37 min]
[INFO] Brooklyn CAMP ...................................... FAILURE [03:48 min]
[INFO] Brooklyn Hazelcast Storage ......................... SKIPPED
[INFO] Brooklyn Launcher Common ........................... SKIPPED
[INFO] Brooklyn REST API .................................. SKIPPED
[INFO] Brooklyn REST Resources ............................ SKIPPED
[INFO] Brooklyn REST Server ............................... SKIPPED
[INFO] Brooklyn Launcher .................................. SKIPPED
[INFO] Brooklyn Command Line Interface .................... SKIPPED
[INFO] Brooklyn Test Framework ............................ SKIPPED
[INFO] Brooklyn OSGi init ................................. SKIPPED
[INFO] Brooklyn Karaf ..................................... SKIPPED
[INFO] Jetty config fragment .............................. SKIPPED
[INFO] Apache Http Component extension .................... SKIPPED
[INFO] Brooklyn Karaf Features ............................ SKIPPED
[INFO] Brooklyn Karaf Shell Commands ...................... SKIPPED
[INFO] ------------------------------------------------------------------------
[INFO] BUILD FAILURE
[INFO] ------------------------------------------------------------------------
[INFO] Total time: 13:41 min
[INFO] Finished at: 2017-03-02T18:19:52+00:00
[INFO] Final Memory: 127M/644M
[INFO] ------------------------------------------------------------------------
Waiting for Jenkins to finish collecting data
[ERROR] Failed to execute goal org.apache.maven.plugins:maven-surefire-plugin:2.19.1:test
(default-test) on project brooklyn-camp: There are test failures.
[ERROR] 
[ERROR] Please refer to <https://builds.apache.org/job/brooklyn-server-master/ws/camp/camp-brooklyn/target/surefire-reports>
for the individual test results.
[ERROR] -> [Help 1]
[ERROR] 
[ERROR] To see the full stack trace of the errors, re-run Maven with the -e switch.
[ERROR] Re-run Maven using the -X switch to enable full debug logging.
[ERROR] 
[ERROR] For more information about the errors and possible solutions, please read the following
articles:
[ERROR] [Help 1] http://cwiki.apache.org/confluence/display/MAVEN/MojoFailureException
[ERROR] 
[ERROR] After correcting the problems, you can resume the build with the command
[ERROR]   mvn <goals> -rf :brooklyn-camp
[JENKINS] Archiving <https://builds.apache.org/job/brooklyn-server-master/ws/camp/pom.xml>
to org.apache.brooklyn.camp/camp-parent/0.11.0-SNAPSHOT/camp-parent-0.11.0-SNAPSHOT.pom
[JENKINS] Archiving <https://builds.apache.org/job/brooklyn-server-master/ws/utils/rt-felix/pom.xml>
to org.apache.brooklyn/brooklyn-rt-felix/0.11.0-SNAPSHOT/brooklyn-rt-felix-0.11.0-SNAPSHOT.pom
[JENKINS] Archiving <https://builds.apache.org/job/brooklyn-server-master/ws/utils/rt-felix/target/brooklyn-rt-felix-0.11.0-SNAPSHOT.jar>
to org.apache.brooklyn/brooklyn-rt-felix/0.11.0-SNAPSHOT/brooklyn-rt-felix-0.11.0-SNAPSHOT.jar
[JENKINS] Archiving <https://builds.apache.org/job/brooklyn-server-master/ws/utils/rt-felix/target/brooklyn-rt-felix-0.11.0-SNAPSHOT-tests.jar>
to org.apache.brooklyn/brooklyn-rt-felix/0.11.0-SNAPSHOT/brooklyn-rt-felix-0.11.0-SNAPSHOT-tests.jar
[JENKINS] Archiving <https://builds.apache.org/job/brooklyn-server-master/ws/utils/rt-felix/target/brooklyn-rt-felix-0.11.0-SNAPSHOT-sources.jar>
to org.apache.brooklyn/brooklyn-rt-felix/0.11.0-SNAPSHOT/brooklyn-rt-felix-0.11.0-SNAPSHOT-sources.jar
[JENKINS] Archiving <https://builds.apache.org/job/brooklyn-server-master/ws/utils/rt-felix/target/brooklyn-rt-felix-0.11.0-SNAPSHOT-test-sources.jar>
to org.apache.brooklyn/brooklyn-rt-felix/0.11.0-SNAPSHOT/brooklyn-rt-felix-0.11.0-SNAPSHOT-test-sources.jar
[JENKINS] Archiving <https://builds.apache.org/job/brooklyn-server-master/ws/test-framework/pom.xml>
to org.apache.brooklyn/brooklyn-test-framework/0.11.0-SNAPSHOT/brooklyn-test-framework-0.11.0-SNAPSHOT.pom
[JENKINS] Archiving <https://builds.apache.org/job/brooklyn-server-master/ws/core/pom.xml>
to org.apache.brooklyn/brooklyn-core/0.11.0-SNAPSHOT/brooklyn-core-0.11.0-SNAPSHOT.pom
[JENKINS] Archiving <https://builds.apache.org/job/brooklyn-server-master/ws/core/target/brooklyn-core-0.11.0-SNAPSHOT.jar>
to org.apache.brooklyn/brooklyn-core/0.11.0-SNAPSHOT/brooklyn-core-0.11.0-SNAPSHOT.jar
[JENKINS] Archiving <https://builds.apache.org/job/brooklyn-server-master/ws/core/target/brooklyn-core-0.11.0-SNAPSHOT-tests.jar>
to org.apache.brooklyn/brooklyn-core/0.11.0-SNAPSHOT/brooklyn-core-0.11.0-SNAPSHOT-tests.jar
[JENKINS] Archiving <https://builds.apache.org/job/brooklyn-server-master/ws/core/target/brooklyn-core-0.11.0-SNAPSHOT-sources.jar>
to org.apache.brooklyn/brooklyn-core/0.11.0-SNAPSHOT/brooklyn-core-0.11.0-SNAPSHOT-sources.jar
[JENKINS] Archiving <https://builds.apache.org/job/brooklyn-server-master/ws/core/target/brooklyn-core-0.11.0-SNAPSHOT-test-sources.jar>
to org.apache.brooklyn/brooklyn-core/0.11.0-SNAPSHOT/brooklyn-core-0.11.0-SNAPSHOT-test-sources.jar
[JENKINS] Archiving <https://builds.apache.org/job/brooklyn-server-master/ws/camp/camp-server/pom.xml>
to org.apache.brooklyn.camp/camp-server/0.11.0-SNAPSHOT/camp-server-0.11.0-SNAPSHOT.pom
[JENKINS] Archiving <https://builds.apache.org/job/brooklyn-server-master/ws/camp/camp-server/target/camp-server-0.11.0-SNAPSHOT.jar>
to org.apache.brooklyn.camp/camp-server/0.11.0-SNAPSHOT/camp-server-0.11.0-SNAPSHOT.jar
[JENKINS] Archiving <https://builds.apache.org/job/brooklyn-server-master/ws/camp/camp-server/target/camp-server-0.11.0-SNAPSHOT-tests.jar>
to org.apache.brooklyn.camp/camp-server/0.11.0-SNAPSHOT/camp-server-0.11.0-SNAPSHOT-tests.jar
[JENKINS] Archiving <https://builds.apache.org/job/brooklyn-server-master/ws/camp/camp-server/target/camp-server-0.11.0-SNAPSHOT-sources.jar>
to org.apache.brooklyn.camp/camp-server/0.11.0-SNAPSHOT/camp-server-0.11.0-SNAPSHOT-sources.jar
[JENKINS] Archiving <https://builds.apache.org/job/brooklyn-server-master/ws/camp/camp-server/target/camp-server-0.11.0-SNAPSHOT-test-sources.jar>
to org.apache.brooklyn.camp/camp-server/0.11.0-SNAPSHOT/camp-server-0.11.0-SNAPSHOT-test-sources.jar
[JENKINS] Archiving <https://builds.apache.org/job/brooklyn-server-master/ws/launcher/pom.xml>
to org.apache.brooklyn/brooklyn-launcher/0.11.0-SNAPSHOT/brooklyn-launcher-0.11.0-SNAPSHOT.pom
[JENKINS] Archiving <https://builds.apache.org/job/brooklyn-server-master/ws/karaf/pom.xml>
to org.apache.brooklyn/brooklyn-karaf/0.11.0-SNAPSHOT/brooklyn-karaf-0.11.0-SNAPSHOT.pom
[JENKINS] Archiving <https://builds.apache.org/job/brooklyn-server-master/ws/karaf/httpcomponent-extension/pom.xml>
to org.apache.brooklyn/brooklyn-karaf-httpcomponents-extension/0.11.0-SNAPSHOT/brooklyn-karaf-httpcomponents-extension-0.11.0-SNAPSHOT.pom
[JENKINS] Archiving <https://builds.apache.org/job/brooklyn-server-master/ws/utils/test-support/pom.xml>
to org.apache.brooklyn/brooklyn-utils-test-support/0.11.0-SNAPSHOT/brooklyn-utils-test-support-0.11.0-SNAPSHOT.pom
[JENKINS] Archiving <https://builds.apache.org/job/brooklyn-server-master/ws/utils/test-support/target/brooklyn-utils-test-support-0.11.0-SNAPSHOT.jar>
to org.apache.brooklyn/brooklyn-utils-test-support/0.11.0-SNAPSHOT/brooklyn-utils-test-support-0.11.0-SNAPSHOT.jar
[JENKINS] Archiving <https://builds.apache.org/job/brooklyn-server-master/ws/utils/test-support/target/brooklyn-utils-test-support-0.11.0-SNAPSHOT-sources.jar>
to org.apache.brooklyn/brooklyn-utils-test-support/0.11.0-SNAPSHOT/brooklyn-utils-test-support-0.11.0-SNAPSHOT-sources.jar
[JENKINS] Archiving <https://builds.apache.org/job/brooklyn-server-master/ws/utils/test-support/target/brooklyn-utils-test-support-0.11.0-SNAPSHOT-test-sources.jar>
to org.apache.brooklyn/brooklyn-utils-test-support/0.11.0-SNAPSHOT/brooklyn-utils-test-support-0.11.0-SNAPSHOT-test-sources.jar
[JENKINS] Archiving <https://builds.apache.org/job/brooklyn-server-master/ws/software/base/pom.xml>
to org.apache.brooklyn/brooklyn-software-base/0.11.0-SNAPSHOT/brooklyn-software-base-0.11.0-SNAPSHOT.pom
[JENKINS] Archiving <https://builds.apache.org/job/brooklyn-server-master/ws/software/base/target/brooklyn-software-base-0.11.0-SNAPSHOT.jar>
to org.apache.brooklyn/brooklyn-software-base/0.11.0-SNAPSHOT/brooklyn-software-base-0.11.0-SNAPSHOT.jar
[JENKINS] Archiving <https://builds.apache.org/job/brooklyn-server-master/ws/software/base/target/brooklyn-software-base-0.11.0-SNAPSHOT-tests.jar>
to org.apache.brooklyn/brooklyn-software-base/0.11.0-SNAPSHOT/brooklyn-software-base-0.11.0-SNAPSHOT-tests.jar
[JENKINS] Archiving <https://builds.apache.org/job/brooklyn-server-master/ws/software/base/target/brooklyn-software-base-0.11.0-SNAPSHOT-sources.jar>
to org.apache.brooklyn/brooklyn-software-base/0.11.0-SNAPSHOT/brooklyn-software-base-0.11.0-SNAPSHOT-sources.jar
[JENKINS] Archiving <https://builds.apache.org/job/brooklyn-server-master/ws/software/base/target/brooklyn-software-base-0.11.0-SNAPSHOT-test-sources.jar>
to org.apache.brooklyn/brooklyn-software-base/0.11.0-SNAPSHOT/brooklyn-software-base-0.11.0-SNAPSHOT-test-sources.jar
[JENKINS] Archiving <https://builds.apache.org/job/brooklyn-server-master/ws/utils/groovy/pom.xml>
to org.apache.brooklyn/brooklyn-utils-groovy/0.11.0-SNAPSHOT/brooklyn-utils-groovy-0.11.0-SNAPSHOT.pom
[JENKINS] Archiving <https://builds.apache.org/job/brooklyn-server-master/ws/utils/groovy/target/brooklyn-utils-groovy-0.11.0-SNAPSHOT.jar>
to org.apache.brooklyn/brooklyn-utils-groovy/0.11.0-SNAPSHOT/brooklyn-utils-groovy-0.11.0-SNAPSHOT.jar
[JENKINS] Archiving <https://builds.apache.org/job/brooklyn-server-master/ws/utils/groovy/target/brooklyn-utils-groovy-0.11.0-SNAPSHOT-tests.jar>
to org.apache.brooklyn/brooklyn-utils-groovy/0.11.0-SNAPSHOT/brooklyn-utils-groovy-0.11.0-SNAPSHOT-tests.jar
[JENKINS] Archiving <https://builds.apache.org/job/brooklyn-server-master/ws/utils/groovy/target/brooklyn-utils-groovy-0.11.0-SNAPSHOT-sources.jar>
to org.apache.brooklyn/brooklyn-utils-groovy/0.11.0-SNAPSHOT/brooklyn-utils-groovy-0.11.0-SNAPSHOT-sources.jar
[JENKINS] Archiving <https://builds.apache.org/job/brooklyn-server-master/ws/utils/groovy/target/brooklyn-utils-groovy-0.11.0-SNAPSHOT-test-sources.jar>
to org.apache.brooklyn/brooklyn-utils-groovy/0.11.0-SNAPSHOT/brooklyn-utils-groovy-0.11.0-SNAPSHOT-test-sources.jar
[JENKINS] Archiving <https://builds.apache.org/job/brooklyn-server-master/ws/utils/rest-swagger/pom.xml>
to org.apache.brooklyn/brooklyn-utils-rest-swagger/0.11.0-SNAPSHOT/brooklyn-utils-rest-swagger-0.11.0-SNAPSHOT.pom
[JENKINS] Archiving <https://builds.apache.org/job/brooklyn-server-master/ws/utils/rest-swagger/target/brooklyn-utils-rest-swagger-0.11.0-SNAPSHOT.jar>
to org.apache.brooklyn/brooklyn-utils-rest-swagger/0.11.0-SNAPSHOT/brooklyn-utils-rest-swagger-0.11.0-SNAPSHOT.jar
[JENKINS] Archiving <https://builds.apache.org/job/brooklyn-server-master/ws/utils/rest-swagger/target/brooklyn-utils-rest-swagger-0.11.0-SNAPSHOT-sources.jar>
to org.apache.brooklyn/brooklyn-utils-rest-swagger/0.11.0-SNAPSHOT/brooklyn-utils-rest-swagger-0.11.0-SNAPSHOT-sources.jar
[JENKINS] Archiving <https://builds.apache.org/job/brooklyn-server-master/ws/utils/rest-swagger/target/brooklyn-utils-rest-swagger-0.11.0-SNAPSHOT-test-sources.jar>
to org.apache.brooklyn/brooklyn-utils-rest-swagger/0.11.0-SNAPSHOT/brooklyn-utils-rest-swagger-0.11.0-SNAPSHOT-test-sources.jar
[JENKINS] Archiving <https://builds.apache.org/job/brooklyn-server-master/ws/launcher-common/pom.xml>
to org.apache.brooklyn/brooklyn-launcher-common/0.11.0-SNAPSHOT/brooklyn-launcher-common-0.11.0-SNAPSHOT.pom
[JENKINS] Archiving <https://builds.apache.org/job/brooklyn-server-master/ws/camp/camp-base/pom.xml>
to org.apache.brooklyn.camp/camp-base/0.11.0-SNAPSHOT/camp-base-0.11.0-SNAPSHOT.pom
[JENKINS] Archiving <https://builds.apache.org/job/brooklyn-server-master/ws/camp/camp-base/target/camp-base-0.11.0-SNAPSHOT.jar>
to org.apache.brooklyn.camp/camp-base/0.11.0-SNAPSHOT/camp-base-0.11.0-SNAPSHOT.jar
[JENKINS] Archiving <https://builds.apache.org/job/brooklyn-server-master/ws/camp/camp-base/target/camp-base-0.11.0-SNAPSHOT-tests.jar>
to org.apache.brooklyn.camp/camp-base/0.11.0-SNAPSHOT/camp-base-0.11.0-SNAPSHOT-tests.jar
[JENKINS] Archiving <https://builds.apache.org/job/brooklyn-server-master/ws/camp/camp-base/target/camp-base-0.11.0-SNAPSHOT-sources.jar>
to org.apache.brooklyn.camp/camp-base/0.11.0-SNAPSHOT/camp-base-0.11.0-SNAPSHOT-sources.jar
[JENKINS] Archiving <https://builds.apache.org/job/brooklyn-server-master/ws/camp/camp-base/target/camp-base-0.11.0-SNAPSHOT-test-sources.jar>
to org.apache.brooklyn.camp/camp-base/0.11.0-SNAPSHOT/camp-base-0.11.0-SNAPSHOT-test-sources.jar
[JENKINS] Archiving <https://builds.apache.org/job/brooklyn-server-master/ws/camp/camp-brooklyn/pom.xml>
to org.apache.brooklyn/brooklyn-camp/0.11.0-SNAPSHOT/brooklyn-camp-0.11.0-SNAPSHOT.pom
[JENKINS] Archiving <https://builds.apache.org/job/brooklyn-server-master/ws/karaf/jetty-config/pom.xml>
to org.apache.brooklyn/brooklyn-karaf-jetty-config/0.11.0-SNAPSHOT/brooklyn-karaf-jetty-config-0.11.0-SNAPSHOT.pom
[JENKINS] Archiving <https://builds.apache.org/job/brooklyn-server-master/ws/server-cli/pom.xml>
to org.apache.brooklyn/brooklyn-cli/0.11.0-SNAPSHOT/brooklyn-cli-0.11.0-SNAPSHOT.pom
[JENKINS] Archiving <https://builds.apache.org/job/brooklyn-server-master/ws/logging/logback-xml/pom.xml>
to org.apache.brooklyn/brooklyn-logback-xml/0.11.0-SNAPSHOT/brooklyn-logback-xml-0.11.0-SNAPSHOT.pom
[JENKINS] Archiving <https://builds.apache.org/job/brooklyn-server-master/ws/logging/logback-xml/target/brooklyn-logback-xml-0.11.0-SNAPSHOT.jar>
to org.apache.brooklyn/brooklyn-logback-xml/0.11.0-SNAPSHOT/brooklyn-logback-xml-0.11.0-SNAPSHOT.jar
[JENKINS] Archiving <https://builds.apache.org/job/brooklyn-server-master/ws/logging/logback-xml/target/brooklyn-logback-xml-0.11.0-SNAPSHOT-sources.jar>
to org.apache.brooklyn/brooklyn-logback-xml/0.11.0-SNAPSHOT/brooklyn-logback-xml-0.11.0-SNAPSHOT-sources.jar
[JENKINS] Archiving <https://builds.apache.org/job/brooklyn-server-master/ws/logging/logback-xml/target/brooklyn-logback-xml-0.11.0-SNAPSHOT-test-sources.jar>
to org.apache.brooklyn/brooklyn-logback-xml/0.11.0-SNAPSHOT/brooklyn-logback-xml-0.11.0-SNAPSHOT-test-sources.jar
[JENKINS] Archiving <https://builds.apache.org/job/brooklyn-server-master/ws/test-support/pom.xml>
to org.apache.brooklyn/brooklyn-test-support/0.11.0-SNAPSHOT/brooklyn-test-support-0.11.0-SNAPSHOT.pom
[JENKINS] Archiving <https://builds.apache.org/job/brooklyn-server-master/ws/test-support/target/brooklyn-test-support-0.11.0-SNAPSHOT.jar>
to org.apache.brooklyn/brooklyn-test-support/0.11.0-SNAPSHOT/brooklyn-test-support-0.11.0-SNAPSHOT.jar
[JENKINS] Archiving <https://builds.apache.org/job/brooklyn-server-master/ws/test-support/target/brooklyn-test-support-0.11.0-SNAPSHOT-sources.jar>
to org.apache.brooklyn/brooklyn-test-support/0.11.0-SNAPSHOT/brooklyn-test-support-0.11.0-SNAPSHOT-sources.jar
[JENKINS] Archiving <https://builds.apache.org/job/brooklyn-server-master/ws/test-support/target/brooklyn-test-support-0.11.0-SNAPSHOT-test-sources.jar>
to org.apache.brooklyn/brooklyn-test-support/0.11.0-SNAPSHOT/brooklyn-test-support-0.11.0-SNAPSHOT-test-sources.jar
[JENKINS] Archiving <https://builds.apache.org/job/brooklyn-server-master/ws/rest/rest-server/pom.xml>
to org.apache.brooklyn/brooklyn-rest-server/0.11.0-SNAPSHOT/brooklyn-rest-server-0.11.0-SNAPSHOT.pom
[JENKINS] Archiving <https://builds.apache.org/job/brooklyn-server-master/ws/api/pom.xml>
to org.apache.brooklyn/brooklyn-api/0.11.0-SNAPSHOT/brooklyn-api-0.11.0-SNAPSHOT.pom
[JENKINS] Archiving <https://builds.apache.org/job/brooklyn-server-master/ws/api/target/brooklyn-api-0.11.0-SNAPSHOT.jar>
to org.apache.brooklyn/brooklyn-api/0.11.0-SNAPSHOT/brooklyn-api-0.11.0-SNAPSHOT.jar
[JENKINS] Archiving <https://builds.apache.org/job/brooklyn-server-master/ws/api/target/brooklyn-api-0.11.0-SNAPSHOT-sources.jar>
to org.apache.brooklyn/brooklyn-api/0.11.0-SNAPSHOT/brooklyn-api-0.11.0-SNAPSHOT-sources.jar
[JENKINS] Archiving <https://builds.apache.org/job/brooklyn-server-master/ws/api/target/brooklyn-api-0.11.0-SNAPSHOT-test-sources.jar>
to org.apache.brooklyn/brooklyn-api/0.11.0-SNAPSHOT/brooklyn-api-0.11.0-SNAPSHOT-test-sources.jar
[JENKINS] Archiving <https://builds.apache.org/job/brooklyn-server-master/ws/pom.xml>
to org.apache.brooklyn/brooklyn-server/0.11.0-SNAPSHOT/brooklyn-server-0.11.0-SNAPSHOT.pom
[JENKINS] Archiving <https://builds.apache.org/job/brooklyn-server-master/ws/locations/jclouds/pom.xml>
to org.apache.brooklyn/brooklyn-locations-jclouds/0.11.0-SNAPSHOT/brooklyn-locations-jclouds-0.11.0-SNAPSHOT.pom
[JENKINS] Archiving <https://builds.apache.org/job/brooklyn-server-master/ws/locations/jclouds/target/brooklyn-locations-jclouds-0.11.0-SNAPSHOT.jar>
to org.apache.brooklyn/brooklyn-locations-jclouds/0.11.0-SNAPSHOT/brooklyn-locations-jclouds-0.11.0-SNAPSHOT.jar
[JENKINS] Archiving <https://builds.apache.org/job/brooklyn-server-master/ws/locations/jclouds/target/brooklyn-locations-jclouds-0.11.0-SNAPSHOT-tests.jar>
to org.apache.brooklyn/brooklyn-locations-jclouds/0.11.0-SNAPSHOT/brooklyn-locations-jclouds-0.11.0-SNAPSHOT-tests.jar
[JENKINS] Archiving <https://builds.apache.org/job/brooklyn-server-master/ws/locations/jclouds/target/brooklyn-locations-jclouds-0.11.0-SNAPSHOT-sources.jar>
to org.apache.brooklyn/brooklyn-locations-jclouds/0.11.0-SNAPSHOT/brooklyn-locations-jclouds-0.11.0-SNAPSHOT-sources.jar
[JENKINS] Archiving <https://builds.apache.org/job/brooklyn-server-master/ws/locations/jclouds/target/brooklyn-locations-jclouds-0.11.0-SNAPSHOT-test-sources.jar>
to org.apache.brooklyn/brooklyn-locations-jclouds/0.11.0-SNAPSHOT/brooklyn-locations-jclouds-0.11.0-SNAPSHOT-test-sources.jar
[JENKINS] Archiving <https://builds.apache.org/job/brooklyn-server-master/ws/utils/common/pom.xml>
to org.apache.brooklyn/brooklyn-utils-common/0.11.0-SNAPSHOT/brooklyn-utils-common-0.11.0-SNAPSHOT.pom
[JENKINS] Archiving <https://builds.apache.org/job/brooklyn-server-master/ws/utils/common/target/brooklyn-utils-common-0.11.0-SNAPSHOT.jar>
to org.apache.brooklyn/brooklyn-utils-common/0.11.0-SNAPSHOT/brooklyn-utils-common-0.11.0-SNAPSHOT.jar
[JENKINS] Archiving <https://builds.apache.org/job/brooklyn-server-master/ws/utils/common/target/brooklyn-utils-common-0.11.0-SNAPSHOT-tests.jar>
to org.apache.brooklyn/brooklyn-utils-common/0.11.0-SNAPSHOT/brooklyn-utils-common-0.11.0-SNAPSHOT-tests.jar
[JENKINS] Archiving <https://builds.apache.org/job/brooklyn-server-master/ws/utils/common/target/brooklyn-utils-common-0.11.0-SNAPSHOT-sources.jar>
to org.apache.brooklyn/brooklyn-utils-common/0.11.0-SNAPSHOT/brooklyn-utils-common-0.11.0-SNAPSHOT-sources.jar
[JENKINS] Archiving <https://builds.apache.org/job/brooklyn-server-master/ws/utils/common/target/brooklyn-utils-common-0.11.0-SNAPSHOT-test-sources.jar>
to org.apache.brooklyn/brooklyn-utils-common/0.11.0-SNAPSHOT/brooklyn-utils-common-0.11.0-SNAPSHOT-test-sources.jar
[JENKINS] Archiving <https://builds.apache.org/job/brooklyn-server-master/ws/karaf/features/pom.xml>
to org.apache.brooklyn/brooklyn-features/0.11.0-SNAPSHOT/brooklyn-features-0.11.0-SNAPSHOT.pom
[JENKINS] Archiving <https://builds.apache.org/job/brooklyn-server-master/ws/rest/rest-api/pom.xml>
to org.apache.brooklyn/brooklyn-rest-api/0.11.0-SNAPSHOT/brooklyn-rest-api-0.11.0-SNAPSHOT.pom
[JENKINS] Archiving <https://builds.apache.org/job/brooklyn-server-master/ws/utils/jmx/jmxrmi-agent/pom.xml>
to org.apache.brooklyn/brooklyn-jmxrmi-agent/0.11.0-SNAPSHOT/brooklyn-jmxrmi-agent-0.11.0-SNAPSHOT.pom
[JENKINS] Archiving <https://builds.apache.org/job/brooklyn-server-master/ws/utils/jmx/jmxrmi-agent/target/brooklyn-jmxrmi-agent-0.11.0-SNAPSHOT.jar>
to org.apache.brooklyn/brooklyn-jmxrmi-agent/0.11.0-SNAPSHOT/brooklyn-jmxrmi-agent-0.11.0-SNAPSHOT.jar
[JENKINS] Archiving <https://builds.apache.org/job/brooklyn-server-master/ws/utils/jmx/jmxrmi-agent/target/brooklyn-jmxrmi-agent-0.11.0-SNAPSHOT-tests.jar>
to org.apache.brooklyn/brooklyn-jmxrmi-agent/0.11.0-SNAPSHOT/brooklyn-jmxrmi-agent-0.11.0-SNAPSHOT-tests.jar
[JENKINS] Archiving <https://builds.apache.org/job/brooklyn-server-master/ws/utils/jmx/jmxrmi-agent/target/brooklyn-jmxrmi-agent-0.11.0-SNAPSHOT-sources.jar>
to org.apache.brooklyn/brooklyn-jmxrmi-agent/0.11.0-SNAPSHOT/brooklyn-jmxrmi-agent-0.11.0-SNAPSHOT-sources.jar
[JENKINS] Archiving <https://builds.apache.org/job/brooklyn-server-master/ws/utils/jmx/jmxrmi-agent/target/brooklyn-jmxrmi-agent-0.11.0-SNAPSHOT-test-sources.jar>
to org.apache.brooklyn/brooklyn-jmxrmi-agent/0.11.0-SNAPSHOT/brooklyn-jmxrmi-agent-0.11.0-SNAPSHOT-test-sources.jar
[JENKINS] Archiving <https://builds.apache.org/job/brooklyn-server-master/ws/policy/pom.xml>
to org.apache.brooklyn/brooklyn-policy/0.11.0-SNAPSHOT/brooklyn-policy-0.11.0-SNAPSHOT.pom
[JENKINS] Archiving <https://builds.apache.org/job/brooklyn-server-master/ws/policy/target/brooklyn-policy-0.11.0-SNAPSHOT.jar>
to org.apache.brooklyn/brooklyn-policy/0.11.0-SNAPSHOT/brooklyn-policy-0.11.0-SNAPSHOT.jar
[JENKINS] Archiving <https://builds.apache.org/job/brooklyn-server-master/ws/policy/target/brooklyn-policy-0.11.0-SNAPSHOT-tests.jar>
to org.apache.brooklyn/brooklyn-policy/0.11.0-SNAPSHOT/brooklyn-policy-0.11.0-SNAPSHOT-tests.jar
[JENKINS] Archiving <https://builds.apache.org/job/brooklyn-server-master/ws/policy/target/brooklyn-policy-0.11.0-SNAPSHOT-sources.jar>
to org.apache.brooklyn/brooklyn-policy/0.11.0-SNAPSHOT/brooklyn-policy-0.11.0-SNAPSHOT-sources.jar
[JENKINS] Archiving <https://builds.apache.org/job/brooklyn-server-master/ws/policy/target/brooklyn-policy-0.11.0-SNAPSHOT-test-sources.jar>
to org.apache.brooklyn/brooklyn-policy/0.11.0-SNAPSHOT/brooklyn-policy-0.11.0-SNAPSHOT-test-sources.jar
[JENKINS] Archiving <https://builds.apache.org/job/brooklyn-server-master/ws/karaf/init/pom.xml>
to org.apache.brooklyn/brooklyn-karaf-init/0.11.0-SNAPSHOT/brooklyn-karaf-init-0.11.0-SNAPSHOT.pom
[JENKINS] Archiving <https://builds.apache.org/job/brooklyn-server-master/ws/karaf/commands/pom.xml>
to org.apache.brooklyn/brooklyn-commands/0.11.0-SNAPSHOT/brooklyn-commands-0.11.0-SNAPSHOT.pom
[JENKINS] Archiving <https://builds.apache.org/job/brooklyn-server-master/ws/storage/hazelcast/pom.xml>
to org.apache.brooklyn/brooklyn-storage-hazelcast/0.11.0-SNAPSHOT/brooklyn-storage-hazelcast-0.11.0-SNAPSHOT.pom
[JENKINS] Archiving <https://builds.apache.org/job/brooklyn-server-master/ws/logging/logback-includes/pom.xml>
to org.apache.brooklyn/brooklyn-logback-includes/0.11.0-SNAPSHOT/brooklyn-logback-includes-0.11.0-SNAPSHOT.pom
[JENKINS] Archiving <https://builds.apache.org/job/brooklyn-server-master/ws/logging/logback-includes/target/brooklyn-logback-includes-0.11.0-SNAPSHOT.jar>
to org.apache.brooklyn/brooklyn-logback-includes/0.11.0-SNAPSHOT/brooklyn-logback-includes-0.11.0-SNAPSHOT.jar
[JENKINS] Archiving <https://builds.apache.org/job/brooklyn-server-master/ws/logging/logback-includes/target/brooklyn-logback-includes-0.11.0-SNAPSHOT-sources.jar>
to org.apache.brooklyn/brooklyn-logback-includes/0.11.0-SNAPSHOT/brooklyn-logback-includes-0.11.0-SNAPSHOT-sources.jar
[JENKINS] Archiving <https://builds.apache.org/job/brooklyn-server-master/ws/logging/logback-includes/target/brooklyn-logback-includes-0.11.0-SNAPSHOT-test-sources.jar>
to org.apache.brooklyn/brooklyn-logback-includes/0.11.0-SNAPSHOT/brooklyn-logback-includes-0.11.0-SNAPSHOT-test-sources.jar
[JENKINS] Archiving <https://builds.apache.org/job/brooklyn-server-master/ws/rest/rest-resources/pom.xml>
to org.apache.brooklyn/brooklyn-rest-resources/0.11.0-SNAPSHOT/brooklyn-rest-resources-0.11.0-SNAPSHOT.pom
[JENKINS] Archiving <https://builds.apache.org/job/brooklyn-server-master/ws/utils/jmx/jmxmp-ssl-agent/pom.xml>
to org.apache.brooklyn/brooklyn-jmxmp-agent/0.11.0-SNAPSHOT/brooklyn-jmxmp-agent-0.11.0-SNAPSHOT.pom
[JENKINS] Archiving <https://builds.apache.org/job/brooklyn-server-master/ws/utils/jmx/jmxmp-ssl-agent/target/brooklyn-jmxmp-agent-0.11.0-SNAPSHOT.jar>
to org.apache.brooklyn/brooklyn-jmxmp-agent/0.11.0-SNAPSHOT/brooklyn-jmxmp-agent-0.11.0-SNAPSHOT.jar
[JENKINS] Archiving <https://builds.apache.org/job/brooklyn-server-master/ws/utils/jmx/jmxmp-ssl-agent/target/brooklyn-jmxmp-agent-0.11.0-SNAPSHOT-tests.jar>
to org.apache.brooklyn/brooklyn-jmxmp-agent/0.11.0-SNAPSHOT/brooklyn-jmxmp-agent-0.11.0-SNAPSHOT-tests.jar
[JENKINS] Archiving <https://builds.apache.org/job/brooklyn-server-master/ws/utils/jmx/jmxmp-ssl-agent/target/brooklyn-jmxmp-agent-shaded-0.11.0-SNAPSHOT.jar>
to org.apache.brooklyn/brooklyn-jmxmp-agent/0.11.0-SNAPSHOT/brooklyn-jmxmp-agent-0.11.0-SNAPSHOT-with-dependencies.jar
[JENKINS] Archiving <https://builds.apache.org/job/brooklyn-server-master/ws/utils/jmx/jmxmp-ssl-agent/target/brooklyn-jmxmp-agent-0.11.0-SNAPSHOT-sources.jar>
to org.apache.brooklyn/brooklyn-jmxmp-agent/0.11.0-SNAPSHOT/brooklyn-jmxmp-agent-0.11.0-SNAPSHOT-sources.jar
[JENKINS] Archiving <https://builds.apache.org/job/brooklyn-server-master/ws/utils/jmx/jmxmp-ssl-agent/target/brooklyn-jmxmp-agent-0.11.0-SNAPSHOT-test-sources.jar>
to org.apache.brooklyn/brooklyn-jmxmp-agent/0.11.0-SNAPSHOT/brooklyn-jmxmp-agent-0.11.0-SNAPSHOT-test-sources.jar
[JENKINS] Archiving <https://builds.apache.org/job/brooklyn-server-master/ws/parent/pom.xml>
to org.apache.brooklyn/brooklyn-parent/0.11.0-SNAPSHOT/brooklyn-parent-0.11.0-SNAPSHOT.pom
Compressed 80.51 KB of artifacts by 79.5% relative to #473
[JENKINS] Archiving <https://builds.apache.org/job/brooklyn-server-master/ws/software/winrm/pom.xml>
to org.apache.brooklyn/brooklyn-software-winrm/0.11.0-SNAPSHOT/brooklyn-software-winrm-0.11.0-SNAPSHOT.pom
[JENKINS] Archiving <https://builds.apache.org/job/brooklyn-server-master/ws/software/winrm/target/brooklyn-software-winrm-0.11.0-SNAPSHOT.jar>
to org.apache.brooklyn/brooklyn-software-winrm/0.11.0-SNAPSHOT/brooklyn-software-winrm-0.11.0-SNAPSHOT.jar
[JENKINS] Archiving <https://builds.apache.org/job/brooklyn-server-master/ws/software/winrm/target/brooklyn-software-winrm-0.11.0-SNAPSHOT-tests.jar>
to org.apache.brooklyn/brooklyn-software-winrm/0.11.0-SNAPSHOT/brooklyn-software-winrm-0.11.0-SNAPSHOT-tests.jar
[JENKINS] Archiving <https://builds.apache.org/job/brooklyn-server-master/ws/software/winrm/target/brooklyn-software-winrm-0.11.0-SNAPSHOT-sources.jar>
to org.apache.brooklyn/brooklyn-software-winrm/0.11.0-SNAPSHOT/brooklyn-software-winrm-0.11.0-SNAPSHOT-sources.jar
[JENKINS] Archiving <https://builds.apache.org/job/brooklyn-server-master/ws/software/winrm/target/brooklyn-software-winrm-0.11.0-SNAPSHOT-test-sources.jar>
to org.apache.brooklyn/brooklyn-software-winrm/0.11.0-SNAPSHOT/brooklyn-software-winrm-0.11.0-SNAPSHOT-test-sources.jar
channel stopped

Mime
View raw message