brooklyn-dev mailing list archives

Site index · List index
Message view « Date » · « Thread »
Top « Date » · « Thread »
From Apache Jenkins Server <jenk...@builds.apache.org>
Subject Build failed in Jenkins: brooklyn-master-build #865
Date Mon, 27 Feb 2017 13:47:18 GMT
See <https://builds.apache.org/job/brooklyn-master-build/865/display/redirect>

------------------------------------------
[...truncated 252.88 KB...]
2017-02-27 13:40:48,565 INFO  TESTNG INVOKING: "Surefire test" - org.apache.brooklyn.util.text.QuotedStringTokenizerTest.testTokenizing()
2017-02-27 13:40:48,566 INFO  TESTNG PASSED: "Surefire test" - org.apache.brooklyn.util.text.QuotedStringTokenizerTest.testTokenizing()
finished in 1 ms
2017-02-27 13:40:48,566 INFO  TESTNG INVOKING: "Surefire test" - org.apache.brooklyn.util.text.QuotedStringTokenizerTest.testTokenizingBuilder()
2017-02-27 13:40:48,567 INFO  TESTNG PASSED: "Surefire test" - org.apache.brooklyn.util.text.QuotedStringTokenizerTest.testTokenizingBuilder()
finished in 1 ms
2017-02-27 13:40:48,567 INFO  TESTNG INVOKING: "Surefire test" - org.apache.brooklyn.util.text.StringPredicatesTest.testContainsLiteral()
2017-02-27 13:40:48,567 INFO  TESTNG PASSED: "Surefire test" - org.apache.brooklyn.util.text.StringPredicatesTest.testContainsLiteral()
finished in 0 ms
2017-02-27 13:40:48,567 INFO  TESTNG INVOKING: "Surefire test" - org.apache.brooklyn.util.text.StringPredicatesTest.testEqualToAny()
2017-02-27 13:40:48,568 INFO  TESTNG PASSED: "Surefire test" - org.apache.brooklyn.util.text.StringPredicatesTest.testEqualToAny()
finished in 1 ms
2017-02-27 13:40:48,568 INFO  TESTNG INVOKING: "Surefire test" - org.apache.brooklyn.util.text.StringPredicatesTest.testIsBlank()
2017-02-27 13:40:48,569 INFO  TESTNG PASSED: "Surefire test" - org.apache.brooklyn.util.text.StringPredicatesTest.testIsBlank()
finished in 1 ms
2017-02-27 13:40:48,570 INFO  TESTNG INVOKING: "Surefire test" - org.apache.brooklyn.util.text.StringPredicatesTest.testMatches()
2017-02-27 13:40:48,571 INFO  TESTNG PASSED: "Surefire test" - org.apache.brooklyn.util.text.StringPredicatesTest.testMatches()
finished in 2 ms
2017-02-27 13:40:48,571 INFO  TESTNG INVOKING: "Surefire test" - org.apache.brooklyn.util.text.StringPredicatesTest.testStartsWith()
2017-02-27 13:40:48,572 INFO  TESTNG PASSED: "Surefire test" - org.apache.brooklyn.util.text.StringPredicatesTest.testStartsWith()
finished in 1 ms
2017-02-27 13:40:48,572 INFO  TESTNG INVOKING: "Surefire test" - org.apache.brooklyn.util.JavaGroovyEquivalentsTest.testElvis()
2017-02-27 13:40:48,574 INFO  TESTNG PASSED: "Surefire test" - org.apache.brooklyn.util.JavaGroovyEquivalentsTest.testElvis()
finished in 2 ms
2017-02-27 13:40:48,574 INFO  TESTNG INVOKING: "Surefire test" - org.apache.brooklyn.util.JavaGroovyEquivalentsTest.testTruth()
2017-02-27 13:40:48,574 INFO  TESTNG PASSED: "Surefire test" - org.apache.brooklyn.util.JavaGroovyEquivalentsTest.testTruth()
finished in 0 ms
2017-02-27 13:40:48,575 INFO  TESTNG INVOKING: "Surefire test" - org.apache.brooklyn.test.AssertsTest.testAssertReturnsEventually()
2017-02-27 13:40:48,576 INFO  TESTNG PASSED: "Surefire test" - org.apache.brooklyn.test.AssertsTest.testAssertReturnsEventually()
finished in 1 ms
2017-02-27 13:40:48,577 INFO  TESTNG INVOKING: "Surefire test" - org.apache.brooklyn.test.AssertsTest.testAssertReturnsEventuallyPropagatesException()
Exception in thread "assertReturnsEventually(org.apache.brooklyn.test.AssertsTest$4@366913d0)"
java.lang.IllegalStateException: Simulating failure
	at org.apache.brooklyn.test.AssertsTest$4.run(AssertsTest.java:92)
	at org.apache.brooklyn.test.Asserts$3.run(Asserts.java:1117)
	at java.lang.Thread.run(Thread.java:745)
2017-02-27 13:40:48,578 INFO  TESTNG PASSED: "Surefire test" - org.apache.brooklyn.test.AssertsTest.testAssertReturnsEventuallyPropagatesException()
finished in 1 ms
2017-02-27 13:40:48,579 INFO  TESTNG INVOKING: "Surefire test" - org.apache.brooklyn.test.AssertsTest.testAssertReturnsEventuallyTimesOut()
2017-02-27 13:40:48,594 INFO  TESTNG PASSED: "Surefire test" - org.apache.brooklyn.test.AssertsTest.testAssertReturnsEventuallyTimesOut()
finished in 15 ms
2017-02-27 13:40:48,595 INFO  TESTNG INVOKING: "Surefire test" - org.apache.brooklyn.test.AssertsTest.testAssertStrings()
2017-02-27 13:40:48,595 INFO  TESTNG PASSED: "Surefire test" - org.apache.brooklyn.test.AssertsTest.testAssertStrings()
finished in 0 ms
2017-02-27 13:40:48,595 INFO  TESTNG INVOKING: "Surefire test" - org.apache.brooklyn.test.AssertsTest.testExpectedFailures()
2017-02-27 13:40:48,596 WARN  Detail of unexpected error: java.lang.IllegalStateException
java.lang.IllegalStateException: null
	at org.apache.brooklyn.test.AssertsTest.testExpectedFailures(AssertsTest.java:140) [test-classes/:na]
2017-02-27 13:40:48,597 INFO  TESTNG PASSED: "Surefire test" - org.apache.brooklyn.test.AssertsTest.testExpectedFailures()
finished in 2 ms
2017-02-27 13:40:48,597 INFO  TESTNG INVOKING: "Surefire test" - org.apache.brooklyn.test.AssertsTest.testShouldHaveFailed()
2017-02-27 13:40:48,598 INFO  TESTNG PASSED: "Surefire test" - org.apache.brooklyn.test.AssertsTest.testShouldHaveFailed()
finished in 1 ms
2017-02-27 13:40:48,598 INFO  TESTNG INVOKING: "Surefire test" - org.apache.brooklyn.test.AssertsTest.testSucceedsEventually()
2017-02-27 13:40:48,599 INFO  TESTNG PASSED: "Surefire test" - org.apache.brooklyn.test.AssertsTest.testSucceedsEventually()
finished in 1 ms
2017-02-27 13:40:48,704 INFO  TESTNG 
===============================================
    Surefire test
    Tests run: 533, Failures: 1, Skips: 0
===============================================
[GC 210156K->7723K(753664K), 0.0269800 secs]
2017-02-27 13:40:48,732 INFO  BrooklynLeakListener.onFinish attempting to terminate all extant
ManagementContexts: name=Surefire test; includedGroups=[]; excludedGroups=[Integration, Live-sanity,
Acceptance, Live, Broken, WIP]; suiteName=Surefire suite; outDir=<https://builds.apache.org/job/brooklyn-master-build/ws/brooklyn-server/utils/common/target/surefire-reports/Surefire>
suite: no org.apache.brooklyn.core.mgmt.internal.LocalManagementContext available, so skipped
Tests run: 533, Failures: 1, Errors: 0, Skipped: 0, Time elapsed: 8.527 sec <<< FAILURE!
- in TestSuite
testGetReachableSockets(org.apache.brooklyn.util.net.ReachableSocketFinderTest)  Time elapsed:
0.158 sec  <<< FAILURE!
java.lang.AssertionError: expected=[1.1.1.1:1111, 1.1.1.3:1113], actual=[1.1.1.1:1111]: Expected
iterator returned more elements than the actual iterator.
	at org.apache.brooklyn.util.net.ReachableSocketFinderTest.testGetReachableSockets(ReachableSocketFinderTest.java:132)


Results :

Failed tests: 
  ReachableSocketFinderTest.testGetReachableSockets:132 expected=[1.1.1.1:1111, 1.1.1.3:1113],
actual=[1.1.1.1:1111]: Expected iterator returned more elements than the actual iterator.

Tests run: 533, Failures: 1, Errors: 0, Skipped: 0

[JENKINS] Recording test results
[INFO] ------------------------------------------------------------------------
[INFO] Reactor Summary:
[INFO] 
[INFO] Brooklyn REST JavaScript Web GUI ................... SUCCESS [01:38 min]
[INFO] Brooklyn Server Root ............................... SUCCESS [  1.532 s]
[INFO] Brooklyn Parent Project ............................ SUCCESS [  6.813 s]
[INFO] Brooklyn Test Support Utilities .................... SUCCESS [ 10.419 s]
[INFO] Brooklyn Logback Includable Configuration .......... SUCCESS [  6.013 s]
[INFO] Brooklyn Common Utilities .......................... FAILURE [ 28.519 s]
[INFO] Brooklyn API ....................................... SKIPPED
[INFO] CAMP Server Parent Project ......................... SKIPPED
[INFO] CAMP Base .......................................... SKIPPED
[INFO] Brooklyn Test Support .............................. SKIPPED
[INFO] Brooklyn REST Swagger Apidoc Utilities ............. SKIPPED
[INFO] Brooklyn Logback Configuration ..................... SKIPPED
[INFO] CAMP Server ........................................ SKIPPED
[INFO] Brooklyn Felix Runtime ............................. SKIPPED
[INFO] Brooklyn Groovy Utilities .......................... SKIPPED
[INFO] Brooklyn Core ...................................... SKIPPED
[INFO] Brooklyn Policies .................................. SKIPPED
[INFO] Brooklyn WinRM Software Entities ................... SKIPPED
[INFO] Brooklyn Secure JMXMP Agent ........................ SKIPPED
[INFO] Brooklyn JMX RMI Agent ............................. SKIPPED
[INFO] Brooklyn Jclouds Location Targets .................. SKIPPED
[INFO] Brooklyn Software Base ............................. SKIPPED
[INFO] Brooklyn CAMP ...................................... SKIPPED
[INFO] Brooklyn Hazelcast Storage ......................... SKIPPED
[INFO] Brooklyn Launcher Common ........................... SKIPPED
[INFO] Brooklyn REST API .................................. SKIPPED
[INFO] Brooklyn REST Resources ............................ SKIPPED
[INFO] Brooklyn REST Server ............................... SKIPPED
[INFO] Brooklyn Launcher .................................. SKIPPED
[INFO] Brooklyn Command Line Interface .................... SKIPPED
[INFO] Brooklyn Test Framework ............................ SKIPPED
[INFO] Brooklyn OSGi init ................................. SKIPPED
[INFO] Brooklyn Karaf ..................................... SKIPPED
[INFO] Jetty config fragment .............................. SKIPPED
[INFO] Apache Http Component extension .................... SKIPPED
[INFO] Brooklyn Karaf Features ............................ SKIPPED
[INFO] Brooklyn Karaf Shell Commands ...................... SKIPPED
[INFO] Brooklyn Library Root .............................. SKIPPED
[INFO] Brooklyn CM SaltStack .............................. SKIPPED
[INFO] Brooklyn CM Ansible ................................ SKIPPED
[INFO] Brooklyn CM Integration Root ....................... SKIPPED
[INFO] Brooklyn Network Software Entities ................. SKIPPED
[INFO] Brooklyn OSGi Software Entities .................... SKIPPED
[INFO] Brooklyn Database Software Entities ................ SKIPPED
[INFO] Brooklyn Web App Software Entities ................. SKIPPED
[INFO] Brooklyn Messaging Software Entities ............... SKIPPED
[INFO] Brooklyn NoSQL Data Store Software Entities ........ SKIPPED
[INFO] Brooklyn Monitoring Software Entities .............. SKIPPED
[INFO] Brooklyn QA ........................................ SKIPPED
[INFO] Brooklyn Examples Aggregator Project ............... SKIPPED
[INFO] Brooklyn Examples Aggregator Project - Webapps ..... SKIPPED
[INFO] hello-world-webapp Maven Webapp .................... SKIPPED
[INFO] hello-world-sql-webapp Maven Webapp ................ SKIPPED
[INFO] Brooklyn Simple Web Cluster Example ................ SKIPPED
[INFO] Brooklyn Global Web Fabric Example ................. SKIPPED
[INFO] Brooklyn Simple Messaging Publish-Subscribe Example  SKIPPED
[INFO] Brooklyn NoSQL Cluster Examples .................... SKIPPED
[INFO] Brooklyn Library Karaf integration ................. SKIPPED
[INFO] Brooklyn Library Catalog ........................... SKIPPED
[INFO] Brooklyn Library Karaf Features .................... SKIPPED
[INFO] Brooklyn Client .................................... SKIPPED
[INFO] Brooklyn Client Command Line Interface ............. SKIPPED
[INFO] Brooklyn REST java Client .......................... SKIPPED
[INFO] Brooklyn Downstream Project Parent ................. SKIPPED
[INFO] Brooklyn Dist Root ................................. SKIPPED
[INFO] Brooklyn All Things ................................ SKIPPED
[INFO] Brooklyn Distribution .............................. SKIPPED
[INFO] Brooklyn Karaf Distribution Parent ................. SKIPPED
[INFO] Brooklyn Karaf Server Configuration ................ SKIPPED
[INFO] Brooklyn Dist Karaf Features ....................... SKIPPED
[INFO] Brooklyn Karaf Distribution ........................ SKIPPED
[INFO] Brooklyn Karaf pax-exam itest ...................... SKIPPED
[INFO] Brooklyn Vagrant Getting Started Environment ....... SKIPPED
[INFO] Brooklyn Quick-Start Project Archetype ............. SKIPPED
[INFO] Brooklyn Shared Package Files ...................... SKIPPED
[INFO] Brooklyn DEB Package ............................... SKIPPED
[INFO] Brooklyn Root ...................................... SKIPPED
[INFO] ------------------------------------------------------------------------
[INFO] BUILD FAILURE
[INFO] ------------------------------------------------------------------------
[INFO] Total time: 03:52 min
[INFO] Finished at: 2017-02-27T13:41:54+00:00
[INFO] Final Memory: 94M/477M
[INFO] ------------------------------------------------------------------------
Waiting for Jenkins to finish collecting data
[ERROR] Failed to execute goal org.apache.maven.plugins:maven-surefire-plugin:2.19.1:test
(default-test) on project brooklyn-utils-common: There are test failures.
[ERROR] 
[ERROR] Please refer to <https://builds.apache.org/job/brooklyn-master-build/ws/brooklyn-server/utils/common/target/surefire-reports>
for the individual test results.
[ERROR] -> [Help 1]
[ERROR] 
[ERROR] To see the full stack trace of the errors, re-run Maven with the -e switch.
[ERROR] Re-run Maven using the -X switch to enable full debug logging.
[ERROR] 
[ERROR] For more information about the errors and possible solutions, please read the following
articles:
[ERROR] [Help 1] http://cwiki.apache.org/confluence/display/MAVEN/MojoFailureException
[ERROR] 
[ERROR] After correcting the problems, you can resume the build with the command
[ERROR]   mvn <goals> -rf :brooklyn-utils-common
[JENKINS] Archiving <https://builds.apache.org/job/brooklyn-master-build/ws/brooklyn-library/software/cm/salt/pom.xml>
to org.apache.brooklyn/brooklyn-software-cm-salt/0.11.0-SNAPSHOT/brooklyn-software-cm-salt-0.11.0-SNAPSHOT.pom
[JENKINS] Archiving <https://builds.apache.org/job/brooklyn-master-build/ws/brooklyn-server/core/pom.xml>
to org.apache.brooklyn/brooklyn-core/0.11.0-SNAPSHOT/brooklyn-core-0.11.0-SNAPSHOT.pom
[JENKINS] Archiving <https://builds.apache.org/job/brooklyn-master-build/ws/brooklyn-server/camp/camp-server/pom.xml>
to org.apache.brooklyn.camp/camp-server/0.11.0-SNAPSHOT/camp-server-0.11.0-SNAPSHOT.pom
[JENKINS] Archiving <https://builds.apache.org/job/brooklyn-master-build/ws/brooklyn-server/karaf/pom.xml>
to org.apache.brooklyn/brooklyn-karaf/0.11.0-SNAPSHOT/brooklyn-karaf-0.11.0-SNAPSHOT.pom
[JENKINS] Archiving <https://builds.apache.org/job/brooklyn-master-build/ws/brooklyn-server/karaf/httpcomponent-extension/pom.xml>
to org.apache.brooklyn/brooklyn-karaf-httpcomponents-extension/0.11.0-SNAPSHOT/brooklyn-karaf-httpcomponents-extension-0.11.0-SNAPSHOT.pom
[JENKINS] Archiving <https://builds.apache.org/job/brooklyn-master-build/ws/brooklyn-server/utils/test-support/pom.xml>
to org.apache.brooklyn/brooklyn-utils-test-support/0.11.0-SNAPSHOT/brooklyn-utils-test-support-0.11.0-SNAPSHOT.pom
[JENKINS] Archiving <https://builds.apache.org/job/brooklyn-master-build/ws/brooklyn-server/utils/test-support/target/brooklyn-utils-test-support-0.11.0-SNAPSHOT.jar>
to org.apache.brooklyn/brooklyn-utils-test-support/0.11.0-SNAPSHOT/brooklyn-utils-test-support-0.11.0-SNAPSHOT.jar
[JENKINS] Archiving <https://builds.apache.org/job/brooklyn-master-build/ws/brooklyn-server/utils/test-support/target/brooklyn-utils-test-support-0.11.0-SNAPSHOT-sources.jar>
to org.apache.brooklyn/brooklyn-utils-test-support/0.11.0-SNAPSHOT/brooklyn-utils-test-support-0.11.0-SNAPSHOT-sources.jar
[JENKINS] Archiving <https://builds.apache.org/job/brooklyn-master-build/ws/brooklyn-server/utils/test-support/target/brooklyn-utils-test-support-0.11.0-SNAPSHOT-test-sources.jar>
to org.apache.brooklyn/brooklyn-utils-test-support/0.11.0-SNAPSHOT/brooklyn-utils-test-support-0.11.0-SNAPSHOT-test-sources.jar
[JENKINS] Archiving <https://builds.apache.org/job/brooklyn-master-build/ws/brooklyn-dist/karaf/apache-brooklyn/pom.xml>
to org.apache.brooklyn/apache-brooklyn/0.11.0-SNAPSHOT/apache-brooklyn-0.11.0-SNAPSHOT.pom
[JENKINS] Archiving <https://builds.apache.org/job/brooklyn-master-build/ws/brooklyn-library/software/nosql/pom.xml>
to org.apache.brooklyn/brooklyn-software-nosql/0.11.0-SNAPSHOT/brooklyn-software-nosql-0.11.0-SNAPSHOT.pom
[JENKINS] Archiving <https://builds.apache.org/job/brooklyn-master-build/ws/brooklyn-server/utils/groovy/pom.xml>
to org.apache.brooklyn/brooklyn-utils-groovy/0.11.0-SNAPSHOT/brooklyn-utils-groovy-0.11.0-SNAPSHOT.pom
[JENKINS] Archiving <https://builds.apache.org/job/brooklyn-master-build/ws/brooklyn-server/launcher-common/pom.xml>
to org.apache.brooklyn/brooklyn-launcher-common/0.11.0-SNAPSHOT/brooklyn-launcher-common-0.11.0-SNAPSHOT.pom
[JENKINS] Archiving <https://builds.apache.org/job/brooklyn-master-build/ws/brooklyn-library/examples/webapps/pom.xml>
to org.apache.brooklyn.example/brooklyn-examples-webapps-parent/0.11.0-SNAPSHOT/brooklyn-examples-webapps-parent-0.11.0-SNAPSHOT.pom
[JENKINS] Archiving <https://builds.apache.org/job/brooklyn-master-build/ws/brooklyn-library/examples/simple-web-cluster/pom.xml>
to org.apache.brooklyn.example/brooklyn-example-simple-web-cluster/0.11.0-SNAPSHOT/brooklyn-example-simple-web-cluster-0.11.0-SNAPSHOT.pom
[JENKINS] Archiving <https://builds.apache.org/job/brooklyn-master-build/ws/brooklyn-dist/karaf/itest/pom.xml>
to org.apache.brooklyn/brooklyn-itest/0.11.0-SNAPSHOT/brooklyn-itest-0.11.0-SNAPSHOT.pom
[JENKINS] Archiving <https://builds.apache.org/job/brooklyn-master-build/ws/brooklyn-library/examples/pom.xml>
to org.apache.brooklyn.example/brooklyn-examples-parent/0.11.0-SNAPSHOT/brooklyn-examples-parent-0.11.0-SNAPSHOT.pom
[JENKINS] Archiving <https://builds.apache.org/job/brooklyn-master-build/ws/brooklyn-dist/dist/pom.xml>
to org.apache.brooklyn/brooklyn-dist/0.11.0-SNAPSHOT/brooklyn-dist-0.11.0-SNAPSHOT.pom
[JENKINS] Archiving <https://builds.apache.org/job/brooklyn-master-build/ws/brooklyn-server/camp/camp-base/pom.xml>
to org.apache.brooklyn.camp/camp-base/0.11.0-SNAPSHOT/camp-base-0.11.0-SNAPSHOT.pom
[JENKINS] Archiving <https://builds.apache.org/job/brooklyn-master-build/ws/brooklyn-server/camp/camp-brooklyn/pom.xml>
to org.apache.brooklyn/brooklyn-camp/0.11.0-SNAPSHOT/brooklyn-camp-0.11.0-SNAPSHOT.pom
[JENKINS] Archiving <https://builds.apache.org/job/brooklyn-master-build/ws/brooklyn-server/karaf/jetty-config/pom.xml>
to org.apache.brooklyn/brooklyn-karaf-jetty-config/0.11.0-SNAPSHOT/brooklyn-karaf-jetty-config-0.11.0-SNAPSHOT.pom
[JENKINS] Archiving <https://builds.apache.org/job/brooklyn-master-build/ws/brooklyn-library/pom.xml>
to org.apache.brooklyn/brooklyn-library/0.11.0-SNAPSHOT/brooklyn-library-0.11.0-SNAPSHOT.pom
[JENKINS] Archiving <https://builds.apache.org/job/brooklyn-master-build/ws/brooklyn-library/examples/webapps/hello-world-webapp/pom.xml>
to org.apache.brooklyn.example/brooklyn-example-hello-world-webapp/0.11.0-SNAPSHOT/brooklyn-example-hello-world-webapp-0.11.0-SNAPSHOT.pom
[JENKINS] Archiving <https://builds.apache.org/job/brooklyn-master-build/ws/brooklyn-server/test-support/pom.xml>
to org.apache.brooklyn/brooklyn-test-support/0.11.0-SNAPSHOT/brooklyn-test-support-0.11.0-SNAPSHOT.pom
[JENKINS] Archiving <https://builds.apache.org/job/brooklyn-master-build/ws/brooklyn-server/rest/rest-server/pom.xml>
to org.apache.brooklyn/brooklyn-rest-server/0.11.0-SNAPSHOT/brooklyn-rest-server-0.11.0-SNAPSHOT.pom
[JENKINS] Archiving <https://builds.apache.org/job/brooklyn-master-build/ws/brooklyn-server/utils/common/pom.xml>
to org.apache.brooklyn/brooklyn-utils-common/0.11.0-SNAPSHOT/brooklyn-utils-common-0.11.0-SNAPSHOT.pom
[JENKINS] Archiving <https://builds.apache.org/job/brooklyn-master-build/ws/brooklyn-library/software/webapp/pom.xml>
to org.apache.brooklyn/brooklyn-software-webapp/0.11.0-SNAPSHOT/brooklyn-software-webapp-0.11.0-SNAPSHOT.pom
[JENKINS] Archiving <https://builds.apache.org/job/brooklyn-master-build/ws/brooklyn-server/karaf/features/pom.xml>
to org.apache.brooklyn/brooklyn-features/0.11.0-SNAPSHOT/brooklyn-features-0.11.0-SNAPSHOT.pom
[JENKINS] Archiving <https://builds.apache.org/job/brooklyn-master-build/ws/brooklyn-server/rest/rest-api/pom.xml>
to org.apache.brooklyn/brooklyn-rest-api/0.11.0-SNAPSHOT/brooklyn-rest-api-0.11.0-SNAPSHOT.pom
[JENKINS] Archiving <https://builds.apache.org/job/brooklyn-master-build/ws/brooklyn-server/policy/pom.xml>
to org.apache.brooklyn/brooklyn-policy/0.11.0-SNAPSHOT/brooklyn-policy-0.11.0-SNAPSHOT.pom
[JENKINS] Archiving <https://builds.apache.org/job/brooklyn-master-build/ws/brooklyn-server/logging/logback-includes/pom.xml>
to org.apache.brooklyn/brooklyn-logback-includes/0.11.0-SNAPSHOT/brooklyn-logback-includes-0.11.0-SNAPSHOT.pom
[JENKINS] Archiving <https://builds.apache.org/job/brooklyn-master-build/ws/brooklyn-server/logging/logback-includes/target/brooklyn-logback-includes-0.11.0-SNAPSHOT.jar>
to org.apache.brooklyn/brooklyn-logback-includes/0.11.0-SNAPSHOT/brooklyn-logback-includes-0.11.0-SNAPSHOT.jar
[JENKINS] Archiving <https://builds.apache.org/job/brooklyn-master-build/ws/brooklyn-server/logging/logback-includes/target/brooklyn-logback-includes-0.11.0-SNAPSHOT-sources.jar>
to org.apache.brooklyn/brooklyn-logback-includes/0.11.0-SNAPSHOT/brooklyn-logback-includes-0.11.0-SNAPSHOT-sources.jar
[JENKINS] Archiving <https://builds.apache.org/job/brooklyn-master-build/ws/brooklyn-server/logging/logback-includes/target/brooklyn-logback-includes-0.11.0-SNAPSHOT-test-sources.jar>
to org.apache.brooklyn/brooklyn-logback-includes/0.11.0-SNAPSHOT/brooklyn-logback-includes-0.11.0-SNAPSHOT-test-sources.jar
[JENKINS] Archiving <https://builds.apache.org/job/brooklyn-master-build/ws/brooklyn-server/rest/rest-resources/pom.xml>
to org.apache.brooklyn/brooklyn-rest-resources/0.11.0-SNAPSHOT/brooklyn-rest-resources-0.11.0-SNAPSHOT.pom
[JENKINS] Archiving <https://builds.apache.org/job/brooklyn-master-build/ws/brooklyn-server/utils/jmx/jmxmp-ssl-agent/pom.xml>
to org.apache.brooklyn/brooklyn-jmxmp-agent/0.11.0-SNAPSHOT/brooklyn-jmxmp-agent-0.11.0-SNAPSHOT.pom
[JENKINS] Archiving <https://builds.apache.org/job/brooklyn-master-build/ws/brooklyn-server/software/winrm/pom.xml>
to org.apache.brooklyn/brooklyn-software-winrm/0.11.0-SNAPSHOT/brooklyn-software-winrm-0.11.0-SNAPSHOT.pom
[JENKINS] Archiving <https://builds.apache.org/job/brooklyn-master-build/ws/brooklyn-server/camp/pom.xml>
to org.apache.brooklyn.camp/camp-parent/0.11.0-SNAPSHOT/camp-parent-0.11.0-SNAPSHOT.pom
[JENKINS] Archiving <https://builds.apache.org/job/brooklyn-master-build/ws/brooklyn-server/utils/rt-felix/pom.xml>
to org.apache.brooklyn/brooklyn-rt-felix/0.11.0-SNAPSHOT/brooklyn-rt-felix-0.11.0-SNAPSHOT.pom
[JENKINS] Archiving <https://builds.apache.org/job/brooklyn-master-build/ws/brooklyn-dist/pom.xml>
to org.apache.brooklyn/brooklyn-dist-root/0.11.0-SNAPSHOT/brooklyn-dist-root-0.11.0-SNAPSHOT.pom
[JENKINS] Archiving <https://builds.apache.org/job/brooklyn-master-build/ws/brooklyn-server/test-framework/pom.xml>
to org.apache.brooklyn/brooklyn-test-framework/0.11.0-SNAPSHOT/brooklyn-test-framework-0.11.0-SNAPSHOT.pom
[JENKINS] Archiving <https://builds.apache.org/job/brooklyn-master-build/ws/brooklyn-library/software/osgi/pom.xml>
to org.apache.brooklyn/brooklyn-software-osgi/0.11.0-SNAPSHOT/brooklyn-software-osgi-0.11.0-SNAPSHOT.pom
[JENKINS] Archiving <https://builds.apache.org/job/brooklyn-master-build/ws/brooklyn-library/software/database/pom.xml>
to org.apache.brooklyn/brooklyn-software-database/0.11.0-SNAPSHOT/brooklyn-software-database-0.11.0-SNAPSHOT.pom
[JENKINS] Archiving <https://builds.apache.org/job/brooklyn-master-build/ws/brooklyn-server/launcher/pom.xml>
to org.apache.brooklyn/brooklyn-launcher/0.11.0-SNAPSHOT/brooklyn-launcher-0.11.0-SNAPSHOT.pom
[JENKINS] Archiving <https://builds.apache.org/job/brooklyn-master-build/ws/brooklyn-library/software/messaging/pom.xml>
to org.apache.brooklyn/brooklyn-software-messaging/0.11.0-SNAPSHOT/brooklyn-software-messaging-0.11.0-SNAPSHOT.pom
[JENKINS] Archiving <https://builds.apache.org/job/brooklyn-master-build/ws/brooklyn-library/qa/pom.xml>
to org.apache.brooklyn/brooklyn-qa/0.11.0-SNAPSHOT/brooklyn-qa-0.11.0-SNAPSHOT.pom
[JENKINS] Archiving <https://builds.apache.org/job/brooklyn-master-build/ws/brooklyn-library/software/monitoring/pom.xml>
to org.apache.brooklyn/brooklyn-software-monitoring/0.11.0-SNAPSHOT/brooklyn-software-monitoring-0.11.0-SNAPSHOT.pom
[JENKINS] Archiving <https://builds.apache.org/job/brooklyn-master-build/ws/brooklyn-library/karaf/catalog/pom.xml>
to org.apache.brooklyn/brooklyn-library-catalog/0.11.0-SNAPSHOT/brooklyn-library-catalog-0.11.0-SNAPSHOT.pom
[JENKINS] Archiving <https://builds.apache.org/job/brooklyn-master-build/ws/brooklyn-library/software/cm/pom.xml>
to org.apache.brooklyn/brooklyn-software-cm/0.11.0-SNAPSHOT/brooklyn-software-cm-0.11.0-SNAPSHOT.pom
[JENKINS] Archiving <https://builds.apache.org/job/brooklyn-master-build/ws/brooklyn-library/examples/simple-messaging-pubsub/pom.xml>
to org.apache.brooklyn.example/brooklyn-example-simple-messaging-pubsub/0.11.0-SNAPSHOT/brooklyn-example-simple-messaging-pubsub-0.11.0-SNAPSHOT.pom
[JENKINS] Archiving <https://builds.apache.org/job/brooklyn-master-build/ws/brooklyn-server/software/base/pom.xml>
to org.apache.brooklyn/brooklyn-software-base/0.11.0-SNAPSHOT/brooklyn-software-base-0.11.0-SNAPSHOT.pom
[JENKINS] Archiving <https://builds.apache.org/job/brooklyn-master-build/ws/brooklyn-dist/karaf/config/pom.xml>
to org.apache.brooklyn/brooklyn-dist-config/0.11.0-SNAPSHOT/brooklyn-dist-config-0.11.0-SNAPSHOT.pom
[JENKINS] Archiving <https://builds.apache.org/job/brooklyn-master-build/ws/brooklyn-library/karaf/pom.xml>
to org.apache.brooklyn/brooklyn-library-karaf/0.11.0-SNAPSHOT/brooklyn-library-karaf-0.11.0-SNAPSHOT.pom
[JENKINS] Archiving <https://builds.apache.org/job/brooklyn-master-build/ws/brooklyn-server/utils/rest-swagger/pom.xml>
to org.apache.brooklyn/brooklyn-utils-rest-swagger/0.11.0-SNAPSHOT/brooklyn-utils-rest-swagger-0.11.0-SNAPSHOT.pom
[JENKINS] Archiving <https://builds.apache.org/job/brooklyn-master-build/ws/brooklyn-dist/downstream-parent/pom.xml>
to org.apache.brooklyn/brooklyn-downstream-parent/0.11.0-SNAPSHOT/brooklyn-downstream-parent-0.11.0-SNAPSHOT.pom
[JENKINS] Archiving <https://builds.apache.org/job/brooklyn-master-build/ws/brooklyn-client/java/pom.xml>
to org.apache.brooklyn/brooklyn-rest-client/0.11.0-SNAPSHOT/brooklyn-rest-client-0.11.0-SNAPSHOT.pom
[JENKINS] Archiving <https://builds.apache.org/job/brooklyn-master-build/ws/brooklyn-dist/all/pom.xml>
to org.apache.brooklyn/brooklyn-all/0.11.0-SNAPSHOT/brooklyn-all-0.11.0-SNAPSHOT.pom
[JENKINS] Archiving <https://builds.apache.org/job/brooklyn-master-build/ws/brooklyn-server/server-cli/pom.xml>
to org.apache.brooklyn/brooklyn-cli/0.11.0-SNAPSHOT/brooklyn-cli-0.11.0-SNAPSHOT.pom
[JENKINS] Archiving <https://builds.apache.org/job/brooklyn-master-build/ws/brooklyn-server/logging/logback-xml/pom.xml>
to org.apache.brooklyn/brooklyn-logback-xml/0.11.0-SNAPSHOT/brooklyn-logback-xml-0.11.0-SNAPSHOT.pom
[JENKINS] Archiving <https://builds.apache.org/job/brooklyn-master-build/ws/brooklyn-client/pom.xml>
to org.apache.brooklyn/brooklyn-client/0.11.0-SNAPSHOT/brooklyn-client-0.11.0-SNAPSHOT.pom
[JENKINS] Archiving <https://builds.apache.org/job/brooklyn-master-build/ws/brooklyn-library/software/cm/ansible/pom.xml>
to org.apache.brooklyn/brooklyn-software-cm-ansible/0.11.0-SNAPSHOT/brooklyn-software-cm-ansible-0.11.0-SNAPSHOT.pom
[JENKINS] Archiving <https://builds.apache.org/job/brooklyn-master-build/ws/brooklyn-library/examples/global-web-fabric/pom.xml>
to org.apache.brooklyn.example/brooklyn-example-global-web-fabric/0.11.0-SNAPSHOT/brooklyn-example-global-web-fabric-0.11.0-SNAPSHOT.pom
[JENKINS] Archiving <https://builds.apache.org/job/brooklyn-master-build/ws/brooklyn-dist/archetypes/quickstart/pom.xml>
to org.apache.brooklyn/brooklyn-archetype-quickstart/0.11.0-SNAPSHOT/brooklyn-archetype-quickstart-0.11.0-SNAPSHOT.pom
[JENKINS] Archiving <https://builds.apache.org/job/brooklyn-master-build/ws/brooklyn-server/api/pom.xml>
to org.apache.brooklyn/brooklyn-api/0.11.0-SNAPSHOT/brooklyn-api-0.11.0-SNAPSHOT.pom
[JENKINS] Archiving <https://builds.apache.org/job/brooklyn-master-build/ws/brooklyn-server/pom.xml>
to org.apache.brooklyn/brooklyn-server/0.11.0-SNAPSHOT/brooklyn-server-0.11.0-SNAPSHOT.pom
[JENKINS] Archiving <https://builds.apache.org/job/brooklyn-master-build/ws/brooklyn-library/examples/webapps/hello-world-sql/pom.xml>
to org.apache.brooklyn.example/brooklyn-example-hello-world-sql-webapp/0.11.0-SNAPSHOT/brooklyn-example-hello-world-sql-webapp-0.11.0-SNAPSHOT.pom
[JENKINS] Archiving <https://builds.apache.org/job/brooklyn-master-build/ws/brooklyn-dist/karaf/pom.xml>
to org.apache.brooklyn/brooklyn-dist-karaf/0.11.0-SNAPSHOT/brooklyn-dist-karaf-0.11.0-SNAPSHOT.pom
[JENKINS] Archiving <https://builds.apache.org/job/brooklyn-master-build/ws/brooklyn-server/locations/jclouds/pom.xml>
to org.apache.brooklyn/brooklyn-locations-jclouds/0.11.0-SNAPSHOT/brooklyn-locations-jclouds-0.11.0-SNAPSHOT.pom
[JENKINS] Archiving <https://builds.apache.org/job/brooklyn-master-build/ws/brooklyn-library/software/network/pom.xml>
to org.apache.brooklyn/brooklyn-software-network/0.11.0-SNAPSHOT/brooklyn-software-network-0.11.0-SNAPSHOT.pom
[JENKINS] Archiving <https://builds.apache.org/job/brooklyn-master-build/ws/brooklyn-client/cli/pom.xml>
to org.apache.brooklyn/brooklyn-client-cli/0.11.0-SNAPSHOT/brooklyn-client-cli-0.11.0-SNAPSHOT.pom
[JENKINS] Archiving <https://builds.apache.org/job/brooklyn-master-build/ws/brooklyn-dist/shared-packaging/pom.xml>
to org.apache.brooklyn/shared-packaging/0.11.0-SNAPSHOT/shared-packaging-0.11.0-SNAPSHOT.pom
[JENKINS] Archiving <https://builds.apache.org/job/brooklyn-master-build/ws/brooklyn-server/utils/jmx/jmxrmi-agent/pom.xml>
to org.apache.brooklyn/brooklyn-jmxrmi-agent/0.11.0-SNAPSHOT/brooklyn-jmxrmi-agent-0.11.0-SNAPSHOT.pom
[JENKINS] Archiving <https://builds.apache.org/job/brooklyn-master-build/ws/brooklyn-library/karaf/features/pom.xml>
to org.apache.brooklyn/brooklyn-library-features/0.11.0-SNAPSHOT/brooklyn-library-features-0.11.0-SNAPSHOT.pom
[JENKINS] Archiving <https://builds.apache.org/job/brooklyn-master-build/ws/brooklyn-dist/vagrant/pom.xml>
to org.apache.brooklyn/brooklyn-vagrant/0.11.0-SNAPSHOT/brooklyn-vagrant-0.11.0-SNAPSHOT.pom
[JENKINS] Archiving <https://builds.apache.org/job/brooklyn-master-build/ws/brooklyn-server/karaf/init/pom.xml>
to org.apache.brooklyn/brooklyn-karaf-init/0.11.0-SNAPSHOT/brooklyn-karaf-init-0.11.0-SNAPSHOT.pom
[JENKINS] Archiving <https://builds.apache.org/job/brooklyn-master-build/ws/brooklyn-server/karaf/commands/pom.xml>
to org.apache.brooklyn/brooklyn-commands/0.11.0-SNAPSHOT/brooklyn-commands-0.11.0-SNAPSHOT.pom
[JENKINS] Archiving <https://builds.apache.org/job/brooklyn-master-build/ws/pom.xml>
to org.apache.brooklyn/brooklyn/0.11.0-SNAPSHOT/brooklyn-0.11.0-SNAPSHOT.pom
[JENKINS] Archiving <https://builds.apache.org/job/brooklyn-master-build/ws/brooklyn-server/storage/hazelcast/pom.xml>
to org.apache.brooklyn/brooklyn-storage-hazelcast/0.11.0-SNAPSHOT/brooklyn-storage-hazelcast-0.11.0-SNAPSHOT.pom
[JENKINS] Archiving <https://builds.apache.org/job/brooklyn-master-build/ws/brooklyn-dist/karaf/features/pom.xml>
to org.apache.brooklyn/brooklyn-dist-features/0.11.0-SNAPSHOT/brooklyn-dist-features-0.11.0-SNAPSHOT.pom
[JENKINS] Archiving <https://builds.apache.org/job/brooklyn-master-build/ws/brooklyn-library/examples/simple-nosql-cluster/pom.xml>
to org.apache.brooklyn.example/brooklyn-example-simple-nosql-cluster/0.11.0-SNAPSHOT/brooklyn-example-simple-nosql-cluster-0.11.0-SNAPSHOT.pom
[JENKINS] Archiving <https://builds.apache.org/job/brooklyn-master-build/ws/brooklyn-ui/pom.xml>
to org.apache.brooklyn/brooklyn-jsgui/0.11.0-SNAPSHOT/brooklyn-jsgui-0.11.0-SNAPSHOT.pom
[JENKINS] Archiving <https://builds.apache.org/job/brooklyn-master-build/ws/brooklyn-ui/target/brooklyn-jsgui-0.11.0-SNAPSHOT.war>
to org.apache.brooklyn/brooklyn-jsgui/0.11.0-SNAPSHOT/brooklyn-jsgui-0.11.0-SNAPSHOT.war
[JENKINS] Archiving <https://builds.apache.org/job/brooklyn-master-build/ws/brooklyn-ui/target/brooklyn-jsgui-0.11.0-SNAPSHOT-tests.jar>
to org.apache.brooklyn/brooklyn-jsgui/0.11.0-SNAPSHOT/brooklyn-jsgui-0.11.0-SNAPSHOT-tests.jar
Compressed 2.84 MB of artifacts by 90.2% relative to #864
[JENKINS] Archiving <https://builds.apache.org/job/brooklyn-master-build/ws/brooklyn-server/parent/pom.xml>
to org.apache.brooklyn/brooklyn-parent/0.11.0-SNAPSHOT/brooklyn-parent-0.11.0-SNAPSHOT.pom
Compressed 80.51 KB of artifacts by 79.5% relative to #864
[JENKINS] Archiving <https://builds.apache.org/job/brooklyn-master-build/ws/brooklyn-dist/deb-packaging/pom.xml>
to org.apache.brooklyn/deb-packaging/0.11.0-SNAPSHOT/deb-packaging-0.11.0-SNAPSHOT.pom
channel stopped

Mime
View raw message