brooklyn-dev mailing list archives

Site index · List index
Message view « Date » · « Thread »
Top « Date » · « Thread »
From Apache Jenkins Server <jenk...@builds.apache.org>
Subject Build failed in Jenkins: brooklyn-master-build #855
Date Fri, 24 Feb 2017 00:56:55 GMT
See <https://builds.apache.org/job/brooklyn-master-build/855/display/redirect>

------------------------------------------
[...truncated 27.00 KB...]
[INFO] Brooklyn Core ...................................... SKIPPED
[INFO] Brooklyn Policies .................................. SKIPPED
[INFO] Brooklyn WinRM Software Entities ................... SKIPPED
[INFO] Brooklyn Secure JMXMP Agent ........................ SKIPPED
[INFO] Brooklyn JMX RMI Agent ............................. SKIPPED
[INFO] Brooklyn Jclouds Location Targets .................. SKIPPED
[INFO] Brooklyn Software Base ............................. SKIPPED
[INFO] Brooklyn CAMP ...................................... SKIPPED
[INFO] Brooklyn Hazelcast Storage ......................... SKIPPED
[INFO] Brooklyn Launcher Common ........................... SKIPPED
[INFO] Brooklyn REST API .................................. SKIPPED
[INFO] Brooklyn REST Resources ............................ SKIPPED
[INFO] Brooklyn REST Server ............................... SKIPPED
[INFO] Brooklyn Launcher .................................. SKIPPED
[INFO] Brooklyn Command Line Interface .................... SKIPPED
[INFO] Brooklyn Test Framework ............................ SKIPPED
[INFO] Brooklyn OSGi init ................................. SKIPPED
[INFO] Brooklyn Karaf ..................................... SKIPPED
[INFO] Jetty config fragment .............................. SKIPPED
[INFO] Apache Http Component extension .................... SKIPPED
[INFO] Brooklyn Karaf Features ............................ SKIPPED
[INFO] Brooklyn Karaf Shell Commands ...................... SKIPPED
[INFO] Brooklyn Library Root .............................. SKIPPED
[INFO] Brooklyn CM SaltStack .............................. SKIPPED
[INFO] Brooklyn CM Ansible ................................ SKIPPED
[INFO] Brooklyn CM Integration Root ....................... SKIPPED
[INFO] Brooklyn Network Software Entities ................. SKIPPED
[INFO] Brooklyn OSGi Software Entities .................... SKIPPED
[INFO] Brooklyn Database Software Entities ................ SKIPPED
[INFO] Brooklyn Web App Software Entities ................. SKIPPED
[INFO] Brooklyn Messaging Software Entities ............... SKIPPED
[INFO] Brooklyn NoSQL Data Store Software Entities ........ SKIPPED
[INFO] Brooklyn Monitoring Software Entities .............. SKIPPED
[INFO] Brooklyn QA ........................................ SKIPPED
[INFO] Brooklyn Examples Aggregator Project ............... SKIPPED
[INFO] Brooklyn Examples Aggregator Project - Webapps ..... SKIPPED
[INFO] hello-world-webapp Maven Webapp .................... SKIPPED
[INFO] hello-world-sql-webapp Maven Webapp ................ SKIPPED
[INFO] Brooklyn Simple Web Cluster Example ................ SKIPPED
[INFO] Brooklyn Global Web Fabric Example ................. SKIPPED
[INFO] Brooklyn Simple Messaging Publish-Subscribe Example  SKIPPED
[INFO] Brooklyn NoSQL Cluster Examples .................... SKIPPED
[INFO] Brooklyn Library Karaf integration ................. SKIPPED
[INFO] Brooklyn Library Catalog ........................... SKIPPED
[INFO] Brooklyn Library Karaf Features .................... SKIPPED
[INFO] Brooklyn Client .................................... SKIPPED
[INFO] Brooklyn Client Command Line Interface ............. SKIPPED
[INFO] Brooklyn REST java Client .......................... SKIPPED
[INFO] Brooklyn Downstream Project Parent ................. SKIPPED
[INFO] Brooklyn Dist Root ................................. SKIPPED
[INFO] Brooklyn All Things ................................ SKIPPED
[INFO] Brooklyn Distribution .............................. SKIPPED
[INFO] Brooklyn Karaf Distribution Parent ................. SKIPPED
[INFO] Brooklyn Karaf Server Configuration ................ SKIPPED
[INFO] Brooklyn Dist Karaf Features ....................... SKIPPED
[INFO] Brooklyn Karaf Distribution ........................ SKIPPED
[INFO] Brooklyn Karaf pax-exam itest ...................... SKIPPED
[INFO] Brooklyn Vagrant Getting Started Environment ....... SKIPPED
[INFO] Brooklyn Quick-Start Project Archetype ............. SKIPPED
[INFO] Brooklyn Shared Package Files ...................... SKIPPED
[INFO] Brooklyn DEB Package ............................... SKIPPED
[INFO] Brooklyn Root ...................................... SKIPPED
[INFO] ------------------------------------------------------------------------
[INFO] BUILD FAILURE
[INFO] ------------------------------------------------------------------------
[INFO] Total time: 01:45 min
[INFO] Finished at: 2017-02-24T00:55:03+00:00
[INFO] Final Memory: 65M/456M
[INFO] ------------------------------------------------------------------------
[ERROR] Failed to execute goal com.github.searls:jasmine-maven-plugin:2.1:test (default) on
project brooklyn-jsgui: The jasmine-maven-plugin encountered an exception:
[ERROR] java.lang.RuntimeException: org.openqa.selenium.remote.UnreachableBrowserException:
Error communicating with the remote browser. It may have died.
[ERROR] Build info: version: '2.48.2', revision: '41bccdd10cf2c0560f637404c2d96164b67d9d67',
time: '2015-10-09 13:08:06'
Waiting for Jenkins to finish collecting data
[ERROR] System info: host: 'jenkins-ubuntu2', ip: '10.20.2.231', os.name: 'Linux', os.arch:
'amd64', os.version: '3.19.0-25-generic', java.version: '1.7.0_80'
[ERROR] Driver info: driver.version: RemoteWebDriver
[ERROR] at com.github.searls.jasmine.runner.SpecRunnerExecutor.execute(SpecRunnerExecutor.java:53)
[ERROR] at com.github.searls.jasmine.mojo.TestMojo.executeSpecs(TestMojo.java:236)
[ERROR] at com.github.searls.jasmine.mojo.TestMojo.run(TestMojo.java:204)
[ERROR] at com.github.searls.jasmine.mojo.AbstractJasmineMojo.execute(AbstractJasmineMojo.java:385)
[ERROR] at com.github.searls.jasmine.mojo.TestMojo.execute(TestMojo.java:191)
[ERROR] at org.apache.maven.plugin.DefaultBuildPluginManager.executeMojo(DefaultBuildPluginManager.java:134)
[ERROR] at org.apache.maven.lifecycle.internal.MojoExecutor.execute(MojoExecutor.java:207)
[ERROR] at org.apache.maven.lifecycle.internal.MojoExecutor.execute(MojoExecutor.java:153)
[ERROR] at org.apache.maven.lifecycle.internal.MojoExecutor.execute(MojoExecutor.java:145)
[ERROR] at org.apache.maven.lifecycle.internal.LifecycleModuleBuilder.buildProject(LifecycleModuleBuilder.java:116)
[ERROR] at org.apache.maven.lifecycle.internal.LifecycleModuleBuilder.buildProject(LifecycleModuleBuilder.java:80)
[ERROR] at org.apache.maven.lifecycle.internal.builder.singlethreaded.SingleThreadedBuilder.build(SingleThreadedBuilder.java:51)
[ERROR] at org.apache.maven.lifecycle.internal.LifecycleStarter.execute(LifecycleStarter.java:128)
[ERROR] at org.apache.maven.DefaultMaven.doExecute(DefaultMaven.java:307)
[ERROR] at org.apache.maven.DefaultMaven.doExecute(DefaultMaven.java:193)
[ERROR] at org.apache.maven.DefaultMaven.execute(DefaultMaven.java:106)
[ERROR] at org.jvnet.hudson.maven3.launcher.Maven33Launcher.main(Maven33Launcher.java:129)
[ERROR] at sun.reflect.NativeMethodAccessorImpl.invoke0(Native Method)
[ERROR] at sun.reflect.NativeMethodAccessorImpl.invoke(NativeMethodAccessorImpl.java:57)
[ERROR] at sun.reflect.DelegatingMethodAccessorImpl.invoke(DelegatingMethodAccessorImpl.java:43)
[ERROR] at java.lang.reflect.Method.invoke(Method.java:606)
[ERROR] at org.codehaus.plexus.classworlds.launcher.Launcher.launchStandard(Launcher.java:330)
[ERROR] at org.codehaus.plexus.classworlds.launcher.Launcher.launch(Launcher.java:238)
[ERROR] at jenkins.maven3.agent.Maven33Main.launch(Maven33Main.java:176)
[ERROR] at sun.reflect.NativeMethodAccessorImpl.invoke0(Native Method)
[ERROR] at sun.reflect.NativeMethodAccessorImpl.invoke(NativeMethodAccessorImpl.java:57)
[ERROR] at sun.reflect.DelegatingMethodAccessorImpl.invoke(DelegatingMethodAccessorImpl.java:43)
[ERROR] at java.lang.reflect.Method.invoke(Method.java:606)
[ERROR] at hudson.maven.Maven3Builder.call(Maven3Builder.java:139)
[ERROR] at hudson.maven.Maven3Builder.call(Maven3Builder.java:70)
[ERROR] at hudson.remoting.UserRequest.perform(UserRequest.java:153)
[ERROR] at hudson.remoting.UserRequest.perform(UserRequest.java:50)
[ERROR] at hudson.remoting.Request$2.run(Request.java:336)
[ERROR] at hudson.remoting.InterceptingExecutorService$1.call(InterceptingExecutorService.java:68)
[ERROR] at java.util.concurrent.FutureTask.run(FutureTask.java:262)
[ERROR] at java.util.concurrent.ThreadPoolExecutor.runWorker(ThreadPoolExecutor.java:1145)
[ERROR] at java.util.concurrent.ThreadPoolExecutor$Worker.run(ThreadPoolExecutor.java:615)
[ERROR] at java.lang.Thread.run(Thread.java:745)
[ERROR] Caused by: org.openqa.selenium.remote.UnreachableBrowserException: Error communicating
with the remote browser. It may have died.
[ERROR] Build info: version: '2.48.2', revision: '41bccdd10cf2c0560f637404c2d96164b67d9d67',
time: '2015-10-09 13:08:06'
[ERROR] System info: host: 'jenkins-ubuntu2', ip: '10.20.2.231', os.name: 'Linux', os.arch:
'amd64', os.version: '3.19.0-25-generic', java.version: '1.7.0_80'
[ERROR] Driver info: driver.version: RemoteWebDriver
[ERROR] at org.openqa.selenium.remote.RemoteWebDriver.execute(RemoteWebDriver.java:641)
[ERROR] at org.openqa.selenium.remote.RemoteWebDriver.executeScript(RemoteWebDriver.java:556)
[ERROR] at com.github.searls.jasmine.runner.SpecRunnerExecutor.executionFinished(SpecRunnerExecutor.java:115)
[ERROR] at com.github.searls.jasmine.runner.SpecRunnerExecutor.access$000(SpecRunnerExecutor.java:19)
[ERROR] at com.github.searls.jasmine.runner.SpecRunnerExecutor$1.apply(SpecRunnerExecutor.java:94)
[ERROR] at com.github.searls.jasmine.runner.SpecRunnerExecutor$1.apply(SpecRunnerExecutor.java:91)
[ERROR] at org.openqa.selenium.support.ui.FluentWait$3.apply(FluentWait.java:207)
[ERROR] at org.openqa.selenium.support.ui.FluentWait$3.apply(FluentWait.java:205)
[ERROR] at org.openqa.selenium.support.ui.FluentWait.until(FluentWait.java:238)
[ERROR] at org.openqa.selenium.support.ui.FluentWait.until(FluentWait.java:205)
[ERROR] at com.github.searls.jasmine.runner.SpecRunnerExecutor.waitForRunnerToFinish(SpecRunnerExecutor.java:91)
[ERROR] at com.github.searls.jasmine.runner.SpecRunnerExecutor.execute(SpecRunnerExecutor.java:43)
[ERROR] ... 37 more
[ERROR] Caused by: org.openqa.selenium.WebDriverException: The PhantomJS/GhostDriver server
has unexpectedly died!
[ERROR] Build info: version: '2.48.2', revision: '41bccdd10cf2c0560f637404c2d96164b67d9d67',
time: '2015-10-09 13:08:06'
[ERROR] System info: host: 'jenkins-ubuntu2', ip: '10.20.2.231', os.name: 'Linux', os.arch:
'amd64', os.version: '3.19.0-25-generic', java.version: '1.7.0_80'
[ERROR] Driver info: driver.version: RemoteWebDriver
[ERROR] at org.openqa.selenium.phantomjs.PhantomJSCommandExecutor.execute(PhantomJSCommandExecutor.java:88)
[ERROR] at org.openqa.selenium.remote.RemoteWebDriver.execute(RemoteWebDriver.java:620)
[ERROR] ... 48 more
[ERROR] Caused by: org.apache.http.conn.HttpHostConnectException: Connect to localhost:23943
[localhost/127.0.0.1] failed: Connection refused
[ERROR] at org.apache.http.impl.conn.DefaultHttpClientConnectionOperator.connect(DefaultHttpClientConnectionOperator.java:151)
[ERROR] at org.apache.http.impl.conn.PoolingHttpClientConnectionManager.connect(PoolingHttpClientConnectionManager.java:353)
[ERROR] at org.apache.http.impl.execchain.MainClientExec.establishRoute(MainClientExec.java:380)
[ERROR] at org.apache.http.impl.execchain.MainClientExec.execute(MainClientExec.java:236)
[ERROR] at org.apache.http.impl.execchain.ProtocolExec.execute(ProtocolExec.java:184)
[ERROR] at org.apache.http.impl.execchain.RetryExec.execute(RetryExec.java:88)
[ERROR] at org.apache.http.impl.execchain.RedirectExec.execute(RedirectExec.java:110)
[ERROR] at org.apache.http.impl.client.InternalHttpClient.doExecute(InternalHttpClient.java:184)
[ERROR] at org.apache.http.impl.client.CloseableHttpClient.execute(CloseableHttpClient.java:71)
[ERROR] at org.apache.http.impl.client.CloseableHttpClient.execute(CloseableHttpClient.java:55)
[ERROR] at org.openqa.selenium.remote.internal.ApacheHttpClient.fallBackExecute(ApacheHttpClient.java:143)
[ERROR] at org.openqa.selenium.remote.internal.ApacheHttpClient.execute(ApacheHttpClient.java:89)
[ERROR] at org.openqa.selenium.remote.HttpCommandExecutor.execute(HttpCommandExecutor.java:142)
[ERROR] at org.openqa.selenium.phantomjs.PhantomJSCommandExecutor.execute(PhantomJSCommandExecutor.java:82)
[ERROR] ... 49 more
[ERROR] Caused by: java.net.ConnectException: Connection refused
[ERROR] at java.net.PlainSocketImpl.socketConnect(Native Method)
[ERROR] at java.net.AbstractPlainSocketImpl.doConnect(AbstractPlainSocketImpl.java:339)
[ERROR] at java.net.AbstractPlainSocketImpl.connectToAddress(AbstractPlainSocketImpl.java:200)
[ERROR] at java.net.AbstractPlainSocketImpl.connect(AbstractPlainSocketImpl.java:182)
[ERROR] at java.net.SocksSocketImpl.connect(SocksSocketImpl.java:392)
[ERROR] at java.net.Socket.connect(Socket.java:579)
[ERROR] at org.apache.http.conn.socket.PlainConnectionSocketFactory.connectSocket(PlainConnectionSocketFactory.java:74)
[ERROR] at org.apache.http.impl.conn.DefaultHttpClientConnectionOperator.connect(DefaultHttpClientConnectionOperator.java:134)
[ERROR] ... 62 more
[ERROR] -> [Help 1]
[ERROR] 
[ERROR] To see the full stack trace of the errors, re-run Maven with the -e switch.
[ERROR] Re-run Maven using the -X switch to enable full debug logging.
[ERROR] 
[ERROR] For more information about the errors and possible solutions, please read the following
articles:
[ERROR] [Help 1] http://cwiki.apache.org/confluence/display/MAVEN/MojoExecutionException
[JENKINS] Archiving <https://builds.apache.org/job/brooklyn-master-build/ws/brooklyn-library/software/cm/salt/pom.xml>
to org.apache.brooklyn/brooklyn-software-cm-salt/0.11.0-SNAPSHOT/brooklyn-software-cm-salt-0.11.0-SNAPSHOT.pom
[JENKINS] Archiving <https://builds.apache.org/job/brooklyn-master-build/ws/brooklyn-server/core/pom.xml>
to org.apache.brooklyn/brooklyn-core/0.11.0-SNAPSHOT/brooklyn-core-0.11.0-SNAPSHOT.pom
[JENKINS] Archiving <https://builds.apache.org/job/brooklyn-master-build/ws/brooklyn-server/camp/camp-server/pom.xml>
to org.apache.brooklyn.camp/camp-server/0.11.0-SNAPSHOT/camp-server-0.11.0-SNAPSHOT.pom
[JENKINS] Archiving <https://builds.apache.org/job/brooklyn-master-build/ws/brooklyn-server/karaf/pom.xml>
to org.apache.brooklyn/brooklyn-karaf/0.11.0-SNAPSHOT/brooklyn-karaf-0.11.0-SNAPSHOT.pom
[JENKINS] Archiving <https://builds.apache.org/job/brooklyn-master-build/ws/brooklyn-server/karaf/httpcomponent-extension/pom.xml>
to org.apache.brooklyn/brooklyn-karaf-httpcomponents-extension/0.11.0-SNAPSHOT/brooklyn-karaf-httpcomponents-extension-0.11.0-SNAPSHOT.pom
[JENKINS] Archiving <https://builds.apache.org/job/brooklyn-master-build/ws/brooklyn-server/utils/test-support/pom.xml>
to org.apache.brooklyn/brooklyn-utils-test-support/0.11.0-SNAPSHOT/brooklyn-utils-test-support-0.11.0-SNAPSHOT.pom
[JENKINS] Archiving <https://builds.apache.org/job/brooklyn-master-build/ws/brooklyn-dist/karaf/apache-brooklyn/pom.xml>
to org.apache.brooklyn/apache-brooklyn/0.11.0-SNAPSHOT/apache-brooklyn-0.11.0-SNAPSHOT.pom
[JENKINS] Archiving <https://builds.apache.org/job/brooklyn-master-build/ws/brooklyn-library/software/nosql/pom.xml>
to org.apache.brooklyn/brooklyn-software-nosql/0.11.0-SNAPSHOT/brooklyn-software-nosql-0.11.0-SNAPSHOT.pom
[JENKINS] Archiving <https://builds.apache.org/job/brooklyn-master-build/ws/brooklyn-server/utils/groovy/pom.xml>
to org.apache.brooklyn/brooklyn-utils-groovy/0.11.0-SNAPSHOT/brooklyn-utils-groovy-0.11.0-SNAPSHOT.pom
[JENKINS] Archiving <https://builds.apache.org/job/brooklyn-master-build/ws/brooklyn-server/launcher-common/pom.xml>
to org.apache.brooklyn/brooklyn-launcher-common/0.11.0-SNAPSHOT/brooklyn-launcher-common-0.11.0-SNAPSHOT.pom
[JENKINS] Archiving <https://builds.apache.org/job/brooklyn-master-build/ws/brooklyn-library/examples/webapps/pom.xml>
to org.apache.brooklyn.example/brooklyn-examples-webapps-parent/0.11.0-SNAPSHOT/brooklyn-examples-webapps-parent-0.11.0-SNAPSHOT.pom
[JENKINS] Archiving <https://builds.apache.org/job/brooklyn-master-build/ws/brooklyn-library/examples/simple-web-cluster/pom.xml>
to org.apache.brooklyn.example/brooklyn-example-simple-web-cluster/0.11.0-SNAPSHOT/brooklyn-example-simple-web-cluster-0.11.0-SNAPSHOT.pom
[JENKINS] Archiving <https://builds.apache.org/job/brooklyn-master-build/ws/brooklyn-dist/karaf/itest/pom.xml>
to org.apache.brooklyn/brooklyn-itest/0.11.0-SNAPSHOT/brooklyn-itest-0.11.0-SNAPSHOT.pom
[JENKINS] Archiving <https://builds.apache.org/job/brooklyn-master-build/ws/brooklyn-library/examples/pom.xml>
to org.apache.brooklyn.example/brooklyn-examples-parent/0.11.0-SNAPSHOT/brooklyn-examples-parent-0.11.0-SNAPSHOT.pom
[JENKINS] Archiving <https://builds.apache.org/job/brooklyn-master-build/ws/brooklyn-dist/dist/pom.xml>
to org.apache.brooklyn/brooklyn-dist/0.11.0-SNAPSHOT/brooklyn-dist-0.11.0-SNAPSHOT.pom
[JENKINS] Archiving <https://builds.apache.org/job/brooklyn-master-build/ws/brooklyn-server/camp/camp-base/pom.xml>
to org.apache.brooklyn.camp/camp-base/0.11.0-SNAPSHOT/camp-base-0.11.0-SNAPSHOT.pom
[JENKINS] Archiving <https://builds.apache.org/job/brooklyn-master-build/ws/brooklyn-server/camp/camp-brooklyn/pom.xml>
to org.apache.brooklyn/brooklyn-camp/0.11.0-SNAPSHOT/brooklyn-camp-0.11.0-SNAPSHOT.pom
[JENKINS] Archiving <https://builds.apache.org/job/brooklyn-master-build/ws/brooklyn-server/karaf/jetty-config/pom.xml>
to org.apache.brooklyn/brooklyn-karaf-jetty-config/0.11.0-SNAPSHOT/brooklyn-karaf-jetty-config-0.11.0-SNAPSHOT.pom
[JENKINS] Archiving <https://builds.apache.org/job/brooklyn-master-build/ws/brooklyn-library/pom.xml>
to org.apache.brooklyn/brooklyn-library/0.11.0-SNAPSHOT/brooklyn-library-0.11.0-SNAPSHOT.pom
[JENKINS] Archiving <https://builds.apache.org/job/brooklyn-master-build/ws/brooklyn-library/examples/webapps/hello-world-webapp/pom.xml>
to org.apache.brooklyn.example/brooklyn-example-hello-world-webapp/0.11.0-SNAPSHOT/brooklyn-example-hello-world-webapp-0.11.0-SNAPSHOT.pom
[JENKINS] Archiving <https://builds.apache.org/job/brooklyn-master-build/ws/brooklyn-server/test-support/pom.xml>
to org.apache.brooklyn/brooklyn-test-support/0.11.0-SNAPSHOT/brooklyn-test-support-0.11.0-SNAPSHOT.pom
[JENKINS] Archiving <https://builds.apache.org/job/brooklyn-master-build/ws/brooklyn-server/rest/rest-server/pom.xml>
to org.apache.brooklyn/brooklyn-rest-server/0.11.0-SNAPSHOT/brooklyn-rest-server-0.11.0-SNAPSHOT.pom
[JENKINS] Archiving <https://builds.apache.org/job/brooklyn-master-build/ws/brooklyn-server/utils/common/pom.xml>
to org.apache.brooklyn/brooklyn-utils-common/0.11.0-SNAPSHOT/brooklyn-utils-common-0.11.0-SNAPSHOT.pom
[JENKINS] Archiving <https://builds.apache.org/job/brooklyn-master-build/ws/brooklyn-library/software/webapp/pom.xml>
to org.apache.brooklyn/brooklyn-software-webapp/0.11.0-SNAPSHOT/brooklyn-software-webapp-0.11.0-SNAPSHOT.pom
[JENKINS] Archiving <https://builds.apache.org/job/brooklyn-master-build/ws/brooklyn-server/karaf/features/pom.xml>
to org.apache.brooklyn/brooklyn-features/0.11.0-SNAPSHOT/brooklyn-features-0.11.0-SNAPSHOT.pom
[JENKINS] Archiving <https://builds.apache.org/job/brooklyn-master-build/ws/brooklyn-server/rest/rest-api/pom.xml>
to org.apache.brooklyn/brooklyn-rest-api/0.11.0-SNAPSHOT/brooklyn-rest-api-0.11.0-SNAPSHOT.pom
[JENKINS] Archiving <https://builds.apache.org/job/brooklyn-master-build/ws/brooklyn-server/policy/pom.xml>
to org.apache.brooklyn/brooklyn-policy/0.11.0-SNAPSHOT/brooklyn-policy-0.11.0-SNAPSHOT.pom
[JENKINS] Archiving <https://builds.apache.org/job/brooklyn-master-build/ws/brooklyn-server/logging/logback-includes/pom.xml>
to org.apache.brooklyn/brooklyn-logback-includes/0.11.0-SNAPSHOT/brooklyn-logback-includes-0.11.0-SNAPSHOT.pom
[JENKINS] Archiving <https://builds.apache.org/job/brooklyn-master-build/ws/brooklyn-server/rest/rest-resources/pom.xml>
to org.apache.brooklyn/brooklyn-rest-resources/0.11.0-SNAPSHOT/brooklyn-rest-resources-0.11.0-SNAPSHOT.pom
[JENKINS] Archiving <https://builds.apache.org/job/brooklyn-master-build/ws/brooklyn-server/utils/jmx/jmxmp-ssl-agent/pom.xml>
to org.apache.brooklyn/brooklyn-jmxmp-agent/0.11.0-SNAPSHOT/brooklyn-jmxmp-agent-0.11.0-SNAPSHOT.pom
[JENKINS] Archiving <https://builds.apache.org/job/brooklyn-master-build/ws/brooklyn-server/software/winrm/pom.xml>
to org.apache.brooklyn/brooklyn-software-winrm/0.11.0-SNAPSHOT/brooklyn-software-winrm-0.11.0-SNAPSHOT.pom
[JENKINS] Archiving <https://builds.apache.org/job/brooklyn-master-build/ws/brooklyn-server/camp/pom.xml>
to org.apache.brooklyn.camp/camp-parent/0.11.0-SNAPSHOT/camp-parent-0.11.0-SNAPSHOT.pom
[JENKINS] Archiving <https://builds.apache.org/job/brooklyn-master-build/ws/brooklyn-server/utils/rt-felix/pom.xml>
to org.apache.brooklyn/brooklyn-rt-felix/0.11.0-SNAPSHOT/brooklyn-rt-felix-0.11.0-SNAPSHOT.pom
[JENKINS] Archiving <https://builds.apache.org/job/brooklyn-master-build/ws/brooklyn-dist/pom.xml>
to org.apache.brooklyn/brooklyn-dist-root/0.11.0-SNAPSHOT/brooklyn-dist-root-0.11.0-SNAPSHOT.pom
[JENKINS] Archiving <https://builds.apache.org/job/brooklyn-master-build/ws/brooklyn-server/test-framework/pom.xml>
to org.apache.brooklyn/brooklyn-test-framework/0.11.0-SNAPSHOT/brooklyn-test-framework-0.11.0-SNAPSHOT.pom
[JENKINS] Archiving <https://builds.apache.org/job/brooklyn-master-build/ws/brooklyn-library/software/osgi/pom.xml>
to org.apache.brooklyn/brooklyn-software-osgi/0.11.0-SNAPSHOT/brooklyn-software-osgi-0.11.0-SNAPSHOT.pom
[JENKINS] Archiving <https://builds.apache.org/job/brooklyn-master-build/ws/brooklyn-library/software/database/pom.xml>
to org.apache.brooklyn/brooklyn-software-database/0.11.0-SNAPSHOT/brooklyn-software-database-0.11.0-SNAPSHOT.pom
[JENKINS] Archiving <https://builds.apache.org/job/brooklyn-master-build/ws/brooklyn-server/launcher/pom.xml>
to org.apache.brooklyn/brooklyn-launcher/0.11.0-SNAPSHOT/brooklyn-launcher-0.11.0-SNAPSHOT.pom
[JENKINS] Archiving <https://builds.apache.org/job/brooklyn-master-build/ws/brooklyn-library/software/messaging/pom.xml>
to org.apache.brooklyn/brooklyn-software-messaging/0.11.0-SNAPSHOT/brooklyn-software-messaging-0.11.0-SNAPSHOT.pom
[JENKINS] Archiving <https://builds.apache.org/job/brooklyn-master-build/ws/brooklyn-library/qa/pom.xml>
to org.apache.brooklyn/brooklyn-qa/0.11.0-SNAPSHOT/brooklyn-qa-0.11.0-SNAPSHOT.pom
[JENKINS] Archiving <https://builds.apache.org/job/brooklyn-master-build/ws/brooklyn-library/software/monitoring/pom.xml>
to org.apache.brooklyn/brooklyn-software-monitoring/0.11.0-SNAPSHOT/brooklyn-software-monitoring-0.11.0-SNAPSHOT.pom
[JENKINS] Archiving <https://builds.apache.org/job/brooklyn-master-build/ws/brooklyn-library/karaf/catalog/pom.xml>
to org.apache.brooklyn/brooklyn-library-catalog/0.11.0-SNAPSHOT/brooklyn-library-catalog-0.11.0-SNAPSHOT.pom
[JENKINS] Archiving <https://builds.apache.org/job/brooklyn-master-build/ws/brooklyn-library/software/cm/pom.xml>
to org.apache.brooklyn/brooklyn-software-cm/0.11.0-SNAPSHOT/brooklyn-software-cm-0.11.0-SNAPSHOT.pom
[JENKINS] Archiving <https://builds.apache.org/job/brooklyn-master-build/ws/brooklyn-library/examples/simple-messaging-pubsub/pom.xml>
to org.apache.brooklyn.example/brooklyn-example-simple-messaging-pubsub/0.11.0-SNAPSHOT/brooklyn-example-simple-messaging-pubsub-0.11.0-SNAPSHOT.pom
[JENKINS] Archiving <https://builds.apache.org/job/brooklyn-master-build/ws/brooklyn-server/software/base/pom.xml>
to org.apache.brooklyn/brooklyn-software-base/0.11.0-SNAPSHOT/brooklyn-software-base-0.11.0-SNAPSHOT.pom
[JENKINS] Archiving <https://builds.apache.org/job/brooklyn-master-build/ws/brooklyn-dist/karaf/config/pom.xml>
to org.apache.brooklyn/brooklyn-dist-config/0.11.0-SNAPSHOT/brooklyn-dist-config-0.11.0-SNAPSHOT.pom
[JENKINS] Archiving <https://builds.apache.org/job/brooklyn-master-build/ws/brooklyn-library/karaf/pom.xml>
to org.apache.brooklyn/brooklyn-library-karaf/0.11.0-SNAPSHOT/brooklyn-library-karaf-0.11.0-SNAPSHOT.pom
[JENKINS] Archiving <https://builds.apache.org/job/brooklyn-master-build/ws/brooklyn-server/utils/rest-swagger/pom.xml>
to org.apache.brooklyn/brooklyn-utils-rest-swagger/0.11.0-SNAPSHOT/brooklyn-utils-rest-swagger-0.11.0-SNAPSHOT.pom
[JENKINS] Archiving <https://builds.apache.org/job/brooklyn-master-build/ws/brooklyn-dist/downstream-parent/pom.xml>
to org.apache.brooklyn/brooklyn-downstream-parent/0.11.0-SNAPSHOT/brooklyn-downstream-parent-0.11.0-SNAPSHOT.pom
[JENKINS] Archiving <https://builds.apache.org/job/brooklyn-master-build/ws/brooklyn-client/java/pom.xml>
to org.apache.brooklyn/brooklyn-rest-client/0.11.0-SNAPSHOT/brooklyn-rest-client-0.11.0-SNAPSHOT.pom
[JENKINS] Archiving <https://builds.apache.org/job/brooklyn-master-build/ws/brooklyn-dist/all/pom.xml>
to org.apache.brooklyn/brooklyn-all/0.11.0-SNAPSHOT/brooklyn-all-0.11.0-SNAPSHOT.pom
[JENKINS] Archiving <https://builds.apache.org/job/brooklyn-master-build/ws/brooklyn-server/server-cli/pom.xml>
to org.apache.brooklyn/brooklyn-cli/0.11.0-SNAPSHOT/brooklyn-cli-0.11.0-SNAPSHOT.pom
[JENKINS] Archiving <https://builds.apache.org/job/brooklyn-master-build/ws/brooklyn-server/logging/logback-xml/pom.xml>
to org.apache.brooklyn/brooklyn-logback-xml/0.11.0-SNAPSHOT/brooklyn-logback-xml-0.11.0-SNAPSHOT.pom
[JENKINS] Archiving <https://builds.apache.org/job/brooklyn-master-build/ws/brooklyn-client/pom.xml>
to org.apache.brooklyn/brooklyn-client/0.11.0-SNAPSHOT/brooklyn-client-0.11.0-SNAPSHOT.pom
[JENKINS] Archiving <https://builds.apache.org/job/brooklyn-master-build/ws/brooklyn-library/software/cm/ansible/pom.xml>
to org.apache.brooklyn/brooklyn-software-cm-ansible/0.11.0-SNAPSHOT/brooklyn-software-cm-ansible-0.11.0-SNAPSHOT.pom
[JENKINS] Archiving <https://builds.apache.org/job/brooklyn-master-build/ws/brooklyn-library/examples/global-web-fabric/pom.xml>
to org.apache.brooklyn.example/brooklyn-example-global-web-fabric/0.11.0-SNAPSHOT/brooklyn-example-global-web-fabric-0.11.0-SNAPSHOT.pom
[JENKINS] Archiving <https://builds.apache.org/job/brooklyn-master-build/ws/brooklyn-dist/archetypes/quickstart/pom.xml>
to org.apache.brooklyn/brooklyn-archetype-quickstart/0.11.0-SNAPSHOT/brooklyn-archetype-quickstart-0.11.0-SNAPSHOT.pom
[JENKINS] Archiving <https://builds.apache.org/job/brooklyn-master-build/ws/brooklyn-server/api/pom.xml>
to org.apache.brooklyn/brooklyn-api/0.11.0-SNAPSHOT/brooklyn-api-0.11.0-SNAPSHOT.pom
[JENKINS] Archiving <https://builds.apache.org/job/brooklyn-master-build/ws/brooklyn-server/pom.xml>
to org.apache.brooklyn/brooklyn-server/0.11.0-SNAPSHOT/brooklyn-server-0.11.0-SNAPSHOT.pom
[JENKINS] Archiving <https://builds.apache.org/job/brooklyn-master-build/ws/brooklyn-library/examples/webapps/hello-world-sql/pom.xml>
to org.apache.brooklyn.example/brooklyn-example-hello-world-sql-webapp/0.11.0-SNAPSHOT/brooklyn-example-hello-world-sql-webapp-0.11.0-SNAPSHOT.pom
[JENKINS] Archiving <https://builds.apache.org/job/brooklyn-master-build/ws/brooklyn-dist/karaf/pom.xml>
to org.apache.brooklyn/brooklyn-dist-karaf/0.11.0-SNAPSHOT/brooklyn-dist-karaf-0.11.0-SNAPSHOT.pom
[JENKINS] Archiving <https://builds.apache.org/job/brooklyn-master-build/ws/brooklyn-server/locations/jclouds/pom.xml>
to org.apache.brooklyn/brooklyn-locations-jclouds/0.11.0-SNAPSHOT/brooklyn-locations-jclouds-0.11.0-SNAPSHOT.pom
[JENKINS] Archiving <https://builds.apache.org/job/brooklyn-master-build/ws/brooklyn-library/software/network/pom.xml>
to org.apache.brooklyn/brooklyn-software-network/0.11.0-SNAPSHOT/brooklyn-software-network-0.11.0-SNAPSHOT.pom
[JENKINS] Archiving <https://builds.apache.org/job/brooklyn-master-build/ws/brooklyn-client/cli/pom.xml>
to org.apache.brooklyn/brooklyn-client-cli/0.11.0-SNAPSHOT/brooklyn-client-cli-0.11.0-SNAPSHOT.pom
[JENKINS] Archiving <https://builds.apache.org/job/brooklyn-master-build/ws/brooklyn-dist/shared-packaging/pom.xml>
to org.apache.brooklyn/shared-packaging/0.11.0-SNAPSHOT/shared-packaging-0.11.0-SNAPSHOT.pom
[JENKINS] Archiving <https://builds.apache.org/job/brooklyn-master-build/ws/brooklyn-server/utils/jmx/jmxrmi-agent/pom.xml>
to org.apache.brooklyn/brooklyn-jmxrmi-agent/0.11.0-SNAPSHOT/brooklyn-jmxrmi-agent-0.11.0-SNAPSHOT.pom
[JENKINS] Archiving <https://builds.apache.org/job/brooklyn-master-build/ws/brooklyn-library/karaf/features/pom.xml>
to org.apache.brooklyn/brooklyn-library-features/0.11.0-SNAPSHOT/brooklyn-library-features-0.11.0-SNAPSHOT.pom
[JENKINS] Archiving <https://builds.apache.org/job/brooklyn-master-build/ws/brooklyn-dist/vagrant/pom.xml>
to org.apache.brooklyn/brooklyn-vagrant/0.11.0-SNAPSHOT/brooklyn-vagrant-0.11.0-SNAPSHOT.pom
[JENKINS] Archiving <https://builds.apache.org/job/brooklyn-master-build/ws/brooklyn-server/karaf/init/pom.xml>
to org.apache.brooklyn/brooklyn-karaf-init/0.11.0-SNAPSHOT/brooklyn-karaf-init-0.11.0-SNAPSHOT.pom
[JENKINS] Archiving <https://builds.apache.org/job/brooklyn-master-build/ws/brooklyn-server/karaf/commands/pom.xml>
to org.apache.brooklyn/brooklyn-commands/0.11.0-SNAPSHOT/brooklyn-commands-0.11.0-SNAPSHOT.pom
[JENKINS] Archiving <https://builds.apache.org/job/brooklyn-master-build/ws/pom.xml>
to org.apache.brooklyn/brooklyn/0.11.0-SNAPSHOT/brooklyn-0.11.0-SNAPSHOT.pom
[JENKINS] Archiving <https://builds.apache.org/job/brooklyn-master-build/ws/brooklyn-server/storage/hazelcast/pom.xml>
to org.apache.brooklyn/brooklyn-storage-hazelcast/0.11.0-SNAPSHOT/brooklyn-storage-hazelcast-0.11.0-SNAPSHOT.pom
[JENKINS] Archiving <https://builds.apache.org/job/brooklyn-master-build/ws/brooklyn-dist/karaf/features/pom.xml>
to org.apache.brooklyn/brooklyn-dist-features/0.11.0-SNAPSHOT/brooklyn-dist-features-0.11.0-SNAPSHOT.pom
[JENKINS] Archiving <https://builds.apache.org/job/brooklyn-master-build/ws/brooklyn-library/examples/simple-nosql-cluster/pom.xml>
to org.apache.brooklyn.example/brooklyn-example-simple-nosql-cluster/0.11.0-SNAPSHOT/brooklyn-example-simple-nosql-cluster-0.11.0-SNAPSHOT.pom
[JENKINS] Archiving <https://builds.apache.org/job/brooklyn-master-build/ws/brooklyn-ui/pom.xml>
to org.apache.brooklyn/brooklyn-jsgui/0.11.0-SNAPSHOT/brooklyn-jsgui-0.11.0-SNAPSHOT.pom
[JENKINS] Archiving <https://builds.apache.org/job/brooklyn-master-build/ws/brooklyn-server/parent/pom.xml>
to org.apache.brooklyn/brooklyn-parent/0.11.0-SNAPSHOT/brooklyn-parent-0.11.0-SNAPSHOT.pom
Compressed 80.51 KB of artifacts by 79.5% relative to #854
[JENKINS] Archiving <https://builds.apache.org/job/brooklyn-master-build/ws/brooklyn-dist/deb-packaging/pom.xml>
to org.apache.brooklyn/deb-packaging/0.11.0-SNAPSHOT/deb-packaging-0.11.0-SNAPSHOT.pom
channel stopped

Mime
View raw message