brooklyn-dev mailing list archives

Site index · List index
Message view « Date » · « Thread »
Top « Date » · « Thread »
From Apache Jenkins Server <jenk...@builds.apache.org>
Subject Build failed in Jenkins: brooklyn-master-build #789
Date Sun, 05 Feb 2017 05:52:18 GMT
See <https://builds.apache.org/job/brooklyn-master-build/789/>

------------------------------------------
[...truncated 56971 lines...]
[INFO] Feature wrap is defined as a boot feature
[INFO] == Installing artifact mvn:org.ops4j.pax.url/pax-url-wrap/2.5.2/jar/uber
[INFO] Feature brooklyn-guava-optional-deps is defined as a boot feature
[INFO] == Installing artifact mvn:javax.annotation/javax.annotation-api/1.2
[INFO] Feature feature is defined as a boot feature
[INFO] == Installing artifact mvn:org.apache.karaf.features/org.apache.karaf.features.core/4.0.8
[INFO] == Installing artifact mvn:org.apache.karaf.features/org.apache.karaf.features.command/4.0.8
[INFO] Feature jclouds is defined as a boot feature
[INFO] == Installing artifact mvn:org.apache.servicemix.bundles/org.apache.servicemix.bundles.oauth-commons/20100527_1
[INFO] == Installing artifact mvn:com.google.code.gson/gson/2.5
[INFO] == Installing artifact mvn:org.apache.servicemix.bundles/org.apache.servicemix.bundles.jersey-core/1.11_1
[INFO] == Installing artifact mvn:com.google.guava/guava/16.0.1
[INFO] == Installing artifact mvn:org.apache.jclouds/jclouds-core/2.0.0
[INFO] Feature brooklyn-software-database is defined as a boot feature
[INFO] == Installing artifact mvn:org.apache.brooklyn/brooklyn-software-database/0.11.0-SNAPSHOT
[INFO] == Installing artifact mvn:com.google.guava/guava/18.0
[INFO] Feature brooklyn-rest-resources is defined as a boot feature
[INFO] == Installing artifact mvn:org.apache.brooklyn/brooklyn-rest-resources/0.11.0-SNAPSHOT
[INFO] Feature war is defined as a boot feature
[INFO] == Installing artifact mvn:org.apache.karaf.web/org.apache.karaf.web.core/4.0.8
[INFO] Feature shell-compat is defined as a boot feature
[INFO] == Installing artifact mvn:org.apache.karaf.shell/org.apache.karaf.shell.table/4.0.8
[INFO] == Installing artifact mvn:org.apache.karaf.shell/org.apache.karaf.shell.console/4.0.8
[INFO] Feature pax-http is defined as a boot feature
[INFO] == Installing artifact mvn:org.apache.karaf.wrapper/org.apache.karaf.wrapper.core/4.0.8
[INFO] 
[INFO] --- maven-dependency-plugin:2.8:copy (unpack) @ apache-brooklyn ---
[INFO] Configured Artifact: org.apache.brooklyn:brooklyn-dist-config:classrename:0.11.0-SNAPSHOT:cfg
[INFO] Configured Artifact: org.apache.brooklyn:brooklyn-dist-config:core.catalog.bomscanner:0.11.0-SNAPSHOT:cfg
[INFO] Configured Artifact: org.apache.brooklyn:brooklyn-dist-config:osgilauncher:0.11.0-SNAPSHOT:cfg
[INFO] Copying org.apache.brooklyn.classrename.cfg to <https://builds.apache.org/job/brooklyn-master-build/ws/brooklyn-dist/karaf/apache-brooklyn/target/assembly/etc/org.apache.brooklyn.classrename.cfg>
[INFO] Copying org.apache.brooklyn.core.catalog.bomscanner.cfg to <https://builds.apache.org/job/brooklyn-master-build/ws/brooklyn-dist/karaf/apache-brooklyn/target/assembly/etc/org.apache.brooklyn.core.catalog.bomscanner.cfg>
[INFO] Copying org.apache.brooklyn.osgilauncher.cfg to <https://builds.apache.org/job/brooklyn-master-build/ws/brooklyn-dist/karaf/apache-brooklyn/target/assembly/etc/org.apache.brooklyn.osgilauncher.cfg>
[INFO] 
[INFO] --- karaf-maven-plugin:4.0.8:archive (default-archive) @ apache-brooklyn ---
[INFO] 
[INFO] --- maven-site-plugin:3.4:attach-descriptor (attach-descriptor) @ apache-brooklyn ---
[INFO] 
[INFO] --- maven-install-plugin:2.5.2:install (default-install) @ apache-brooklyn ---
[INFO] No primary artifact to install, installing attached artifacts instead.
[INFO] Installing <https://builds.apache.org/job/brooklyn-master-build/ws/brooklyn-dist/karaf/apache-brooklyn/pom.xml>
to /home/jenkins/jenkins-slave/maven-repositories/1/org/apache/brooklyn/apache-brooklyn/0.11.0-SNAPSHOT/apache-brooklyn-0.11.0-SNAPSHOT.pom
[INFO] Installing <https://builds.apache.org/job/brooklyn-master-build/ws/brooklyn-dist/karaf/apache-brooklyn/target/apache-brooklyn-0.11.0-SNAPSHOT.tar.gz>
to /home/jenkins/jenkins-slave/maven-repositories/1/org/apache/brooklyn/apache-brooklyn/0.11.0-SNAPSHOT/apache-brooklyn-0.11.0-SNAPSHOT.tar.gz
[INFO] Installing <https://builds.apache.org/job/brooklyn-master-build/ws/brooklyn-dist/karaf/apache-brooklyn/target/apache-brooklyn-0.11.0-SNAPSHOT.zip>
to /home/jenkins/jenkins-slave/maven-repositories/1/org/apache/brooklyn/apache-brooklyn/0.11.0-SNAPSHOT/apache-brooklyn-0.11.0-SNAPSHOT.zip
[INFO]                                                                         
[INFO] ------------------------------------------------------------------------
[INFO] Building Brooklyn Karaf pax-exam itest 0.11.0-SNAPSHOT
[INFO] ------------------------------------------------------------------------
[INFO] 
[INFO] --- maven-clean-plugin:2.5:clean (default-clean) @ brooklyn-itest ---
[INFO] Deleting <https://builds.apache.org/job/brooklyn-master-build/ws/brooklyn-dist/karaf/itest/target>
[INFO] ------------------------------------------------------------------------
[INFO] Reactor Summary:
[INFO] 
[INFO] Brooklyn REST JavaScript Web GUI ................... SUCCESS [03:19 min]
[INFO] Brooklyn Server Root ............................... SUCCESS [  4.090 s]
[INFO] Brooklyn Parent Project ............................ SUCCESS [ 16.765 s]
[INFO] Brooklyn Test Support Utilities .................... SUCCESS [ 16.110 s]
[INFO] Brooklyn Logback Includable Configuration .......... SUCCESS [ 16.253 s]
[INFO] Brooklyn Common Utilities .......................... SUCCESS [01:00 min]
[INFO] Brooklyn API ....................................... SUCCESS [ 20.360 s]
[INFO] CAMP Server Parent Project ......................... SUCCESS [ 10.360 s]
[INFO] CAMP Base .......................................... SUCCESS [ 18.722 s]
[INFO] Brooklyn Test Support .............................. SUCCESS [ 15.505 s]
[INFO] Brooklyn REST Swagger Apidoc Utilities ............. SUCCESS [ 16.232 s]
[INFO] Brooklyn Logback Configuration ..................... SUCCESS [ 16.719 s]
[INFO] CAMP Server ........................................ SUCCESS [ 20.515 s]
[INFO] Brooklyn Felix Runtime ............................. SUCCESS [ 20.965 s]
[INFO] Brooklyn Groovy Utilities .......................... SUCCESS [ 21.669 s]
[INFO] Brooklyn Core ...................................... SUCCESS [04:08 min]
[INFO] Brooklyn Policies .................................. SUCCESS [01:38 min]
[INFO] Brooklyn WinRM Software Entities ................... SUCCESS [ 22.124 s]
[INFO] Brooklyn Secure JMXMP Agent ........................ SUCCESS [ 27.639 s]
[INFO] Brooklyn JMX RMI Agent ............................. SUCCESS [ 14.554 s]
[INFO] Brooklyn Jclouds Location Targets .................. SUCCESS [ 43.102 s]
[INFO] Brooklyn Software Base ............................. SUCCESS [01:44 min]
[INFO] Brooklyn CAMP ...................................... SUCCESS [04:17 min]
[INFO] Brooklyn Hazelcast Storage ......................... SUCCESS [ 25.619 s]
[INFO] Brooklyn Launcher Common ........................... SUCCESS [ 18.892 s]
[INFO] Brooklyn REST API .................................. SUCCESS [ 26.809 s]
[INFO] Brooklyn REST Resources ............................ SUCCESS [ 59.291 s]
[INFO] Brooklyn REST Server ............................... SUCCESS [ 38.931 s]
[INFO] Brooklyn Launcher .................................. SUCCESS [ 51.367 s]
[INFO] Brooklyn Command Line Interface .................... SUCCESS [ 36.154 s]
[INFO] Brooklyn Test Framework ............................ SUCCESS [01:10 min]
[INFO] Brooklyn OSGi init ................................. SUCCESS [ 22.174 s]
[INFO] Brooklyn Karaf ..................................... SUCCESS [ 15.067 s]
[INFO] Jetty config fragment .............................. SUCCESS [ 25.383 s]
[INFO] Apache Http Component extension .................... SUCCESS [ 30.380 s]
[INFO] Brooklyn Karaf Features ............................ SUCCESS [ 12.531 s]
[INFO] Brooklyn Karaf Shell Commands ...................... SUCCESS [ 17.618 s]
[INFO] Brooklyn Library Root .............................. SUCCESS [ 11.822 s]
[INFO] Brooklyn CM SaltStack .............................. SUCCESS [ 39.604 s]
[INFO] Brooklyn CM Ansible ................................ SUCCESS [ 35.506 s]
[INFO] Brooklyn CM Integration Root ....................... SUCCESS [ 10.631 s]
[INFO] Brooklyn Network Software Entities ................. SUCCESS [ 26.750 s]
[INFO] Brooklyn OSGi Software Entities .................... SUCCESS [ 27.049 s]
[INFO] Brooklyn Database Software Entities ................ SUCCESS [ 25.714 s]
[INFO] Brooklyn Web App Software Entities ................. SUCCESS [ 36.230 s]
[INFO] Brooklyn Messaging Software Entities ............... SUCCESS [ 21.204 s]
[INFO] Brooklyn NoSQL Data Store Software Entities ........ SUCCESS [ 33.869 s]
[INFO] Brooklyn Monitoring Software Entities .............. SUCCESS [ 19.682 s]
[INFO] Brooklyn QA ........................................ SUCCESS [ 28.559 s]
[INFO] Brooklyn Examples Aggregator Project ............... SUCCESS [ 12.864 s]
[INFO] Brooklyn Examples Aggregator Project - Webapps ..... SUCCESS [ 16.905 s]
[INFO] hello-world-webapp Maven Webapp .................... SUCCESS [ 15.498 s]
[INFO] hello-world-sql-webapp Maven Webapp ................ SUCCESS [ 18.508 s]
[INFO] Brooklyn Simple Web Cluster Example ................ SUCCESS [ 23.425 s]
[INFO] Brooklyn Global Web Fabric Example ................. SUCCESS [ 19.448 s]
[INFO] Brooklyn Simple Messaging Publish-Subscribe Example  SUCCESS [ 24.055 s]
[INFO] Brooklyn NoSQL Cluster Examples .................... SUCCESS [ 17.700 s]
[INFO] Brooklyn Library Karaf integration ................. SUCCESS [ 15.558 s]
[INFO] Brooklyn Library Catalog ........................... SUCCESS [ 16.118 s]
[INFO] Brooklyn Library Karaf Features .................... SUCCESS [ 20.835 s]
[INFO] Brooklyn Client .................................... SUCCESS [ 18.547 s]
[INFO] Brooklyn Client Command Line Interface ............. SUCCESS [01:02 min]
[INFO] Brooklyn REST java Client .......................... SUCCESS [ 34.068 s]
[INFO] Brooklyn Downstream Project Parent ................. SUCCESS [  5.901 s]
[INFO] Brooklyn Dist Root ................................. SUCCESS [ 13.050 s]
[INFO] Brooklyn All Things ................................ SUCCESS [ 17.543 s]
[INFO] Brooklyn Distribution .............................. SUCCESS [ 38.108 s]
[INFO] Brooklyn Karaf Distribution Parent ................. SUCCESS [  5.289 s]
[INFO] Brooklyn Karaf Server Configuration ................ SUCCESS [ 12.889 s]
[INFO] Brooklyn Dist Karaf Features ....................... SUCCESS [  8.780 s]
[INFO] Brooklyn Karaf Distribution ........................ SUCCESS [ 24.638 s]
[INFO] Brooklyn Karaf pax-exam itest ...................... FAILURE [ 17.374 s]
[INFO] Brooklyn Vagrant Getting Started Environment ....... SKIPPED
[INFO] Brooklyn Quick-Start Project Archetype ............. SKIPPED
[INFO] Brooklyn Shared Package Files ...................... SKIPPED
[INFO] Brooklyn DEB Package ............................... SKIPPED
[INFO] Brooklyn Root ...................................... SKIPPED
[INFO] ------------------------------------------------------------------------
[INFO] BUILD FAILURE
[INFO] ------------------------------------------------------------------------
[INFO] Total time: 01:03 h
[INFO] Finished at: 2017-02-05T05:44:19+00:00
[INFO] Final Memory: 151M/493M
[INFO] ------------------------------------------------------------------------
Waiting for Jenkins to finish collecting data
[ERROR] Failed to execute goal org.apache.maven.plugins:maven-clean-plugin:2.5:clean (default-clean)
on project brooklyn-itest: Failed to clean project: Failed to delete <https://builds.apache.org/job/brooklyn-master-build/ws/brooklyn-dist/karaf/itest/target/paxexam/unpack>
-> [Help 1]
[ERROR] 
[ERROR] To see the full stack trace of the errors, re-run Maven with the -e switch.
[ERROR] Re-run Maven using the -X switch to enable full debug logging.
[ERROR] 
[ERROR] For more information about the errors and possible solutions, please read the following
articles:
[ERROR] [Help 1] http://cwiki.apache.org/confluence/display/MAVEN/MojoExecutionException
[ERROR] 
[ERROR] After correcting the problems, you can resume the build with the command
[ERROR]   mvn <goals> -rf :brooklyn-itest
[JENKINS] Archiving <https://builds.apache.org/job/brooklyn-master-build/ws/brooklyn-library/software/cm/salt/pom.xml>
to org.apache.brooklyn/brooklyn-software-cm-salt/0.11.0-SNAPSHOT/brooklyn-software-cm-salt-0.11.0-SNAPSHOT.pom
[JENKINS] Archiving <https://builds.apache.org/job/brooklyn-master-build/ws/brooklyn-library/software/cm/salt/target/brooklyn-software-cm-salt-0.11.0-SNAPSHOT.jar>
to org.apache.brooklyn/brooklyn-software-cm-salt/0.11.0-SNAPSHOT/brooklyn-software-cm-salt-0.11.0-SNAPSHOT.jar
[JENKINS] Archiving <https://builds.apache.org/job/brooklyn-master-build/ws/brooklyn-library/software/cm/salt/target/brooklyn-software-cm-salt-0.11.0-SNAPSHOT-tests.jar>
to org.apache.brooklyn/brooklyn-software-cm-salt/0.11.0-SNAPSHOT/brooklyn-software-cm-salt-0.11.0-SNAPSHOT-tests.jar
[JENKINS] Archiving <https://builds.apache.org/job/brooklyn-master-build/ws/brooklyn-library/software/cm/salt/target/brooklyn-software-cm-salt-0.11.0-SNAPSHOT-sources.jar>
to org.apache.brooklyn/brooklyn-software-cm-salt/0.11.0-SNAPSHOT/brooklyn-software-cm-salt-0.11.0-SNAPSHOT-sources.jar
[JENKINS] Archiving <https://builds.apache.org/job/brooklyn-master-build/ws/brooklyn-library/software/cm/salt/target/brooklyn-software-cm-salt-0.11.0-SNAPSHOT-test-sources.jar>
to org.apache.brooklyn/brooklyn-software-cm-salt/0.11.0-SNAPSHOT/brooklyn-software-cm-salt-0.11.0-SNAPSHOT-test-sources.jar
[JENKINS] Archiving <https://builds.apache.org/job/brooklyn-master-build/ws/brooklyn-server/core/pom.xml>
to org.apache.brooklyn/brooklyn-core/0.11.0-SNAPSHOT/brooklyn-core-0.11.0-SNAPSHOT.pom
[JENKINS] Archiving <https://builds.apache.org/job/brooklyn-master-build/ws/brooklyn-server/core/target/brooklyn-core-0.11.0-SNAPSHOT.jar>
to org.apache.brooklyn/brooklyn-core/0.11.0-SNAPSHOT/brooklyn-core-0.11.0-SNAPSHOT.jar
[JENKINS] Archiving <https://builds.apache.org/job/brooklyn-master-build/ws/brooklyn-server/core/target/brooklyn-core-0.11.0-SNAPSHOT-tests.jar>
to org.apache.brooklyn/brooklyn-core/0.11.0-SNAPSHOT/brooklyn-core-0.11.0-SNAPSHOT-tests.jar
[JENKINS] Archiving <https://builds.apache.org/job/brooklyn-master-build/ws/brooklyn-server/core/target/brooklyn-core-0.11.0-SNAPSHOT-sources.jar>
to org.apache.brooklyn/brooklyn-core/0.11.0-SNAPSHOT/brooklyn-core-0.11.0-SNAPSHOT-sources.jar
[JENKINS] Archiving <https://builds.apache.org/job/brooklyn-master-build/ws/brooklyn-server/core/target/brooklyn-core-0.11.0-SNAPSHOT-test-sources.jar>
to org.apache.brooklyn/brooklyn-core/0.11.0-SNAPSHOT/brooklyn-core-0.11.0-SNAPSHOT-test-sources.jar
Compressed 6.71 MB of artifacts by 31.2% relative to #788
[JENKINS] Archiving <https://builds.apache.org/job/brooklyn-master-build/ws/brooklyn-server/camp/camp-server/pom.xml>
to org.apache.brooklyn.camp/camp-server/0.11.0-SNAPSHOT/camp-server-0.11.0-SNAPSHOT.pom
[JENKINS] Archiving <https://builds.apache.org/job/brooklyn-master-build/ws/brooklyn-server/camp/camp-server/target/camp-server-0.11.0-SNAPSHOT.jar>
to org.apache.brooklyn.camp/camp-server/0.11.0-SNAPSHOT/camp-server-0.11.0-SNAPSHOT.jar
[JENKINS] Archiving <https://builds.apache.org/job/brooklyn-master-build/ws/brooklyn-server/camp/camp-server/target/camp-server-0.11.0-SNAPSHOT-tests.jar>
to org.apache.brooklyn.camp/camp-server/0.11.0-SNAPSHOT/camp-server-0.11.0-SNAPSHOT-tests.jar
[JENKINS] Archiving <https://builds.apache.org/job/brooklyn-master-build/ws/brooklyn-server/camp/camp-server/target/camp-server-0.11.0-SNAPSHOT-sources.jar>
to org.apache.brooklyn.camp/camp-server/0.11.0-SNAPSHOT/camp-server-0.11.0-SNAPSHOT-sources.jar
[JENKINS] Archiving <https://builds.apache.org/job/brooklyn-master-build/ws/brooklyn-server/camp/camp-server/target/camp-server-0.11.0-SNAPSHOT-test-sources.jar>
to org.apache.brooklyn.camp/camp-server/0.11.0-SNAPSHOT/camp-server-0.11.0-SNAPSHOT-test-sources.jar
No artifacts from brooklyn-master-build » CAMP Server #788 to compare, so performing full
copy of artifacts
[JENKINS] Archiving <https://builds.apache.org/job/brooklyn-master-build/ws/brooklyn-server/karaf/pom.xml>
to org.apache.brooklyn/brooklyn-karaf/0.11.0-SNAPSHOT/brooklyn-karaf-0.11.0-SNAPSHOT.pom
No artifacts from brooklyn-master-build » Brooklyn Karaf #788 to compare, so performing full
copy of artifacts
[JENKINS] Archiving <https://builds.apache.org/job/brooklyn-master-build/ws/brooklyn-server/karaf/httpcomponent-extension/pom.xml>
to org.apache.brooklyn/brooklyn-karaf-httpcomponents-extension/0.11.0-SNAPSHOT/brooklyn-karaf-httpcomponents-extension-0.11.0-SNAPSHOT.pom
[JENKINS] Archiving <https://builds.apache.org/job/brooklyn-master-build/ws/brooklyn-server/karaf/httpcomponent-extension/target/brooklyn-karaf-httpcomponents-extension-0.11.0-SNAPSHOT.jar>
to org.apache.brooklyn/brooklyn-karaf-httpcomponents-extension/0.11.0-SNAPSHOT/brooklyn-karaf-httpcomponents-extension-0.11.0-SNAPSHOT.jar
No artifacts from brooklyn-master-build » Apache Http Component extension #788 to compare,
so performing full copy of artifacts
[JENKINS] Archiving <https://builds.apache.org/job/brooklyn-master-build/ws/brooklyn-server/utils/test-support/pom.xml>
to org.apache.brooklyn/brooklyn-utils-test-support/0.11.0-SNAPSHOT/brooklyn-utils-test-support-0.11.0-SNAPSHOT.pom
[JENKINS] Archiving <https://builds.apache.org/job/brooklyn-master-build/ws/brooklyn-server/utils/test-support/target/brooklyn-utils-test-support-0.11.0-SNAPSHOT.jar>
to org.apache.brooklyn/brooklyn-utils-test-support/0.11.0-SNAPSHOT/brooklyn-utils-test-support-0.11.0-SNAPSHOT.jar
[JENKINS] Archiving <https://builds.apache.org/job/brooklyn-master-build/ws/brooklyn-server/utils/test-support/target/brooklyn-utils-test-support-0.11.0-SNAPSHOT-sources.jar>
to org.apache.brooklyn/brooklyn-utils-test-support/0.11.0-SNAPSHOT/brooklyn-utils-test-support-0.11.0-SNAPSHOT-sources.jar
[JENKINS] Archiving <https://builds.apache.org/job/brooklyn-master-build/ws/brooklyn-server/utils/test-support/target/brooklyn-utils-test-support-0.11.0-SNAPSHOT-test-sources.jar>
to org.apache.brooklyn/brooklyn-utils-test-support/0.11.0-SNAPSHOT/brooklyn-utils-test-support-0.11.0-SNAPSHOT-test-sources.jar
No artifacts from brooklyn-master-build » Brooklyn Test Support Utilities #788 to compare,
so performing full copy of artifacts
[JENKINS] Archiving <https://builds.apache.org/job/brooklyn-master-build/ws/brooklyn-dist/karaf/apache-brooklyn/pom.xml>
to org.apache.brooklyn/apache-brooklyn/0.11.0-SNAPSHOT/apache-brooklyn-0.11.0-SNAPSHOT.pom
[JENKINS] Archiving <https://builds.apache.org/job/brooklyn-master-build/ws/brooklyn-dist/karaf/apache-brooklyn/target/apache-brooklyn-0.11.0-SNAPSHOT.tar.gz>
to org.apache.brooklyn/apache-brooklyn/0.11.0-SNAPSHOT/apache-brooklyn-0.11.0-SNAPSHOT.tar.gz
[JENKINS] Archiving <https://builds.apache.org/job/brooklyn-master-build/ws/brooklyn-dist/karaf/apache-brooklyn/target/apache-brooklyn-0.11.0-SNAPSHOT.zip>
to org.apache.brooklyn/apache-brooklyn/0.11.0-SNAPSHOT/apache-brooklyn-0.11.0-SNAPSHOT.zip
No artifacts from brooklyn-master-build » Brooklyn Karaf Distribution #788 to compare, so
performing full copy of artifacts
[JENKINS] Archiving <https://builds.apache.org/job/brooklyn-master-build/ws/brooklyn-library/software/nosql/pom.xml>
to org.apache.brooklyn/brooklyn-software-nosql/0.11.0-SNAPSHOT/brooklyn-software-nosql-0.11.0-SNAPSHOT.pom
[JENKINS] Archiving <https://builds.apache.org/job/brooklyn-master-build/ws/brooklyn-library/software/nosql/target/brooklyn-software-nosql-0.11.0-SNAPSHOT.jar>
to org.apache.brooklyn/brooklyn-software-nosql/0.11.0-SNAPSHOT/brooklyn-software-nosql-0.11.0-SNAPSHOT.jar
[JENKINS] Archiving <https://builds.apache.org/job/brooklyn-master-build/ws/brooklyn-library/software/nosql/target/brooklyn-software-nosql-0.11.0-SNAPSHOT-tests.jar>
to org.apache.brooklyn/brooklyn-software-nosql/0.11.0-SNAPSHOT/brooklyn-software-nosql-0.11.0-SNAPSHOT-tests.jar
[JENKINS] Archiving <https://builds.apache.org/job/brooklyn-master-build/ws/brooklyn-library/software/nosql/target/brooklyn-software-nosql-0.11.0-SNAPSHOT-sources.jar>
to org.apache.brooklyn/brooklyn-software-nosql/0.11.0-SNAPSHOT/brooklyn-software-nosql-0.11.0-SNAPSHOT-sources.jar
[JENKINS] Archiving <https://builds.apache.org/job/brooklyn-master-build/ws/brooklyn-library/software/nosql/target/brooklyn-software-nosql-0.11.0-SNAPSHOT-test-sources.jar>
to org.apache.brooklyn/brooklyn-software-nosql/0.11.0-SNAPSHOT/brooklyn-software-nosql-0.11.0-SNAPSHOT-test-sources.jar
No artifacts from brooklyn-master-build » Brooklyn NoSQL Data Store Software Entities #788
to compare, so performing full copy of artifacts
[JENKINS] Archiving <https://builds.apache.org/job/brooklyn-master-build/ws/brooklyn-server/utils/groovy/pom.xml>
to org.apache.brooklyn/brooklyn-utils-groovy/0.11.0-SNAPSHOT/brooklyn-utils-groovy-0.11.0-SNAPSHOT.pom
[JENKINS] Archiving <https://builds.apache.org/job/brooklyn-master-build/ws/brooklyn-server/utils/groovy/target/brooklyn-utils-groovy-0.11.0-SNAPSHOT.jar>
to org.apache.brooklyn/brooklyn-utils-groovy/0.11.0-SNAPSHOT/brooklyn-utils-groovy-0.11.0-SNAPSHOT.jar
[JENKINS] Archiving <https://builds.apache.org/job/brooklyn-master-build/ws/brooklyn-server/utils/groovy/target/brooklyn-utils-groovy-0.11.0-SNAPSHOT-tests.jar>
to org.apache.brooklyn/brooklyn-utils-groovy/0.11.0-SNAPSHOT/brooklyn-utils-groovy-0.11.0-SNAPSHOT-tests.jar
[JENKINS] Archiving <https://builds.apache.org/job/brooklyn-master-build/ws/brooklyn-server/utils/groovy/target/brooklyn-utils-groovy-0.11.0-SNAPSHOT-sources.jar>
to org.apache.brooklyn/brooklyn-utils-groovy/0.11.0-SNAPSHOT/brooklyn-utils-groovy-0.11.0-SNAPSHOT-sources.jar
[JENKINS] Archiving <https://builds.apache.org/job/brooklyn-master-build/ws/brooklyn-server/utils/groovy/target/brooklyn-utils-groovy-0.11.0-SNAPSHOT-test-sources.jar>
to org.apache.brooklyn/brooklyn-utils-groovy/0.11.0-SNAPSHOT/brooklyn-utils-groovy-0.11.0-SNAPSHOT-test-sources.jar
No artifacts from brooklyn-master-build » Brooklyn Groovy Utilities #788 to compare, so performing
full copy of artifacts
[JENKINS] Archiving <https://builds.apache.org/job/brooklyn-master-build/ws/brooklyn-server/launcher-common/pom.xml>
to org.apache.brooklyn/brooklyn-launcher-common/0.11.0-SNAPSHOT/brooklyn-launcher-common-0.11.0-SNAPSHOT.pom
[JENKINS] Archiving <https://builds.apache.org/job/brooklyn-master-build/ws/brooklyn-server/launcher-common/target/brooklyn-launcher-common-0.11.0-SNAPSHOT.jar>
to org.apache.brooklyn/brooklyn-launcher-common/0.11.0-SNAPSHOT/brooklyn-launcher-common-0.11.0-SNAPSHOT.jar
[JENKINS] Archiving <https://builds.apache.org/job/brooklyn-master-build/ws/brooklyn-server/launcher-common/target/brooklyn-launcher-common-0.11.0-SNAPSHOT-tests.jar>
to org.apache.brooklyn/brooklyn-launcher-common/0.11.0-SNAPSHOT/brooklyn-launcher-common-0.11.0-SNAPSHOT-tests.jar
[JENKINS] Archiving <https://builds.apache.org/job/brooklyn-master-build/ws/brooklyn-server/launcher-common/target/brooklyn-launcher-common-0.11.0-SNAPSHOT-sources.jar>
to org.apache.brooklyn/brooklyn-launcher-common/0.11.0-SNAPSHOT/brooklyn-launcher-common-0.11.0-SNAPSHOT-sources.jar
[JENKINS] Archiving <https://builds.apache.org/job/brooklyn-master-build/ws/brooklyn-server/launcher-common/target/brooklyn-launcher-common-0.11.0-SNAPSHOT-test-sources.jar>
to org.apache.brooklyn/brooklyn-launcher-common/0.11.0-SNAPSHOT/brooklyn-launcher-common-0.11.0-SNAPSHOT-test-sources.jar
No artifacts from brooklyn-master-build » Brooklyn Launcher Common #788 to compare, so performing
full copy of artifacts
[JENKINS] Archiving <https://builds.apache.org/job/brooklyn-master-build/ws/brooklyn-library/examples/webapps/pom.xml>
to org.apache.brooklyn.example/brooklyn-examples-webapps-parent/0.11.0-SNAPSHOT/brooklyn-examples-webapps-parent-0.11.0-SNAPSHOT.pom
No artifacts from brooklyn-master-build » Brooklyn Examples Aggregator Project - Webapps
#788 to compare, so performing full copy of artifacts
[JENKINS] Archiving <https://builds.apache.org/job/brooklyn-master-build/ws/brooklyn-library/examples/simple-web-cluster/pom.xml>
to org.apache.brooklyn.example/brooklyn-example-simple-web-cluster/0.11.0-SNAPSHOT/brooklyn-example-simple-web-cluster-0.11.0-SNAPSHOT.pom
[JENKINS] Archiving <https://builds.apache.org/job/brooklyn-master-build/ws/brooklyn-library/examples/simple-web-cluster/target/brooklyn-example-simple-web-cluster-0.11.0-SNAPSHOT.jar>
to org.apache.brooklyn.example/brooklyn-example-simple-web-cluster/0.11.0-SNAPSHOT/brooklyn-example-simple-web-cluster-0.11.0-SNAPSHOT.jar
[JENKINS] Archiving <https://builds.apache.org/job/brooklyn-master-build/ws/brooklyn-library/examples/simple-web-cluster/target/brooklyn-example-simple-web-cluster-0.11.0-SNAPSHOT-tests.jar>
to org.apache.brooklyn.example/brooklyn-example-simple-web-cluster/0.11.0-SNAPSHOT/brooklyn-example-simple-web-cluster-0.11.0-SNAPSHOT-tests.jar
[JENKINS] Archiving <https://builds.apache.org/job/brooklyn-master-build/ws/brooklyn-library/examples/simple-web-cluster/target/brooklyn-example-simple-web-cluster-0.11.0-SNAPSHOT-sources.jar>
to org.apache.brooklyn.example/brooklyn-example-simple-web-cluster/0.11.0-SNAPSHOT/brooklyn-example-simple-web-cluster-0.11.0-SNAPSHOT-sources.jar
[JENKINS] Archiving <https://builds.apache.org/job/brooklyn-master-build/ws/brooklyn-library/examples/simple-web-cluster/target/brooklyn-example-simple-web-cluster-0.11.0-SNAPSHOT-test-sources.jar>
to org.apache.brooklyn.example/brooklyn-example-simple-web-cluster/0.11.0-SNAPSHOT/brooklyn-example-simple-web-cluster-0.11.0-SNAPSHOT-test-sources.jar
No artifacts from brooklyn-master-build » Brooklyn Simple Web Cluster Example #788 to compare,
so performing full copy of artifacts
[JENKINS] Archiving <https://builds.apache.org/job/brooklyn-master-build/ws/brooklyn-dist/karaf/itest/pom.xml>
to org.apache.brooklyn/brooklyn-itest/0.11.0-SNAPSHOT/brooklyn-itest-0.11.0-SNAPSHOT.pom
[JENKINS] Archiving <https://builds.apache.org/job/brooklyn-master-build/ws/brooklyn-library/examples/pom.xml>
to org.apache.brooklyn.example/brooklyn-examples-parent/0.11.0-SNAPSHOT/brooklyn-examples-parent-0.11.0-SNAPSHOT.pom
No artifacts from brooklyn-master-build » Brooklyn Examples Aggregator Project #788 to compare,
so performing full copy of artifacts
[JENKINS] Archiving <https://builds.apache.org/job/brooklyn-master-build/ws/brooklyn-dist/dist/pom.xml>
to org.apache.brooklyn/brooklyn-dist/0.11.0-SNAPSHOT/brooklyn-dist-0.11.0-SNAPSHOT.pom
[JENKINS] Archiving <https://builds.apache.org/job/brooklyn-master-build/ws/brooklyn-dist/dist/target/brooklyn-dist-0.11.0-SNAPSHOT.jar>
to org.apache.brooklyn/brooklyn-dist/0.11.0-SNAPSHOT/brooklyn-dist-0.11.0-SNAPSHOT.jar
[JENKINS] Archiving <https://builds.apache.org/job/brooklyn-master-build/ws/brooklyn-dist/dist/target/brooklyn-dist-0.11.0-SNAPSHOT-tests.jar>
to org.apache.brooklyn/brooklyn-dist/0.11.0-SNAPSHOT/brooklyn-dist-0.11.0-SNAPSHOT-tests.jar
[JENKINS] Archiving <https://builds.apache.org/job/brooklyn-master-build/ws/brooklyn-dist/dist/target/brooklyn-dist-0.11.0-SNAPSHOT-dist.tar.gz>
to org.apache.brooklyn/brooklyn-dist/0.11.0-SNAPSHOT/brooklyn-dist-0.11.0-SNAPSHOT-dist.tar.gz
[JENKINS] Archiving <https://builds.apache.org/job/brooklyn-master-build/ws/brooklyn-dist/dist/target/brooklyn-dist-0.11.0-SNAPSHOT-dist.zip>
to org.apache.brooklyn/brooklyn-dist/0.11.0-SNAPSHOT/brooklyn-dist-0.11.0-SNAPSHOT-dist.zip
[JENKINS] Archiving <https://builds.apache.org/job/brooklyn-master-build/ws/brooklyn-dist/dist/target/brooklyn-dist-0.11.0-SNAPSHOT-sources.jar>
to org.apache.brooklyn/brooklyn-dist/0.11.0-SNAPSHOT/brooklyn-dist-0.11.0-SNAPSHOT-sources.jar
[JENKINS] Archiving <https://builds.apache.org/job/brooklyn-master-build/ws/brooklyn-dist/dist/target/brooklyn-dist-0.11.0-SNAPSHOT-test-sources.jar>
to org.apache.brooklyn/brooklyn-dist/0.11.0-SNAPSHOT/brooklyn-dist-0.11.0-SNAPSHOT-test-sources.jar
No artifacts from brooklyn-master-build » Brooklyn Distribution #788 to compare, so performing
full copy of artifacts
Build timed out (after 90 minutes). Marking the build as aborted.
ERROR: Failed to parse POMs
java.io.IOException: Failed to extract <https://builds.apache.org/job/brooklyn-master-build/ws/brooklyn-dist/dist/transfer>
of 7 files
	at hudson.FilePath.readFromTar(FilePath.java:2328)
	at hudson.FilePath.copyRecursiveTo(FilePath.java:2237)
	at jenkins.model.StandardArtifactManager.archive(StandardArtifactManager.java:61)
	at com.cloudbees.jenkins.plugins.jsync.archiver.JSyncArtifactManager.remoteSync(JSyncArtifactManager.java:128)
	at com.cloudbees.jenkins.plugins.jsync.archiver.JSyncArtifactManager.archive(JSyncArtifactManager.java:76)
	at hudson.maven.MavenBuild$ProxyImpl.performArchiving(MavenBuild.java:483)
	at hudson.maven.MavenModuleSetBuild$MavenModuleSetBuildExecution.doRun(MavenModuleSetBuild.java:855)
	at hudson.model.AbstractBuild$AbstractBuildExecution.run(AbstractBuild.java:534)
	at hudson.model.Run.execute(Run.java:1741)
	at hudson.maven.MavenModuleSetBuild.run(MavenModuleSetBuild.java:531)
	at hudson.model.ResourceController.execute(ResourceController.java:98)
	at hudson.model.Executor.run(Executor.java:410)
Caused by: java.io.IOException: java.lang.InterruptedException
	at hudson.remoting.FastPipedInputStream.read(FastPipedInputStream.java:177)
	at hudson.util.HeadBufferingStream.read(HeadBufferingStream.java:61)
	at com.jcraft.jzlib.InflaterInputStream.fill(InflaterInputStream.java:175)
	at com.jcraft.jzlib.InflaterInputStream.read(InflaterInputStream.java:106)
	at org.apache.commons.compress.archivers.tar.TarArchiveInputStream.read(TarArchiveInputStream.java:614)
	at java.io.InputStream.read(InputStream.java:101)
	at org.apache.commons.io.IOUtils.copyLarge(IOUtils.java:1792)
	at org.apache.commons.io.IOUtils.copyLarge(IOUtils.java:1769)
	at org.apache.commons.io.IOUtils.copy(IOUtils.java:1744)
	at hudson.util.IOUtils.copy(IOUtils.java:40)
	at hudson.FilePath.readFromTar(FilePath.java:2318)
	... 11 more
Caused by: java.lang.InterruptedException
	at java.lang.Object.wait(Native Method)
	at hudson.remoting.FastPipedInputStream.read(FastPipedInputStream.java:175)
	... 21 more
channel stopped

Mime
View raw message