brooklyn-dev mailing list archives

Site index · List index
Message view « Date » · « Thread »
Top « Date » · « Thread »
From Apache Jenkins Server <jenk...@builds.apache.org>
Subject Build failed in Jenkins: brooklyn-server-master #386
Date Fri, 09 Dec 2016 13:04:10 GMT
See <https://builds.apache.org/job/brooklyn-server-master/386/changes>

Changes:

[svetoslav.neykov] Upgrade karaf-maven-plugin to avoid double User-Agent bug

------------------------------------------
[...truncated 25620 lines...]
2016-12-09 12:59:54,222 INFO  TESTNG INVOKING CONFIGURATION: "Surefire test" - @AfterMethod
org.apache.brooklyn.policy.enricher.RebindEnricherTest.tearDown()
2016-12-09 12:59:54,252 INFO  TESTNG PASSED CONFIGURATION: "Surefire test" - @AfterMethod
org.apache.brooklyn.policy.enricher.RebindEnricherTest.tearDown() finished in 30 ms
2016-12-09 12:59:54,358 INFO  TESTNG 
===============================================
    Surefire test
    Tests run: 226, Failures: 1, Skips: 0
===============================================
2016-12-09 12:59:54,360 WARN  Management Context LocalManagementContext[H8BRiwvq-Dib0EG1q]
running, creation stacktrace:
java.lang.Throwable: for construction stacktrace
	at org.apache.brooklyn.core.mgmt.internal.LocalManagementContext.<init>(LocalManagementContext.java:131)
	at org.apache.brooklyn.core.mgmt.internal.LocalManagementContext.<init>(LocalManagementContext.java:164)
	at org.apache.brooklyn.core.mgmt.internal.LocalManagementContext.<init>(LocalManagementContext.java:156)
	at org.apache.brooklyn.core.mgmt.internal.LocalManagementContext.<init>(LocalManagementContext.java:143)
	at org.apache.brooklyn.core.test.entity.LocalManagementContextForTests.<init>(LocalManagementContextForTests.java:43)
	at org.apache.brooklyn.core.test.entity.LocalManagementContextForTests$Builder.build(LocalManagementContextForTests.java:145)
	at org.apache.brooklyn.core.test.entity.LocalManagementContextForTests.newInstance(LocalManagementContextForTests.java:160)
	at org.apache.brooklyn.core.mgmt.rebind.RebindTestFixture.createOrigManagementContext(RebindTestFixture.java:104)
	at org.apache.brooklyn.core.mgmt.rebind.RebindTestFixture.setUp(RebindTestFixture.java:88)
	at sun.reflect.NativeMethodAccessorImpl.invoke0(Native Method)
	at sun.reflect.NativeMethodAccessorImpl.invoke(NativeMethodAccessorImpl.java:57)
	at sun.reflect.DelegatingMethodAccessorImpl.invoke(DelegatingMethodAccessorImpl.java:43)
	at java.lang.reflect.Method.invoke(Method.java:606)
	at org.testng.internal.MethodInvocationHelper.invokeMethod(MethodInvocationHelper.java:86)
	at org.testng.internal.Invoker.invokeConfigurationMethod(Invoker.java:514)
	at org.testng.internal.Invoker.invokeConfigurations(Invoker.java:215)
	at org.testng.internal.Invoker.invokeMethod(Invoker.java:589)
	at org.testng.internal.Invoker.invokeTestMethod(Invoker.java:820)
	at org.testng.internal.Invoker.invokeTestMethods(Invoker.java:1128)
	at org.testng.internal.TestMethodWorker.invokeTestMethods(TestMethodWorker.java:129)
	at org.testng.internal.TestMethodWorker.run(TestMethodWorker.java:112)
	at org.testng.TestRunner.privateRun(TestRunner.java:782)
	at org.testng.TestRunner.run(TestRunner.java:632)
	at org.testng.SuiteRunner.runTest(SuiteRunner.java:366)
	at org.testng.SuiteRunner.runSequentially(SuiteRunner.java:361)
	at org.testng.SuiteRunner.privateRun(SuiteRunner.java:319)
	at org.testng.SuiteRunner.run(SuiteRunner.java:268)
	at org.testng.SuiteRunnerWorker.runSuite(SuiteRunnerWorker.java:52)
	at org.testng.SuiteRunnerWorker.run(SuiteRunnerWorker.java:86)
	at org.testng.TestNG.runSuitesSequentially(TestNG.java:1244)
	at org.testng.TestNG.runSuitesLocally(TestNG.java:1169)
	at org.testng.TestNG.run(TestNG.java:1064)
	at org.apache.maven.surefire.testng.TestNGExecutor.run(TestNGExecutor.java:132)
	at org.apache.maven.surefire.testng.TestNGDirectoryTestSuite.executeMulti(TestNGDirectoryTestSuite.java:193)
	at org.apache.maven.surefire.testng.TestNGDirectoryTestSuite.execute(TestNGDirectoryTestSuite.java:94)
	at org.apache.maven.surefire.testng.TestNGProvider.invoke(TestNGProvider.java:147)
	at org.apache.maven.surefire.booter.ForkedBooter.invokeProviderInSameClassLoader(ForkedBooter.java:290)
	at org.apache.maven.surefire.booter.ForkedBooter.runSuitesInProcess(ForkedBooter.java:242)
	at org.apache.maven.surefire.booter.ForkedBooter.main(ForkedBooter.java:121)

2016-12-09 12:59:54,360 WARN  Management Context LocalManagementContext[KekpxEfq-ziOa4YLq]
running, creation stacktrace:
java.lang.Throwable: for construction stacktrace
	at org.apache.brooklyn.core.mgmt.internal.LocalManagementContext.<init>(LocalManagementContext.java:131)
	at org.apache.brooklyn.core.mgmt.internal.LocalManagementContext.<init>(LocalManagementContext.java:164)
	at org.apache.brooklyn.core.mgmt.internal.LocalManagementContext.<init>(LocalManagementContext.java:156)
	at org.apache.brooklyn.core.mgmt.internal.LocalManagementContext.<init>(LocalManagementContext.java:143)
	at org.apache.brooklyn.core.test.entity.LocalManagementContextForTests.<init>(LocalManagementContextForTests.java:43)
	at org.apache.brooklyn.core.test.entity.LocalManagementContextForTests$Builder.build(LocalManagementContextForTests.java:145)
	at org.apache.brooklyn.core.test.entity.LocalManagementContextForTests.newInstance(LocalManagementContextForTests.java:160)
	at org.apache.brooklyn.core.mgmt.rebind.RebindTestFixture.createOrigManagementContext(RebindTestFixture.java:104)
	at org.apache.brooklyn.core.mgmt.rebind.RebindTestFixture.setUp(RebindTestFixture.java:88)
	at sun.reflect.NativeMethodAccessorImpl.invoke0(Native Method)
	at sun.reflect.NativeMethodAccessorImpl.invoke(NativeMethodAccessorImpl.java:57)
	at sun.reflect.DelegatingMethodAccessorImpl.invoke(DelegatingMethodAccessorImpl.java:43)
	at java.lang.reflect.Method.invoke(Method.java:606)
	at org.testng.internal.MethodInvocationHelper.invokeMethod(MethodInvocationHelper.java:86)
	at org.testng.internal.Invoker.invokeConfigurationMethod(Invoker.java:514)
	at org.testng.internal.Invoker.invokeConfigurations(Invoker.java:215)
	at org.testng.internal.Invoker.invokeMethod(Invoker.java:589)
	at org.testng.internal.Invoker.invokeTestMethod(Invoker.java:820)
	at org.testng.internal.Invoker.invokeTestMethods(Invoker.java:1128)
	at org.testng.internal.TestMethodWorker.invokeTestMethods(TestMethodWorker.java:129)
	at org.testng.internal.TestMethodWorker.run(TestMethodWorker.java:112)
	at org.testng.TestRunner.privateRun(TestRunner.java:782)
	at org.testng.TestRunner.run(TestRunner.java:632)
	at org.testng.SuiteRunner.runTest(SuiteRunner.java:366)
	at org.testng.SuiteRunner.runSequentially(SuiteRunner.java:361)
	at org.testng.SuiteRunner.privateRun(SuiteRunner.java:319)
	at org.testng.SuiteRunner.run(SuiteRunner.java:268)
	at org.testng.SuiteRunnerWorker.runSuite(SuiteRunnerWorker.java:52)
	at org.testng.SuiteRunnerWorker.run(SuiteRunnerWorker.java:86)
	at org.testng.TestNG.runSuitesSequentially(TestNG.java:1244)
	at org.testng.TestNG.runSuitesLocally(TestNG.java:1169)
	at org.testng.TestNG.run(TestNG.java:1064)
	at org.apache.maven.surefire.testng.TestNGExecutor.run(TestNGExecutor.java:132)
	at org.apache.maven.surefire.testng.TestNGDirectoryTestSuite.executeMulti(TestNGDirectoryTestSuite.java:193)
	at org.apache.maven.surefire.testng.TestNGDirectoryTestSuite.execute(TestNGDirectoryTestSuite.java:94)
	at org.apache.maven.surefire.testng.TestNGProvider.invoke(TestNGProvider.java:147)
	at org.apache.maven.surefire.booter.ForkedBooter.invokeProviderInSameClassLoader(ForkedBooter.java:290)
	at org.apache.maven.surefire.booter.ForkedBooter.runSuitesInProcess(ForkedBooter.java:242)
	at org.apache.maven.surefire.booter.ForkedBooter.main(ForkedBooter.java:121)

2016-12-09 12:59:54,361 INFO  BrooklynLeakListener.onFinish attempting to terminate all extant
ManagementContexts: name=Surefire test; includedGroups=[]; excludedGroups=[Integration, Live-sanity,
Acceptance, Live, Broken, WIP]; suiteName=Surefire suite; outDir=<https://builds.apache.org/job/brooklyn-server-master/ws/policy/target/surefire-reports/Surefire>
suite: 2 ManagementContexts terminated
Tests run: 226, Failures: 1, Errors: 0, Skipped: 0, Time elapsed: 165.586 sec <<<
FAILURE! - in TestSuite
testDisablingOnFire(org.apache.brooklyn.policy.ha.ServiceFailureDetectorTest)  Time elapsed:
0.021 sec  <<< FAILURE!
java.lang.AssertionError: expected [running] but found [on-fire]
	at org.apache.brooklyn.policy.ha.ServiceFailureDetectorTest.testDisablingOnFire(ServiceFailureDetectorTest.java:223)


Results :

Failed tests: 
  ServiceFailureDetectorTest.testDisablingOnFire:223 expected [running] but found [on-fire]

Tests run: 226, Failures: 1, Errors: 0, Skipped: 0

[JENKINS] Recording test results
[INFO] ------------------------------------------------------------------------
[INFO] Reactor Summary:
[INFO] 
[INFO] Brooklyn Server Root ............................... SUCCESS [  5.930 s]
[INFO] Brooklyn Parent Project ............................ SUCCESS [  6.047 s]
[INFO] Brooklyn Test Support Utilities .................... SUCCESS [ 15.869 s]
[INFO] Brooklyn Logback Includable Configuration .......... SUCCESS [  5.198 s]
[INFO] Brooklyn Common Utilities .......................... SUCCESS [01:01 min]
[INFO] Brooklyn API ....................................... SUCCESS [ 11.355 s]
[INFO] CAMP Server Parent Project ......................... SUCCESS [  5.040 s]
[INFO] CAMP Base .......................................... SUCCESS [ 12.735 s]
[INFO] Brooklyn Test Support .............................. SUCCESS [  6.573 s]
[INFO] Brooklyn REST Swagger Apidoc Utilities ............. SUCCESS [  6.459 s]
[INFO] Brooklyn Logback Configuration ..................... SUCCESS [  5.223 s]
[INFO] CAMP Server ........................................ SUCCESS [ 14.217 s]
[INFO] Brooklyn Felix Runtime ............................. SUCCESS [ 12.342 s]
[INFO] Brooklyn Groovy Utilities .......................... SUCCESS [  8.305 s]
[INFO] Brooklyn Core ...................................... SUCCESS [08:08 min]
[INFO] Brooklyn Policies .................................. FAILURE [02:56 min]
[INFO] Brooklyn WinRM Software Entities ................... SKIPPED
[INFO] Brooklyn Secure JMXMP Agent ........................ SKIPPED
[INFO] Brooklyn JMX RMI Agent ............................. SKIPPED
[INFO] Brooklyn Jclouds Location Targets .................. SKIPPED
[INFO] Brooklyn Software Base ............................. SKIPPED
[INFO] Brooklyn CAMP ...................................... SKIPPED
[INFO] Brooklyn Hazelcast Storage ......................... SKIPPED
[INFO] Brooklyn Launcher Common ........................... SKIPPED
[INFO] Brooklyn REST API .................................. SKIPPED
[INFO] Brooklyn REST Resources ............................ SKIPPED
[INFO] Brooklyn REST Server ............................... SKIPPED
[INFO] Brooklyn Launcher .................................. SKIPPED
[INFO] Brooklyn Command Line Interface .................... SKIPPED
[INFO] Brooklyn Test Framework ............................ SKIPPED
[INFO] Brooklyn OSGi init ................................. SKIPPED
[INFO] Brooklyn Karaf ..................................... SKIPPED
[INFO] Jetty config fragment .............................. SKIPPED
[INFO] Apache Http Component extension .................... SKIPPED
[INFO] Brooklyn Karaf Features ............................ SKIPPED
[INFO] Brooklyn Karaf Shell Commands ...................... SKIPPED
[INFO] ------------------------------------------------------------------------
[INFO] BUILD FAILURE
[INFO] ------------------------------------------------------------------------
[INFO] Total time: 15:33 min
[INFO] Finished at: 2016-12-09T13:00:21+00:00
[INFO] Final Memory: 96M/641M
[INFO] ------------------------------------------------------------------------
Waiting for Jenkins to finish collecting data
[ERROR] Failed to execute goal org.apache.maven.plugins:maven-surefire-plugin:2.19.1:test
(default-test) on project brooklyn-policy: There are test failures.
[ERROR] 
[ERROR] Please refer to <https://builds.apache.org/job/brooklyn-server-master/ws/policy/target/surefire-reports>
for the individual test results.
[ERROR] -> [Help 1]
[ERROR] 
[ERROR] To see the full stack trace of the errors, re-run Maven with the -e switch.
[ERROR] Re-run Maven using the -X switch to enable full debug logging.
[ERROR] 
[ERROR] For more information about the errors and possible solutions, please read the following
articles:
[ERROR] [Help 1] http://cwiki.apache.org/confluence/display/MAVEN/MojoFailureException
[ERROR] 
[ERROR] After correcting the problems, you can resume the build with the command
[ERROR]   mvn <goals> -rf :brooklyn-policy
[JENKINS] Archiving <https://builds.apache.org/job/brooklyn-server-master/ws/camp/pom.xml>
to org.apache.brooklyn.camp/camp-parent/0.11.0-SNAPSHOT/camp-parent-0.11.0-SNAPSHOT.pom
[JENKINS] Archiving <https://builds.apache.org/job/brooklyn-server-master/ws/utils/rt-felix/pom.xml>
to org.apache.brooklyn/brooklyn-rt-felix/0.11.0-SNAPSHOT/brooklyn-rt-felix-0.11.0-SNAPSHOT.pom
[JENKINS] Archiving <https://builds.apache.org/job/brooklyn-server-master/ws/utils/rt-felix/target/brooklyn-rt-felix-0.11.0-SNAPSHOT.jar>
to org.apache.brooklyn/brooklyn-rt-felix/0.11.0-SNAPSHOT/brooklyn-rt-felix-0.11.0-SNAPSHOT.jar
[JENKINS] Archiving <https://builds.apache.org/job/brooklyn-server-master/ws/utils/rt-felix/target/brooklyn-rt-felix-0.11.0-SNAPSHOT-tests.jar>
to org.apache.brooklyn/brooklyn-rt-felix/0.11.0-SNAPSHOT/brooklyn-rt-felix-0.11.0-SNAPSHOT-tests.jar
[JENKINS] Archiving <https://builds.apache.org/job/brooklyn-server-master/ws/utils/rt-felix/target/brooklyn-rt-felix-0.11.0-SNAPSHOT-sources.jar>
to org.apache.brooklyn/brooklyn-rt-felix/0.11.0-SNAPSHOT/brooklyn-rt-felix-0.11.0-SNAPSHOT-sources.jar
[JENKINS] Archiving <https://builds.apache.org/job/brooklyn-server-master/ws/utils/rt-felix/target/brooklyn-rt-felix-0.11.0-SNAPSHOT-test-sources.jar>
to org.apache.brooklyn/brooklyn-rt-felix/0.11.0-SNAPSHOT/brooklyn-rt-felix-0.11.0-SNAPSHOT-test-sources.jar
[JENKINS] Archiving <https://builds.apache.org/job/brooklyn-server-master/ws/test-framework/pom.xml>
to org.apache.brooklyn/brooklyn-test-framework/0.11.0-SNAPSHOT/brooklyn-test-framework-0.11.0-SNAPSHOT.pom
[JENKINS] Archiving <https://builds.apache.org/job/brooklyn-server-master/ws/core/pom.xml>
to org.apache.brooklyn/brooklyn-core/0.11.0-SNAPSHOT/brooklyn-core-0.11.0-SNAPSHOT.pom
[JENKINS] Archiving <https://builds.apache.org/job/brooklyn-server-master/ws/core/target/brooklyn-core-0.11.0-SNAPSHOT.jar>
to org.apache.brooklyn/brooklyn-core/0.11.0-SNAPSHOT/brooklyn-core-0.11.0-SNAPSHOT.jar
[JENKINS] Archiving <https://builds.apache.org/job/brooklyn-server-master/ws/core/target/brooklyn-core-0.11.0-SNAPSHOT-tests.jar>
to org.apache.brooklyn/brooklyn-core/0.11.0-SNAPSHOT/brooklyn-core-0.11.0-SNAPSHOT-tests.jar
[JENKINS] Archiving <https://builds.apache.org/job/brooklyn-server-master/ws/core/target/brooklyn-core-0.11.0-SNAPSHOT-sources.jar>
to org.apache.brooklyn/brooklyn-core/0.11.0-SNAPSHOT/brooklyn-core-0.11.0-SNAPSHOT-sources.jar
[JENKINS] Archiving <https://builds.apache.org/job/brooklyn-server-master/ws/core/target/brooklyn-core-0.11.0-SNAPSHOT-test-sources.jar>
to org.apache.brooklyn/brooklyn-core/0.11.0-SNAPSHOT/brooklyn-core-0.11.0-SNAPSHOT-test-sources.jar
Compressed 6.69 MB of artifacts by 31.3% relative to #385
[JENKINS] Archiving <https://builds.apache.org/job/brooklyn-server-master/ws/camp/camp-server/pom.xml>
to org.apache.brooklyn.camp/camp-server/0.11.0-SNAPSHOT/camp-server-0.11.0-SNAPSHOT.pom
[JENKINS] Archiving <https://builds.apache.org/job/brooklyn-server-master/ws/camp/camp-server/target/camp-server-0.11.0-SNAPSHOT.jar>
to org.apache.brooklyn.camp/camp-server/0.11.0-SNAPSHOT/camp-server-0.11.0-SNAPSHOT.jar
[JENKINS] Archiving <https://builds.apache.org/job/brooklyn-server-master/ws/camp/camp-server/target/camp-server-0.11.0-SNAPSHOT-tests.jar>
to org.apache.brooklyn.camp/camp-server/0.11.0-SNAPSHOT/camp-server-0.11.0-SNAPSHOT-tests.jar
[JENKINS] Archiving <https://builds.apache.org/job/brooklyn-server-master/ws/camp/camp-server/target/camp-server-0.11.0-SNAPSHOT-sources.jar>
to org.apache.brooklyn.camp/camp-server/0.11.0-SNAPSHOT/camp-server-0.11.0-SNAPSHOT-sources.jar
[JENKINS] Archiving <https://builds.apache.org/job/brooklyn-server-master/ws/camp/camp-server/target/camp-server-0.11.0-SNAPSHOT-test-sources.jar>
to org.apache.brooklyn.camp/camp-server/0.11.0-SNAPSHOT/camp-server-0.11.0-SNAPSHOT-test-sources.jar
[JENKINS] Archiving <https://builds.apache.org/job/brooklyn-server-master/ws/launcher/pom.xml>
to org.apache.brooklyn/brooklyn-launcher/0.11.0-SNAPSHOT/brooklyn-launcher-0.11.0-SNAPSHOT.pom
[JENKINS] Archiving <https://builds.apache.org/job/brooklyn-server-master/ws/karaf/pom.xml>
to org.apache.brooklyn/brooklyn-karaf/0.11.0-SNAPSHOT/brooklyn-karaf-0.11.0-SNAPSHOT.pom
[JENKINS] Archiving <https://builds.apache.org/job/brooklyn-server-master/ws/karaf/httpcomponent-extension/pom.xml>
to org.apache.brooklyn/brooklyn-karaf-httpcomponents-extension/0.11.0-SNAPSHOT/brooklyn-karaf-httpcomponents-extension-0.11.0-SNAPSHOT.pom
[JENKINS] Archiving <https://builds.apache.org/job/brooklyn-server-master/ws/utils/test-support/pom.xml>
to org.apache.brooklyn/brooklyn-utils-test-support/0.11.0-SNAPSHOT/brooklyn-utils-test-support-0.11.0-SNAPSHOT.pom
[JENKINS] Archiving <https://builds.apache.org/job/brooklyn-server-master/ws/utils/test-support/target/brooklyn-utils-test-support-0.11.0-SNAPSHOT.jar>
to org.apache.brooklyn/brooklyn-utils-test-support/0.11.0-SNAPSHOT/brooklyn-utils-test-support-0.11.0-SNAPSHOT.jar
[JENKINS] Archiving <https://builds.apache.org/job/brooklyn-server-master/ws/utils/test-support/target/brooklyn-utils-test-support-0.11.0-SNAPSHOT-sources.jar>
to org.apache.brooklyn/brooklyn-utils-test-support/0.11.0-SNAPSHOT/brooklyn-utils-test-support-0.11.0-SNAPSHOT-sources.jar
[JENKINS] Archiving <https://builds.apache.org/job/brooklyn-server-master/ws/utils/test-support/target/brooklyn-utils-test-support-0.11.0-SNAPSHOT-test-sources.jar>
to org.apache.brooklyn/brooklyn-utils-test-support/0.11.0-SNAPSHOT/brooklyn-utils-test-support-0.11.0-SNAPSHOT-test-sources.jar
[JENKINS] Archiving <https://builds.apache.org/job/brooklyn-server-master/ws/software/base/pom.xml>
to org.apache.brooklyn/brooklyn-software-base/0.11.0-SNAPSHOT/brooklyn-software-base-0.11.0-SNAPSHOT.pom
[JENKINS] Archiving <https://builds.apache.org/job/brooklyn-server-master/ws/utils/groovy/pom.xml>
to org.apache.brooklyn/brooklyn-utils-groovy/0.11.0-SNAPSHOT/brooklyn-utils-groovy-0.11.0-SNAPSHOT.pom
[JENKINS] Archiving <https://builds.apache.org/job/brooklyn-server-master/ws/utils/groovy/target/brooklyn-utils-groovy-0.11.0-SNAPSHOT.jar>
to org.apache.brooklyn/brooklyn-utils-groovy/0.11.0-SNAPSHOT/brooklyn-utils-groovy-0.11.0-SNAPSHOT.jar
[JENKINS] Archiving <https://builds.apache.org/job/brooklyn-server-master/ws/utils/groovy/target/brooklyn-utils-groovy-0.11.0-SNAPSHOT-tests.jar>
to org.apache.brooklyn/brooklyn-utils-groovy/0.11.0-SNAPSHOT/brooklyn-utils-groovy-0.11.0-SNAPSHOT-tests.jar
[JENKINS] Archiving <https://builds.apache.org/job/brooklyn-server-master/ws/utils/groovy/target/brooklyn-utils-groovy-0.11.0-SNAPSHOT-sources.jar>
to org.apache.brooklyn/brooklyn-utils-groovy/0.11.0-SNAPSHOT/brooklyn-utils-groovy-0.11.0-SNAPSHOT-sources.jar
[JENKINS] Archiving <https://builds.apache.org/job/brooklyn-server-master/ws/utils/groovy/target/brooklyn-utils-groovy-0.11.0-SNAPSHOT-test-sources.jar>
to org.apache.brooklyn/brooklyn-utils-groovy/0.11.0-SNAPSHOT/brooklyn-utils-groovy-0.11.0-SNAPSHOT-test-sources.jar
[JENKINS] Archiving <https://builds.apache.org/job/brooklyn-server-master/ws/utils/rest-swagger/pom.xml>
to org.apache.brooklyn/brooklyn-utils-rest-swagger/0.11.0-SNAPSHOT/brooklyn-utils-rest-swagger-0.11.0-SNAPSHOT.pom
[JENKINS] Archiving <https://builds.apache.org/job/brooklyn-server-master/ws/utils/rest-swagger/target/brooklyn-utils-rest-swagger-0.11.0-SNAPSHOT.jar>
to org.apache.brooklyn/brooklyn-utils-rest-swagger/0.11.0-SNAPSHOT/brooklyn-utils-rest-swagger-0.11.0-SNAPSHOT.jar
[JENKINS] Archiving <https://builds.apache.org/job/brooklyn-server-master/ws/utils/rest-swagger/target/brooklyn-utils-rest-swagger-0.11.0-SNAPSHOT-sources.jar>
to org.apache.brooklyn/brooklyn-utils-rest-swagger/0.11.0-SNAPSHOT/brooklyn-utils-rest-swagger-0.11.0-SNAPSHOT-sources.jar
[JENKINS] Archiving <https://builds.apache.org/job/brooklyn-server-master/ws/utils/rest-swagger/target/brooklyn-utils-rest-swagger-0.11.0-SNAPSHOT-test-sources.jar>
to org.apache.brooklyn/brooklyn-utils-rest-swagger/0.11.0-SNAPSHOT/brooklyn-utils-rest-swagger-0.11.0-SNAPSHOT-test-sources.jar
[JENKINS] Archiving <https://builds.apache.org/job/brooklyn-server-master/ws/launcher-common/pom.xml>
to org.apache.brooklyn/brooklyn-launcher-common/0.11.0-SNAPSHOT/brooklyn-launcher-common-0.11.0-SNAPSHOT.pom
[JENKINS] Archiving <https://builds.apache.org/job/brooklyn-server-master/ws/camp/camp-base/pom.xml>
to org.apache.brooklyn.camp/camp-base/0.11.0-SNAPSHOT/camp-base-0.11.0-SNAPSHOT.pom
[JENKINS] Archiving <https://builds.apache.org/job/brooklyn-server-master/ws/camp/camp-base/target/camp-base-0.11.0-SNAPSHOT.jar>
to org.apache.brooklyn.camp/camp-base/0.11.0-SNAPSHOT/camp-base-0.11.0-SNAPSHOT.jar
[JENKINS] Archiving <https://builds.apache.org/job/brooklyn-server-master/ws/camp/camp-base/target/camp-base-0.11.0-SNAPSHOT-tests.jar>
to org.apache.brooklyn.camp/camp-base/0.11.0-SNAPSHOT/camp-base-0.11.0-SNAPSHOT-tests.jar
[JENKINS] Archiving <https://builds.apache.org/job/brooklyn-server-master/ws/camp/camp-base/target/camp-base-0.11.0-SNAPSHOT-sources.jar>
to org.apache.brooklyn.camp/camp-base/0.11.0-SNAPSHOT/camp-base-0.11.0-SNAPSHOT-sources.jar
[JENKINS] Archiving <https://builds.apache.org/job/brooklyn-server-master/ws/camp/camp-base/target/camp-base-0.11.0-SNAPSHOT-test-sources.jar>
to org.apache.brooklyn.camp/camp-base/0.11.0-SNAPSHOT/camp-base-0.11.0-SNAPSHOT-test-sources.jar
[JENKINS] Archiving <https://builds.apache.org/job/brooklyn-server-master/ws/camp/camp-brooklyn/pom.xml>
to org.apache.brooklyn/brooklyn-camp/0.11.0-SNAPSHOT/brooklyn-camp-0.11.0-SNAPSHOT.pom
[JENKINS] Archiving <https://builds.apache.org/job/brooklyn-server-master/ws/karaf/jetty-config/pom.xml>
to org.apache.brooklyn/brooklyn-karaf-jetty-config/0.11.0-SNAPSHOT/brooklyn-karaf-jetty-config-0.11.0-SNAPSHOT.pom
[JENKINS] Archiving <https://builds.apache.org/job/brooklyn-server-master/ws/server-cli/pom.xml>
to org.apache.brooklyn/brooklyn-cli/0.11.0-SNAPSHOT/brooklyn-cli-0.11.0-SNAPSHOT.pom
[JENKINS] Archiving <https://builds.apache.org/job/brooklyn-server-master/ws/logging/logback-xml/pom.xml>
to org.apache.brooklyn/brooklyn-logback-xml/0.11.0-SNAPSHOT/brooklyn-logback-xml-0.11.0-SNAPSHOT.pom
[JENKINS] Archiving <https://builds.apache.org/job/brooklyn-server-master/ws/logging/logback-xml/target/brooklyn-logback-xml-0.11.0-SNAPSHOT.jar>
to org.apache.brooklyn/brooklyn-logback-xml/0.11.0-SNAPSHOT/brooklyn-logback-xml-0.11.0-SNAPSHOT.jar
[JENKINS] Archiving <https://builds.apache.org/job/brooklyn-server-master/ws/logging/logback-xml/target/brooklyn-logback-xml-0.11.0-SNAPSHOT-sources.jar>
to org.apache.brooklyn/brooklyn-logback-xml/0.11.0-SNAPSHOT/brooklyn-logback-xml-0.11.0-SNAPSHOT-sources.jar
[JENKINS] Archiving <https://builds.apache.org/job/brooklyn-server-master/ws/logging/logback-xml/target/brooklyn-logback-xml-0.11.0-SNAPSHOT-test-sources.jar>
to org.apache.brooklyn/brooklyn-logback-xml/0.11.0-SNAPSHOT/brooklyn-logback-xml-0.11.0-SNAPSHOT-test-sources.jar
[JENKINS] Archiving <https://builds.apache.org/job/brooklyn-server-master/ws/test-support/pom.xml>
to org.apache.brooklyn/brooklyn-test-support/0.11.0-SNAPSHOT/brooklyn-test-support-0.11.0-SNAPSHOT.pom
[JENKINS] Archiving <https://builds.apache.org/job/brooklyn-server-master/ws/test-support/target/brooklyn-test-support-0.11.0-SNAPSHOT.jar>
to org.apache.brooklyn/brooklyn-test-support/0.11.0-SNAPSHOT/brooklyn-test-support-0.11.0-SNAPSHOT.jar
[JENKINS] Archiving <https://builds.apache.org/job/brooklyn-server-master/ws/test-support/target/brooklyn-test-support-0.11.0-SNAPSHOT-sources.jar>
to org.apache.brooklyn/brooklyn-test-support/0.11.0-SNAPSHOT/brooklyn-test-support-0.11.0-SNAPSHOT-sources.jar
[JENKINS] Archiving <https://builds.apache.org/job/brooklyn-server-master/ws/test-support/target/brooklyn-test-support-0.11.0-SNAPSHOT-test-sources.jar>
to org.apache.brooklyn/brooklyn-test-support/0.11.0-SNAPSHOT/brooklyn-test-support-0.11.0-SNAPSHOT-test-sources.jar
[JENKINS] Archiving <https://builds.apache.org/job/brooklyn-server-master/ws/rest/rest-server/pom.xml>
to org.apache.brooklyn/brooklyn-rest-server/0.11.0-SNAPSHOT/brooklyn-rest-server-0.11.0-SNAPSHOT.pom
[JENKINS] Archiving <https://builds.apache.org/job/brooklyn-server-master/ws/api/pom.xml>
to org.apache.brooklyn/brooklyn-api/0.11.0-SNAPSHOT/brooklyn-api-0.11.0-SNAPSHOT.pom
[JENKINS] Archiving <https://builds.apache.org/job/brooklyn-server-master/ws/api/target/brooklyn-api-0.11.0-SNAPSHOT.jar>
to org.apache.brooklyn/brooklyn-api/0.11.0-SNAPSHOT/brooklyn-api-0.11.0-SNAPSHOT.jar
[JENKINS] Archiving <https://builds.apache.org/job/brooklyn-server-master/ws/api/target/brooklyn-api-0.11.0-SNAPSHOT-sources.jar>
to org.apache.brooklyn/brooklyn-api/0.11.0-SNAPSHOT/brooklyn-api-0.11.0-SNAPSHOT-sources.jar
[JENKINS] Archiving <https://builds.apache.org/job/brooklyn-server-master/ws/api/target/brooklyn-api-0.11.0-SNAPSHOT-test-sources.jar>
to org.apache.brooklyn/brooklyn-api/0.11.0-SNAPSHOT/brooklyn-api-0.11.0-SNAPSHOT-test-sources.jar
Compressed 287.96 KB of artifacts by 33.3% relative to #385
[JENKINS] Archiving <https://builds.apache.org/job/brooklyn-server-master/ws/pom.xml>
to org.apache.brooklyn/brooklyn-server/0.11.0-SNAPSHOT/brooklyn-server-0.11.0-SNAPSHOT.pom
[JENKINS] Archiving <https://builds.apache.org/job/brooklyn-server-master/ws/locations/jclouds/pom.xml>
to org.apache.brooklyn/brooklyn-locations-jclouds/0.11.0-SNAPSHOT/brooklyn-locations-jclouds-0.11.0-SNAPSHOT.pom
[JENKINS] Archiving <https://builds.apache.org/job/brooklyn-server-master/ws/utils/common/pom.xml>
to org.apache.brooklyn/brooklyn-utils-common/0.11.0-SNAPSHOT/brooklyn-utils-common-0.11.0-SNAPSHOT.pom
[JENKINS] Archiving <https://builds.apache.org/job/brooklyn-server-master/ws/utils/common/target/brooklyn-utils-common-0.11.0-SNAPSHOT.jar>
to org.apache.brooklyn/brooklyn-utils-common/0.11.0-SNAPSHOT/brooklyn-utils-common-0.11.0-SNAPSHOT.jar
[JENKINS] Archiving <https://builds.apache.org/job/brooklyn-server-master/ws/utils/common/target/brooklyn-utils-common-0.11.0-SNAPSHOT-tests.jar>
to org.apache.brooklyn/brooklyn-utils-common/0.11.0-SNAPSHOT/brooklyn-utils-common-0.11.0-SNAPSHOT-tests.jar
[JENKINS] Archiving <https://builds.apache.org/job/brooklyn-server-master/ws/utils/common/target/brooklyn-utils-common-0.11.0-SNAPSHOT-sources.jar>
to org.apache.brooklyn/brooklyn-utils-common/0.11.0-SNAPSHOT/brooklyn-utils-common-0.11.0-SNAPSHOT-sources.jar
[JENKINS] Archiving <https://builds.apache.org/job/brooklyn-server-master/ws/utils/common/target/brooklyn-utils-common-0.11.0-SNAPSHOT-test-sources.jar>
to org.apache.brooklyn/brooklyn-utils-common/0.11.0-SNAPSHOT/brooklyn-utils-common-0.11.0-SNAPSHOT-test-sources.jar
Compressed 1.37 MB of artifacts by 29.7% relative to #385
[JENKINS] Archiving <https://builds.apache.org/job/brooklyn-server-master/ws/karaf/features/pom.xml>
to org.apache.brooklyn/brooklyn-features/0.11.0-SNAPSHOT/brooklyn-features-0.11.0-SNAPSHOT.pom
[JENKINS] Archiving <https://builds.apache.org/job/brooklyn-server-master/ws/rest/rest-api/pom.xml>
to org.apache.brooklyn/brooklyn-rest-api/0.11.0-SNAPSHOT/brooklyn-rest-api-0.11.0-SNAPSHOT.pom
[JENKINS] Archiving <https://builds.apache.org/job/brooklyn-server-master/ws/utils/jmx/jmxrmi-agent/pom.xml>
to org.apache.brooklyn/brooklyn-jmxrmi-agent/0.11.0-SNAPSHOT/brooklyn-jmxrmi-agent-0.11.0-SNAPSHOT.pom
[JENKINS] Archiving <https://builds.apache.org/job/brooklyn-server-master/ws/policy/pom.xml>
to org.apache.brooklyn/brooklyn-policy/0.11.0-SNAPSHOT/brooklyn-policy-0.11.0-SNAPSHOT.pom
[JENKINS] Archiving <https://builds.apache.org/job/brooklyn-server-master/ws/karaf/init/pom.xml>
to org.apache.brooklyn/brooklyn-karaf-init/0.11.0-SNAPSHOT/brooklyn-karaf-init-0.11.0-SNAPSHOT.pom
[JENKINS] Archiving <https://builds.apache.org/job/brooklyn-server-master/ws/karaf/commands/pom.xml>
to org.apache.brooklyn/brooklyn-commands/0.11.0-SNAPSHOT/brooklyn-commands-0.11.0-SNAPSHOT.pom
[JENKINS] Archiving <https://builds.apache.org/job/brooklyn-server-master/ws/storage/hazelcast/pom.xml>
to org.apache.brooklyn/brooklyn-storage-hazelcast/0.11.0-SNAPSHOT/brooklyn-storage-hazelcast-0.11.0-SNAPSHOT.pom
[JENKINS] Archiving <https://builds.apache.org/job/brooklyn-server-master/ws/logging/logback-includes/pom.xml>
to org.apache.brooklyn/brooklyn-logback-includes/0.11.0-SNAPSHOT/brooklyn-logback-includes-0.11.0-SNAPSHOT.pom
[JENKINS] Archiving <https://builds.apache.org/job/brooklyn-server-master/ws/logging/logback-includes/target/brooklyn-logback-includes-0.11.0-SNAPSHOT.jar>
to org.apache.brooklyn/brooklyn-logback-includes/0.11.0-SNAPSHOT/brooklyn-logback-includes-0.11.0-SNAPSHOT.jar
[JENKINS] Archiving <https://builds.apache.org/job/brooklyn-server-master/ws/logging/logback-includes/target/brooklyn-logback-includes-0.11.0-SNAPSHOT-sources.jar>
to org.apache.brooklyn/brooklyn-logback-includes/0.11.0-SNAPSHOT/brooklyn-logback-includes-0.11.0-SNAPSHOT-sources.jar
[JENKINS] Archiving <https://builds.apache.org/job/brooklyn-server-master/ws/logging/logback-includes/target/brooklyn-logback-includes-0.11.0-SNAPSHOT-test-sources.jar>
to org.apache.brooklyn/brooklyn-logback-includes/0.11.0-SNAPSHOT/brooklyn-logback-includes-0.11.0-SNAPSHOT-test-sources.jar
[JENKINS] Archiving <https://builds.apache.org/job/brooklyn-server-master/ws/rest/rest-resources/pom.xml>
to org.apache.brooklyn/brooklyn-rest-resources/0.11.0-SNAPSHOT/brooklyn-rest-resources-0.11.0-SNAPSHOT.pom
[JENKINS] Archiving <https://builds.apache.org/job/brooklyn-server-master/ws/utils/jmx/jmxmp-ssl-agent/pom.xml>
to org.apache.brooklyn/brooklyn-jmxmp-agent/0.11.0-SNAPSHOT/brooklyn-jmxmp-agent-0.11.0-SNAPSHOT.pom
[JENKINS] Archiving <https://builds.apache.org/job/brooklyn-server-master/ws/parent/pom.xml>
to org.apache.brooklyn/brooklyn-parent/0.11.0-SNAPSHOT/brooklyn-parent-0.11.0-SNAPSHOT.pom
Compressed 80.50 KB of artifacts by 79.5% relative to #385
[JENKINS] Archiving <https://builds.apache.org/job/brooklyn-server-master/ws/software/winrm/pom.xml>
to org.apache.brooklyn/brooklyn-software-winrm/0.11.0-SNAPSHOT/brooklyn-software-winrm-0.11.0-SNAPSHOT.pom
channel stopped

Mime
View raw message