brooklyn-dev mailing list archives

Site index · List index
Message view « Date » · « Thread »
Top « Date » · « Thread »
From Apache Jenkins Server <jenk...@builds.apache.org>
Subject Build failed in Jenkins: brooklyn-server-master #389
Date Mon, 12 Dec 2016 19:04:14 GMT
See <https://builds.apache.org/job/brooklyn-server-master/389/changes>

Changes:

[andrew.kennedy] Adding new LocationEntity for creating location specific entities

[andrew.kennedy] Save location information as sensor data on LocationEntity

[andrew.kennedy] Fix order of provisioner check and add tests for LocationEntity

------------------------------------------
[...truncated 30707 lines...]
2016-12-12 18:59:09,917 INFO  New Docker host location StubHostLocation{id=ukrsvr3nhc, name=Docker
Host(va1bhpm7lf)} created
2016-12-12 18:59:10,047 INFO  Started application StubInfrastructureImpl{id=zzzes9wrqu}
2016-12-12 18:59:10,059 INFO  TESTNG PASSED CONFIGURATION: "Surefire test" - @BeforeMethod
org.apache.brooklyn.core.location.dynamic.clocker.StubResolverTest.setUp() finished in 309
ms
2016-12-12 18:59:10,059 INFO  TESTNG INVOKING: "Surefire test" - org.apache.brooklyn.core.location.dynamic.clocker.StubResolverTest.testResolveInfrastructure()
2016-12-12 18:59:10,060 INFO  TESTNG PASSED: "Surefire test" - org.apache.brooklyn.core.location.dynamic.clocker.StubResolverTest.testResolveInfrastructure()
finished in 1 ms
2016-12-12 18:59:10,060 INFO  TESTNG INVOKING CONFIGURATION: "Surefire test" - @AfterMethod
org.apache.brooklyn.core.test.BrooklynMgmtUnitTestSupport.tearDown()
2016-12-12 18:59:10,067 INFO  Stopping application StubInfrastructureImpl{id=zzzes9wrqu}
2016-12-12 18:59:10,073 INFO  Stopped application StubInfrastructureImpl{id=zzzes9wrqu}
2016-12-12 18:59:10,078 INFO  TESTNG PASSED CONFIGURATION: "Surefire test" - @AfterMethod
org.apache.brooklyn.core.test.BrooklynMgmtUnitTestSupport.tearDown() finished in 18 ms
2016-12-12 18:59:10,078 INFO  TESTNG INVOKING: "Surefire test" - org.apache.brooklyn.entity.java.JmxSupportTest.testCoerceStringtoJmxAgentModes()
2016-12-12 18:59:10,079 INFO  TESTNG PASSED: "Surefire test" - org.apache.brooklyn.entity.java.JmxSupportTest.testCoerceStringtoJmxAgentModes()
finished in 1 ms
2016-12-12 18:59:10,079 INFO  TESTNG INVOKING CONFIGURATION: "Surefire test" - @AfterMethod
org.apache.brooklyn.entity.java.JmxSupportTest.tearDown()
2016-12-12 18:59:10,079 INFO  TESTNG PASSED CONFIGURATION: "Surefire test" - @AfterMethod
org.apache.brooklyn.entity.java.JmxSupportTest.tearDown() finished in 0 ms
2016-12-12 18:59:10,080 INFO  TESTNG INVOKING: "Surefire test" - org.apache.brooklyn.entity.java.JmxSupportTest.testJmxAutodetect()
2016-12-12 18:59:10,094 INFO  TESTNG PASSED: "Surefire test" - org.apache.brooklyn.entity.java.JmxSupportTest.testJmxAutodetect()
finished in 14 ms
2016-12-12 18:59:10,094 INFO  TESTNG INVOKING CONFIGURATION: "Surefire test" - @AfterMethod
org.apache.brooklyn.entity.java.JmxSupportTest.tearDown()
2016-12-12 18:59:10,097 INFO  TESTNG PASSED CONFIGURATION: "Surefire test" - @AfterMethod
org.apache.brooklyn.entity.java.JmxSupportTest.tearDown() finished in 3 ms
2016-12-12 18:59:10,098 INFO  TESTNG INVOKING: "Surefire test" - org.apache.brooklyn.entity.java.JmxSupportTest.testJmxmpJarExistence()
2016-12-12 18:59:10,112 INFO  TESTNG PASSED: "Surefire test" - org.apache.brooklyn.entity.java.JmxSupportTest.testJmxmpJarExistence()
finished in 14 ms
2016-12-12 18:59:10,112 INFO  TESTNG INVOKING CONFIGURATION: "Surefire test" - @AfterMethod
org.apache.brooklyn.entity.java.JmxSupportTest.tearDown()
2016-12-12 18:59:10,115 INFO  TESTNG PASSED CONFIGURATION: "Surefire test" - @AfterMethod
org.apache.brooklyn.entity.java.JmxSupportTest.tearDown() finished in 3 ms
2016-12-12 18:59:10,115 INFO  TESTNG INVOKING: "Surefire test" - org.apache.brooklyn.entity.java.JmxSupportTest.testJmxrmiJarExistence()
2016-12-12 18:59:10,130 INFO  TESTNG PASSED: "Surefire test" - org.apache.brooklyn.entity.java.JmxSupportTest.testJmxrmiJarExistence()
finished in 15 ms
2016-12-12 18:59:10,130 INFO  TESTNG INVOKING CONFIGURATION: "Surefire test" - @AfterMethod
org.apache.brooklyn.entity.java.JmxSupportTest.tearDown()
2016-12-12 18:59:10,133 INFO  TESTNG PASSED CONFIGURATION: "Surefire test" - @AfterMethod
org.apache.brooklyn.entity.java.JmxSupportTest.tearDown() finished in 3 ms
2016-12-12 18:59:10,133 INFO  TESTNG INVOKING: "Surefire test" - org.apache.brooklyn.feed.jmx.JmxValueFunctionsTest.testCompositeDataToMap()
2016-12-12 18:59:10,134 INFO  TESTNG PASSED: "Surefire test" - org.apache.brooklyn.feed.jmx.JmxValueFunctionsTest.testCompositeDataToMap()
finished in 1 ms
2016-12-12 18:59:10,134 INFO  TESTNG INVOKING: "Surefire test" - org.apache.brooklyn.feed.jmx.JmxValueFunctionsTest.testTabularDataToMap()
2016-12-12 18:59:10,135 WARN  tablularDataToMap has overwritten key key1
2016-12-12 18:59:10,135 WARN  tablularDataToMap has overwritten key key2
2016-12-12 18:59:10,135 WARN  tablularDataToMap has overwritten key key1
2016-12-12 18:59:10,135 WARN  tablularDataToMap has overwritten key key2
2016-12-12 18:59:10,135 INFO  TESTNG PASSED: "Surefire test" - org.apache.brooklyn.feed.jmx.JmxValueFunctionsTest.testTabularDataToMap()
finished in 1 ms
2016-12-12 18:59:10,135 INFO  TESTNG INVOKING: "Surefire test" - org.apache.brooklyn.feed.jmx.JmxValueFunctionsTest.testTabularDataToMapOfMaps()
2016-12-12 18:59:10,136 INFO  TESTNG PASSED: "Surefire test" - org.apache.brooklyn.feed.jmx.JmxValueFunctionsTest.testTabularDataToMapOfMaps()
finished in 1 ms
2016-12-12 18:59:10,137 INFO  TESTNG INVOKING: "Surefire test" - org.apache.brooklyn.entity.software.base.lifecycle.MachineLifecycleEffectorTasksTest.testBasicSonftwareProcessCanStop(org.apache.brooklyn.entity.software.base.SoftwareProcess$StopSoftwareParameters$StopMode,
boolean, boolean)(value(s): ALWAYS, true, true)
2016-12-12 18:59:10,138 INFO  TESTNG PASSED: "Surefire test" - org.apache.brooklyn.entity.software.base.lifecycle.MachineLifecycleEffectorTasksTest.testBasicSonftwareProcessCanStop(org.apache.brooklyn.entity.software.base.SoftwareProcess$StopSoftwareParameters$StopMode,
boolean, boolean)(value(s): ALWAYS, true, true) finished in 1 ms
2016-12-12 18:59:10,138 INFO  TESTNG INVOKING: "Surefire test" - org.apache.brooklyn.entity.software.base.lifecycle.MachineLifecycleEffectorTasksTest.testBasicSonftwareProcessCanStop(org.apache.brooklyn.entity.software.base.SoftwareProcess$StopSoftwareParameters$StopMode,
boolean, boolean)(value(s): ALWAYS, false, true)
2016-12-12 18:59:10,139 INFO  TESTNG PASSED: "Surefire test" - org.apache.brooklyn.entity.software.base.lifecycle.MachineLifecycleEffectorTasksTest.testBasicSonftwareProcessCanStop(org.apache.brooklyn.entity.software.base.SoftwareProcess$StopSoftwareParameters$StopMode,
boolean, boolean)(value(s): ALWAYS, false, true) finished in 1 ms
2016-12-12 18:59:10,139 INFO  TESTNG INVOKING: "Surefire test" - org.apache.brooklyn.entity.software.base.lifecycle.MachineLifecycleEffectorTasksTest.testBasicSonftwareProcessCanStop(org.apache.brooklyn.entity.software.base.SoftwareProcess$StopSoftwareParameters$StopMode,
boolean, boolean)(value(s): IF_NOT_STOPPED, true, false)
2016-12-12 18:59:10,140 INFO  TESTNG PASSED: "Surefire test" - org.apache.brooklyn.entity.software.base.lifecycle.MachineLifecycleEffectorTasksTest.testBasicSonftwareProcessCanStop(org.apache.brooklyn.entity.software.base.SoftwareProcess$StopSoftwareParameters$StopMode,
boolean, boolean)(value(s): IF_NOT_STOPPED, true, false) finished in 1 ms
2016-12-12 18:59:10,141 INFO  TESTNG INVOKING: "Surefire test" - org.apache.brooklyn.entity.software.base.lifecycle.MachineLifecycleEffectorTasksTest.testBasicSonftwareProcessCanStop(org.apache.brooklyn.entity.software.base.SoftwareProcess$StopSoftwareParameters$StopMode,
boolean, boolean)(value(s): IF_NOT_STOPPED, false, true)
2016-12-12 18:59:10,142 INFO  TESTNG PASSED: "Surefire test" - org.apache.brooklyn.entity.software.base.lifecycle.MachineLifecycleEffectorTasksTest.testBasicSonftwareProcessCanStop(org.apache.brooklyn.entity.software.base.SoftwareProcess$StopSoftwareParameters$StopMode,
boolean, boolean)(value(s): IF_NOT_STOPPED, false, true) finished in 1 ms
2016-12-12 18:59:10,142 INFO  TESTNG INVOKING: "Surefire test" - org.apache.brooklyn.entity.software.base.lifecycle.MachineLifecycleEffectorTasksTest.testBasicSonftwareProcessCanStop(org.apache.brooklyn.entity.software.base.SoftwareProcess$StopSoftwareParameters$StopMode,
boolean, boolean)(value(s): NEVER, true, false)
2016-12-12 18:59:10,143 INFO  TESTNG PASSED: "Surefire test" - org.apache.brooklyn.entity.software.base.lifecycle.MachineLifecycleEffectorTasksTest.testBasicSonftwareProcessCanStop(org.apache.brooklyn.entity.software.base.SoftwareProcess$StopSoftwareParameters$StopMode,
boolean, boolean)(value(s): NEVER, true, false) finished in 1 ms
2016-12-12 18:59:10,144 INFO  TESTNG INVOKING: "Surefire test" - org.apache.brooklyn.entity.software.base.lifecycle.MachineLifecycleEffectorTasksTest.testBasicSonftwareProcessCanStop(org.apache.brooklyn.entity.software.base.SoftwareProcess$StopSoftwareParameters$StopMode,
boolean, boolean)(value(s): NEVER, false, false)
2016-12-12 18:59:10,145 INFO  TESTNG PASSED: "Surefire test" - org.apache.brooklyn.entity.software.base.lifecycle.MachineLifecycleEffectorTasksTest.testBasicSonftwareProcessCanStop(org.apache.brooklyn.entity.software.base.SoftwareProcess$StopSoftwareParameters$StopMode,
boolean, boolean)(value(s): NEVER, false, false) finished in 1 ms
2016-12-12 18:59:10,146 INFO  TESTNG INVOKING CONFIGURATION: "Surefire test" - @BeforeMethod
org.apache.brooklyn.entity.software.base.lifecycle.NaiveScriptRunnerTest.setup()
2016-12-12 18:59:10,146 INFO  TESTNG PASSED CONFIGURATION: "Surefire test" - @BeforeMethod
org.apache.brooklyn.entity.software.base.lifecycle.NaiveScriptRunnerTest.setup() finished
in 0 ms
2016-12-12 18:59:10,146 INFO  TESTNG INVOKING: "Surefire test" - org.apache.brooklyn.entity.software.base.lifecycle.NaiveScriptRunnerTest.testFailOnNonZero()
2016-12-12 18:59:10,147 WARN  Execution failed, invalid result 106 for mock (throwing)
2016-12-12 18:59:10,147 INFO  STDIN of problem in null:
ignored
2016-12-12 18:59:10,147 INFO  ScriptHelper non-zero causes return code: java.lang.IllegalStateException:
Execution failed, invalid result 106 for mock
2016-12-12 18:59:10,147 INFO  TESTNG PASSED: "Surefire test" - org.apache.brooklyn.entity.software.base.lifecycle.NaiveScriptRunnerTest.testFailOnNonZero()
finished in 1 ms
2016-12-12 18:59:10,147 INFO  TESTNG INVOKING CONFIGURATION: "Surefire test" - @BeforeMethod
org.apache.brooklyn.entity.software.base.lifecycle.NaiveScriptRunnerTest.setup()
2016-12-12 18:59:10,148 INFO  TESTNG PASSED CONFIGURATION: "Surefire test" - @BeforeMethod
org.apache.brooklyn.entity.software.base.lifecycle.NaiveScriptRunnerTest.setup() finished
in 1 ms
2016-12-12 18:59:10,148 INFO  TESTNG INVOKING: "Surefire test" - org.apache.brooklyn.entity.software.base.lifecycle.NaiveScriptRunnerTest.testFailOnNonZeroDontFailIfZero()
2016-12-12 18:59:10,148 INFO  TESTNG PASSED: "Surefire test" - org.apache.brooklyn.entity.software.base.lifecycle.NaiveScriptRunnerTest.testFailOnNonZeroDontFailIfZero()
finished in 0 ms
2016-12-12 18:59:10,148 INFO  TESTNG INVOKING CONFIGURATION: "Surefire test" - @BeforeMethod
org.apache.brooklyn.entity.software.base.lifecycle.NaiveScriptRunnerTest.setup()
2016-12-12 18:59:10,148 INFO  TESTNG PASSED CONFIGURATION: "Surefire test" - @BeforeMethod
org.apache.brooklyn.entity.software.base.lifecycle.NaiveScriptRunnerTest.setup() finished
in 0 ms
2016-12-12 18:59:10,149 INFO  TESTNG INVOKING: "Surefire test" - org.apache.brooklyn.entity.software.base.lifecycle.NaiveScriptRunnerTest.testHeadBodyFootAndResult()
2016-12-12 18:59:10,149 INFO  TESTNG PASSED: "Surefire test" - org.apache.brooklyn.entity.software.base.lifecycle.NaiveScriptRunnerTest.testHeadBodyFootAndResult()
finished in 0 ms
2016-12-12 18:59:10,200 INFO  TESTNG 
===============================================
    Surefire test
    Tests run: 199, Failures: 1, Skips: 0
===============================================
Tests run: 199, Failures: 1, Errors: 0, Skipped: 0, Time elapsed: 248.676 sec <<<
FAILURE! - in TestSuite
testJmxFeedIsPersisted(org.apache.brooklyn.feed.jmx.RebindJmxFeedTest)  Time elapsed: 180.874
sec  <<< FAILURE!
java.rmi.server.ExportException: 
Port already in use: 40123; nested exception is: 
	java.net.BindException: Address already in use
	at org.apache.brooklyn.feed.jmx.RebindJmxFeedTest.runJmxFeedIsPersisted(RebindJmxFeedTest.java:99)
	at org.apache.brooklyn.feed.jmx.RebindJmxFeedTest.testJmxFeedIsPersisted(RebindJmxFeedTest.java:86)
Caused by: java.net.BindException: Address already in use
	at org.apache.brooklyn.feed.jmx.RebindJmxFeedTest.runJmxFeedIsPersisted(RebindJmxFeedTest.java:99)
	at org.apache.brooklyn.feed.jmx.RebindJmxFeedTest.testJmxFeedIsPersisted(RebindJmxFeedTest.java:86)


Results :

Failed tests: 
  RebindJmxFeedTest.testJmxFeedIsPersisted:86->runJmxFeedIsPersisted:99 ยป Export

Tests run: 199, Failures: 1, Errors: 0, Skipped: 0

[JENKINS] Recording test results
[INFO] ------------------------------------------------------------------------
[INFO] Reactor Summary:
[INFO] 
[INFO] Brooklyn Server Root ............................... SUCCESS [  7.781 s]
[INFO] Brooklyn Parent Project ............................ SUCCESS [  5.525 s]
[INFO] Brooklyn Test Support Utilities .................... SUCCESS [ 12.741 s]
[INFO] Brooklyn Logback Includable Configuration .......... SUCCESS [  8.850 s]
[INFO] Brooklyn Common Utilities .......................... SUCCESS [ 55.638 s]
[INFO] Brooklyn API ....................................... SUCCESS [  9.467 s]
[INFO] CAMP Server Parent Project ......................... SUCCESS [  3.349 s]
[INFO] CAMP Base .......................................... SUCCESS [ 13.312 s]
[INFO] Brooklyn Test Support .............................. SUCCESS [ 10.531 s]
[INFO] Brooklyn REST Swagger Apidoc Utilities ............. SUCCESS [  8.004 s]
[INFO] Brooklyn Logback Configuration ..................... SUCCESS [  9.791 s]
[INFO] CAMP Server ........................................ SUCCESS [ 16.967 s]
[INFO] Brooklyn Felix Runtime ............................. SUCCESS [ 12.014 s]
[INFO] Brooklyn Groovy Utilities .......................... SUCCESS [ 10.258 s]
[INFO] Brooklyn Core ...................................... SUCCESS [03:58 min]
[INFO] Brooklyn Policies .................................. SUCCESS [01:36 min]
[INFO] Brooklyn WinRM Software Entities ................... SUCCESS [ 17.101 s]
[INFO] Brooklyn Secure JMXMP Agent ........................ SUCCESS [ 14.477 s]
[INFO] Brooklyn JMX RMI Agent ............................. SUCCESS [  6.180 s]
[INFO] Brooklyn Jclouds Location Targets .................. SUCCESS [ 29.440 s]
[INFO] Brooklyn Software Base ............................. FAILURE [04:24 min]
[INFO] Brooklyn CAMP ...................................... SKIPPED
[INFO] Brooklyn Hazelcast Storage ......................... SKIPPED
[INFO] Brooklyn Launcher Common ........................... SKIPPED
[INFO] Brooklyn REST API .................................. SKIPPED
[INFO] Brooklyn REST Resources ............................ SKIPPED
[INFO] Brooklyn REST Server ............................... SKIPPED
[INFO] Brooklyn Launcher .................................. SKIPPED
[INFO] Brooklyn Command Line Interface .................... SKIPPED
[INFO] Brooklyn Test Framework ............................ SKIPPED
[INFO] Brooklyn OSGi init ................................. SKIPPED
[INFO] Brooklyn Karaf ..................................... SKIPPED
[INFO] Jetty config fragment .............................. SKIPPED
[INFO] Apache Http Component extension .................... SKIPPED
[INFO] Brooklyn Karaf Features ............................ SKIPPED
[INFO] Brooklyn Karaf Shell Commands ...................... SKIPPED
[INFO] ------------------------------------------------------------------------
[INFO] BUILD FAILURE
[INFO] ------------------------------------------------------------------------
[INFO] Total time: 16:45 min
[INFO] Finished at: 2016-12-12T18:59:39+00:00
[INFO] Final Memory: 96M/611M
[INFO] ------------------------------------------------------------------------
Waiting for Jenkins to finish collecting data
[ERROR] Failed to execute goal org.apache.maven.plugins:maven-surefire-plugin:2.19.1:test
(default-test) on project brooklyn-software-base: There are test failures.
[ERROR] 
[ERROR] Please refer to <https://builds.apache.org/job/brooklyn-server-master/ws/software/base/target/surefire-reports>
for the individual test results.
[ERROR] -> [Help 1]
[ERROR] 
[ERROR] To see the full stack trace of the errors, re-run Maven with the -e switch.
[ERROR] Re-run Maven using the -X switch to enable full debug logging.
[ERROR] 
[ERROR] For more information about the errors and possible solutions, please read the following
articles:
[ERROR] [Help 1] http://cwiki.apache.org/confluence/display/MAVEN/MojoFailureException
[ERROR] 
[ERROR] After correcting the problems, you can resume the build with the command
[ERROR]   mvn <goals> -rf :brooklyn-software-base
[JENKINS] Archiving <https://builds.apache.org/job/brooklyn-server-master/ws/camp/pom.xml>
to org.apache.brooklyn.camp/camp-parent/0.11.0-SNAPSHOT/camp-parent-0.11.0-SNAPSHOT.pom
[JENKINS] Archiving <https://builds.apache.org/job/brooklyn-server-master/ws/utils/rt-felix/pom.xml>
to org.apache.brooklyn/brooklyn-rt-felix/0.11.0-SNAPSHOT/brooklyn-rt-felix-0.11.0-SNAPSHOT.pom
[JENKINS] Archiving <https://builds.apache.org/job/brooklyn-server-master/ws/utils/rt-felix/target/brooklyn-rt-felix-0.11.0-SNAPSHOT.jar>
to org.apache.brooklyn/brooklyn-rt-felix/0.11.0-SNAPSHOT/brooklyn-rt-felix-0.11.0-SNAPSHOT.jar
[JENKINS] Archiving <https://builds.apache.org/job/brooklyn-server-master/ws/utils/rt-felix/target/brooklyn-rt-felix-0.11.0-SNAPSHOT-tests.jar>
to org.apache.brooklyn/brooklyn-rt-felix/0.11.0-SNAPSHOT/brooklyn-rt-felix-0.11.0-SNAPSHOT-tests.jar
[JENKINS] Archiving <https://builds.apache.org/job/brooklyn-server-master/ws/utils/rt-felix/target/brooklyn-rt-felix-0.11.0-SNAPSHOT-sources.jar>
to org.apache.brooklyn/brooklyn-rt-felix/0.11.0-SNAPSHOT/brooklyn-rt-felix-0.11.0-SNAPSHOT-sources.jar
[JENKINS] Archiving <https://builds.apache.org/job/brooklyn-server-master/ws/utils/rt-felix/target/brooklyn-rt-felix-0.11.0-SNAPSHOT-test-sources.jar>
to org.apache.brooklyn/brooklyn-rt-felix/0.11.0-SNAPSHOT/brooklyn-rt-felix-0.11.0-SNAPSHOT-test-sources.jar
[JENKINS] Archiving <https://builds.apache.org/job/brooklyn-server-master/ws/test-framework/pom.xml>
to org.apache.brooklyn/brooklyn-test-framework/0.11.0-SNAPSHOT/brooklyn-test-framework-0.11.0-SNAPSHOT.pom
[JENKINS] Archiving <https://builds.apache.org/job/brooklyn-server-master/ws/core/pom.xml>
to org.apache.brooklyn/brooklyn-core/0.11.0-SNAPSHOT/brooklyn-core-0.11.0-SNAPSHOT.pom
[JENKINS] Archiving <https://builds.apache.org/job/brooklyn-server-master/ws/core/target/brooklyn-core-0.11.0-SNAPSHOT.jar>
to org.apache.brooklyn/brooklyn-core/0.11.0-SNAPSHOT/brooklyn-core-0.11.0-SNAPSHOT.jar
[JENKINS] Archiving <https://builds.apache.org/job/brooklyn-server-master/ws/core/target/brooklyn-core-0.11.0-SNAPSHOT-tests.jar>
to org.apache.brooklyn/brooklyn-core/0.11.0-SNAPSHOT/brooklyn-core-0.11.0-SNAPSHOT-tests.jar
[JENKINS] Archiving <https://builds.apache.org/job/brooklyn-server-master/ws/core/target/brooklyn-core-0.11.0-SNAPSHOT-sources.jar>
to org.apache.brooklyn/brooklyn-core/0.11.0-SNAPSHOT/brooklyn-core-0.11.0-SNAPSHOT-sources.jar
[JENKINS] Archiving <https://builds.apache.org/job/brooklyn-server-master/ws/core/target/brooklyn-core-0.11.0-SNAPSHOT-test-sources.jar>
to org.apache.brooklyn/brooklyn-core/0.11.0-SNAPSHOT/brooklyn-core-0.11.0-SNAPSHOT-test-sources.jar
[JENKINS] Archiving <https://builds.apache.org/job/brooklyn-server-master/ws/camp/camp-server/pom.xml>
to org.apache.brooklyn.camp/camp-server/0.11.0-SNAPSHOT/camp-server-0.11.0-SNAPSHOT.pom
[JENKINS] Archiving <https://builds.apache.org/job/brooklyn-server-master/ws/camp/camp-server/target/camp-server-0.11.0-SNAPSHOT.jar>
to org.apache.brooklyn.camp/camp-server/0.11.0-SNAPSHOT/camp-server-0.11.0-SNAPSHOT.jar
[JENKINS] Archiving <https://builds.apache.org/job/brooklyn-server-master/ws/camp/camp-server/target/camp-server-0.11.0-SNAPSHOT-tests.jar>
to org.apache.brooklyn.camp/camp-server/0.11.0-SNAPSHOT/camp-server-0.11.0-SNAPSHOT-tests.jar
[JENKINS] Archiving <https://builds.apache.org/job/brooklyn-server-master/ws/camp/camp-server/target/camp-server-0.11.0-SNAPSHOT-sources.jar>
to org.apache.brooklyn.camp/camp-server/0.11.0-SNAPSHOT/camp-server-0.11.0-SNAPSHOT-sources.jar
[JENKINS] Archiving <https://builds.apache.org/job/brooklyn-server-master/ws/camp/camp-server/target/camp-server-0.11.0-SNAPSHOT-test-sources.jar>
to org.apache.brooklyn.camp/camp-server/0.11.0-SNAPSHOT/camp-server-0.11.0-SNAPSHOT-test-sources.jar
[JENKINS] Archiving <https://builds.apache.org/job/brooklyn-server-master/ws/launcher/pom.xml>
to org.apache.brooklyn/brooklyn-launcher/0.11.0-SNAPSHOT/brooklyn-launcher-0.11.0-SNAPSHOT.pom
[JENKINS] Archiving <https://builds.apache.org/job/brooklyn-server-master/ws/karaf/pom.xml>
to org.apache.brooklyn/brooklyn-karaf/0.11.0-SNAPSHOT/brooklyn-karaf-0.11.0-SNAPSHOT.pom
[JENKINS] Archiving <https://builds.apache.org/job/brooklyn-server-master/ws/karaf/httpcomponent-extension/pom.xml>
to org.apache.brooklyn/brooklyn-karaf-httpcomponents-extension/0.11.0-SNAPSHOT/brooklyn-karaf-httpcomponents-extension-0.11.0-SNAPSHOT.pom
[JENKINS] Archiving <https://builds.apache.org/job/brooklyn-server-master/ws/utils/test-support/pom.xml>
to org.apache.brooklyn/brooklyn-utils-test-support/0.11.0-SNAPSHOT/brooklyn-utils-test-support-0.11.0-SNAPSHOT.pom
[JENKINS] Archiving <https://builds.apache.org/job/brooklyn-server-master/ws/utils/test-support/target/brooklyn-utils-test-support-0.11.0-SNAPSHOT.jar>
to org.apache.brooklyn/brooklyn-utils-test-support/0.11.0-SNAPSHOT/brooklyn-utils-test-support-0.11.0-SNAPSHOT.jar
[JENKINS] Archiving <https://builds.apache.org/job/brooklyn-server-master/ws/utils/test-support/target/brooklyn-utils-test-support-0.11.0-SNAPSHOT-sources.jar>
to org.apache.brooklyn/brooklyn-utils-test-support/0.11.0-SNAPSHOT/brooklyn-utils-test-support-0.11.0-SNAPSHOT-sources.jar
[JENKINS] Archiving <https://builds.apache.org/job/brooklyn-server-master/ws/utils/test-support/target/brooklyn-utils-test-support-0.11.0-SNAPSHOT-test-sources.jar>
to org.apache.brooklyn/brooklyn-utils-test-support/0.11.0-SNAPSHOT/brooklyn-utils-test-support-0.11.0-SNAPSHOT-test-sources.jar
[JENKINS] Archiving <https://builds.apache.org/job/brooklyn-server-master/ws/software/base/pom.xml>
to org.apache.brooklyn/brooklyn-software-base/0.11.0-SNAPSHOT/brooklyn-software-base-0.11.0-SNAPSHOT.pom
[JENKINS] Archiving <https://builds.apache.org/job/brooklyn-server-master/ws/utils/groovy/pom.xml>
to org.apache.brooklyn/brooklyn-utils-groovy/0.11.0-SNAPSHOT/brooklyn-utils-groovy-0.11.0-SNAPSHOT.pom
[JENKINS] Archiving <https://builds.apache.org/job/brooklyn-server-master/ws/utils/groovy/target/brooklyn-utils-groovy-0.11.0-SNAPSHOT.jar>
to org.apache.brooklyn/brooklyn-utils-groovy/0.11.0-SNAPSHOT/brooklyn-utils-groovy-0.11.0-SNAPSHOT.jar
[JENKINS] Archiving <https://builds.apache.org/job/brooklyn-server-master/ws/utils/groovy/target/brooklyn-utils-groovy-0.11.0-SNAPSHOT-tests.jar>
to org.apache.brooklyn/brooklyn-utils-groovy/0.11.0-SNAPSHOT/brooklyn-utils-groovy-0.11.0-SNAPSHOT-tests.jar
[JENKINS] Archiving <https://builds.apache.org/job/brooklyn-server-master/ws/utils/groovy/target/brooklyn-utils-groovy-0.11.0-SNAPSHOT-sources.jar>
to org.apache.brooklyn/brooklyn-utils-groovy/0.11.0-SNAPSHOT/brooklyn-utils-groovy-0.11.0-SNAPSHOT-sources.jar
[JENKINS] Archiving <https://builds.apache.org/job/brooklyn-server-master/ws/utils/groovy/target/brooklyn-utils-groovy-0.11.0-SNAPSHOT-test-sources.jar>
to org.apache.brooklyn/brooklyn-utils-groovy/0.11.0-SNAPSHOT/brooklyn-utils-groovy-0.11.0-SNAPSHOT-test-sources.jar
[JENKINS] Archiving <https://builds.apache.org/job/brooklyn-server-master/ws/utils/rest-swagger/pom.xml>
to org.apache.brooklyn/brooklyn-utils-rest-swagger/0.11.0-SNAPSHOT/brooklyn-utils-rest-swagger-0.11.0-SNAPSHOT.pom
[JENKINS] Archiving <https://builds.apache.org/job/brooklyn-server-master/ws/utils/rest-swagger/target/brooklyn-utils-rest-swagger-0.11.0-SNAPSHOT.jar>
to org.apache.brooklyn/brooklyn-utils-rest-swagger/0.11.0-SNAPSHOT/brooklyn-utils-rest-swagger-0.11.0-SNAPSHOT.jar
[JENKINS] Archiving <https://builds.apache.org/job/brooklyn-server-master/ws/utils/rest-swagger/target/brooklyn-utils-rest-swagger-0.11.0-SNAPSHOT-sources.jar>
to org.apache.brooklyn/brooklyn-utils-rest-swagger/0.11.0-SNAPSHOT/brooklyn-utils-rest-swagger-0.11.0-SNAPSHOT-sources.jar
[JENKINS] Archiving <https://builds.apache.org/job/brooklyn-server-master/ws/utils/rest-swagger/target/brooklyn-utils-rest-swagger-0.11.0-SNAPSHOT-test-sources.jar>
to org.apache.brooklyn/brooklyn-utils-rest-swagger/0.11.0-SNAPSHOT/brooklyn-utils-rest-swagger-0.11.0-SNAPSHOT-test-sources.jar
[JENKINS] Archiving <https://builds.apache.org/job/brooklyn-server-master/ws/launcher-common/pom.xml>
to org.apache.brooklyn/brooklyn-launcher-common/0.11.0-SNAPSHOT/brooklyn-launcher-common-0.11.0-SNAPSHOT.pom
[JENKINS] Archiving <https://builds.apache.org/job/brooklyn-server-master/ws/camp/camp-base/pom.xml>
to org.apache.brooklyn.camp/camp-base/0.11.0-SNAPSHOT/camp-base-0.11.0-SNAPSHOT.pom
[JENKINS] Archiving <https://builds.apache.org/job/brooklyn-server-master/ws/camp/camp-base/target/camp-base-0.11.0-SNAPSHOT.jar>
to org.apache.brooklyn.camp/camp-base/0.11.0-SNAPSHOT/camp-base-0.11.0-SNAPSHOT.jar
[JENKINS] Archiving <https://builds.apache.org/job/brooklyn-server-master/ws/camp/camp-base/target/camp-base-0.11.0-SNAPSHOT-tests.jar>
to org.apache.brooklyn.camp/camp-base/0.11.0-SNAPSHOT/camp-base-0.11.0-SNAPSHOT-tests.jar
[JENKINS] Archiving <https://builds.apache.org/job/brooklyn-server-master/ws/camp/camp-base/target/camp-base-0.11.0-SNAPSHOT-sources.jar>
to org.apache.brooklyn.camp/camp-base/0.11.0-SNAPSHOT/camp-base-0.11.0-SNAPSHOT-sources.jar
[JENKINS] Archiving <https://builds.apache.org/job/brooklyn-server-master/ws/camp/camp-base/target/camp-base-0.11.0-SNAPSHOT-test-sources.jar>
to org.apache.brooklyn.camp/camp-base/0.11.0-SNAPSHOT/camp-base-0.11.0-SNAPSHOT-test-sources.jar
[JENKINS] Archiving <https://builds.apache.org/job/brooklyn-server-master/ws/camp/camp-brooklyn/pom.xml>
to org.apache.brooklyn/brooklyn-camp/0.11.0-SNAPSHOT/brooklyn-camp-0.11.0-SNAPSHOT.pom
[JENKINS] Archiving <https://builds.apache.org/job/brooklyn-server-master/ws/karaf/jetty-config/pom.xml>
to org.apache.brooklyn/brooklyn-karaf-jetty-config/0.11.0-SNAPSHOT/brooklyn-karaf-jetty-config-0.11.0-SNAPSHOT.pom
[JENKINS] Archiving <https://builds.apache.org/job/brooklyn-server-master/ws/server-cli/pom.xml>
to org.apache.brooklyn/brooklyn-cli/0.11.0-SNAPSHOT/brooklyn-cli-0.11.0-SNAPSHOT.pom
[JENKINS] Archiving <https://builds.apache.org/job/brooklyn-server-master/ws/logging/logback-xml/pom.xml>
to org.apache.brooklyn/brooklyn-logback-xml/0.11.0-SNAPSHOT/brooklyn-logback-xml-0.11.0-SNAPSHOT.pom
[JENKINS] Archiving <https://builds.apache.org/job/brooklyn-server-master/ws/logging/logback-xml/target/brooklyn-logback-xml-0.11.0-SNAPSHOT.jar>
to org.apache.brooklyn/brooklyn-logback-xml/0.11.0-SNAPSHOT/brooklyn-logback-xml-0.11.0-SNAPSHOT.jar
[JENKINS] Archiving <https://builds.apache.org/job/brooklyn-server-master/ws/logging/logback-xml/target/brooklyn-logback-xml-0.11.0-SNAPSHOT-sources.jar>
to org.apache.brooklyn/brooklyn-logback-xml/0.11.0-SNAPSHOT/brooklyn-logback-xml-0.11.0-SNAPSHOT-sources.jar
[JENKINS] Archiving <https://builds.apache.org/job/brooklyn-server-master/ws/logging/logback-xml/target/brooklyn-logback-xml-0.11.0-SNAPSHOT-test-sources.jar>
to org.apache.brooklyn/brooklyn-logback-xml/0.11.0-SNAPSHOT/brooklyn-logback-xml-0.11.0-SNAPSHOT-test-sources.jar
[JENKINS] Archiving <https://builds.apache.org/job/brooklyn-server-master/ws/test-support/pom.xml>
to org.apache.brooklyn/brooklyn-test-support/0.11.0-SNAPSHOT/brooklyn-test-support-0.11.0-SNAPSHOT.pom
[JENKINS] Archiving <https://builds.apache.org/job/brooklyn-server-master/ws/test-support/target/brooklyn-test-support-0.11.0-SNAPSHOT.jar>
to org.apache.brooklyn/brooklyn-test-support/0.11.0-SNAPSHOT/brooklyn-test-support-0.11.0-SNAPSHOT.jar
[JENKINS] Archiving <https://builds.apache.org/job/brooklyn-server-master/ws/test-support/target/brooklyn-test-support-0.11.0-SNAPSHOT-sources.jar>
to org.apache.brooklyn/brooklyn-test-support/0.11.0-SNAPSHOT/brooklyn-test-support-0.11.0-SNAPSHOT-sources.jar
[JENKINS] Archiving <https://builds.apache.org/job/brooklyn-server-master/ws/test-support/target/brooklyn-test-support-0.11.0-SNAPSHOT-test-sources.jar>
to org.apache.brooklyn/brooklyn-test-support/0.11.0-SNAPSHOT/brooklyn-test-support-0.11.0-SNAPSHOT-test-sources.jar
[JENKINS] Archiving <https://builds.apache.org/job/brooklyn-server-master/ws/rest/rest-server/pom.xml>
to org.apache.brooklyn/brooklyn-rest-server/0.11.0-SNAPSHOT/brooklyn-rest-server-0.11.0-SNAPSHOT.pom
[JENKINS] Archiving <https://builds.apache.org/job/brooklyn-server-master/ws/api/pom.xml>
to org.apache.brooklyn/brooklyn-api/0.11.0-SNAPSHOT/brooklyn-api-0.11.0-SNAPSHOT.pom
[JENKINS] Archiving <https://builds.apache.org/job/brooklyn-server-master/ws/api/target/brooklyn-api-0.11.0-SNAPSHOT.jar>
to org.apache.brooklyn/brooklyn-api/0.11.0-SNAPSHOT/brooklyn-api-0.11.0-SNAPSHOT.jar
[JENKINS] Archiving <https://builds.apache.org/job/brooklyn-server-master/ws/api/target/brooklyn-api-0.11.0-SNAPSHOT-sources.jar>
to org.apache.brooklyn/brooklyn-api/0.11.0-SNAPSHOT/brooklyn-api-0.11.0-SNAPSHOT-sources.jar
[JENKINS] Archiving <https://builds.apache.org/job/brooklyn-server-master/ws/api/target/brooklyn-api-0.11.0-SNAPSHOT-test-sources.jar>
to org.apache.brooklyn/brooklyn-api/0.11.0-SNAPSHOT/brooklyn-api-0.11.0-SNAPSHOT-test-sources.jar
[JENKINS] Archiving <https://builds.apache.org/job/brooklyn-server-master/ws/pom.xml>
to org.apache.brooklyn/brooklyn-server/0.11.0-SNAPSHOT/brooklyn-server-0.11.0-SNAPSHOT.pom
[JENKINS] Archiving <https://builds.apache.org/job/brooklyn-server-master/ws/locations/jclouds/pom.xml>
to org.apache.brooklyn/brooklyn-locations-jclouds/0.11.0-SNAPSHOT/brooklyn-locations-jclouds-0.11.0-SNAPSHOT.pom
[JENKINS] Archiving <https://builds.apache.org/job/brooklyn-server-master/ws/locations/jclouds/target/brooklyn-locations-jclouds-0.11.0-SNAPSHOT.jar>
to org.apache.brooklyn/brooklyn-locations-jclouds/0.11.0-SNAPSHOT/brooklyn-locations-jclouds-0.11.0-SNAPSHOT.jar
[JENKINS] Archiving <https://builds.apache.org/job/brooklyn-server-master/ws/locations/jclouds/target/brooklyn-locations-jclouds-0.11.0-SNAPSHOT-tests.jar>
to org.apache.brooklyn/brooklyn-locations-jclouds/0.11.0-SNAPSHOT/brooklyn-locations-jclouds-0.11.0-SNAPSHOT-tests.jar
[JENKINS] Archiving <https://builds.apache.org/job/brooklyn-server-master/ws/locations/jclouds/target/brooklyn-locations-jclouds-0.11.0-SNAPSHOT-sources.jar>
to org.apache.brooklyn/brooklyn-locations-jclouds/0.11.0-SNAPSHOT/brooklyn-locations-jclouds-0.11.0-SNAPSHOT-sources.jar
[JENKINS] Archiving <https://builds.apache.org/job/brooklyn-server-master/ws/locations/jclouds/target/brooklyn-locations-jclouds-0.11.0-SNAPSHOT-test-sources.jar>
to org.apache.brooklyn/brooklyn-locations-jclouds/0.11.0-SNAPSHOT/brooklyn-locations-jclouds-0.11.0-SNAPSHOT-test-sources.jar
[JENKINS] Archiving <https://builds.apache.org/job/brooklyn-server-master/ws/utils/common/pom.xml>
to org.apache.brooklyn/brooklyn-utils-common/0.11.0-SNAPSHOT/brooklyn-utils-common-0.11.0-SNAPSHOT.pom
[JENKINS] Archiving <https://builds.apache.org/job/brooklyn-server-master/ws/utils/common/target/brooklyn-utils-common-0.11.0-SNAPSHOT.jar>
to org.apache.brooklyn/brooklyn-utils-common/0.11.0-SNAPSHOT/brooklyn-utils-common-0.11.0-SNAPSHOT.jar
[JENKINS] Archiving <https://builds.apache.org/job/brooklyn-server-master/ws/utils/common/target/brooklyn-utils-common-0.11.0-SNAPSHOT-tests.jar>
to org.apache.brooklyn/brooklyn-utils-common/0.11.0-SNAPSHOT/brooklyn-utils-common-0.11.0-SNAPSHOT-tests.jar
[JENKINS] Archiving <https://builds.apache.org/job/brooklyn-server-master/ws/utils/common/target/brooklyn-utils-common-0.11.0-SNAPSHOT-sources.jar>
to org.apache.brooklyn/brooklyn-utils-common/0.11.0-SNAPSHOT/brooklyn-utils-common-0.11.0-SNAPSHOT-sources.jar
[JENKINS] Archiving <https://builds.apache.org/job/brooklyn-server-master/ws/utils/common/target/brooklyn-utils-common-0.11.0-SNAPSHOT-test-sources.jar>
to org.apache.brooklyn/brooklyn-utils-common/0.11.0-SNAPSHOT/brooklyn-utils-common-0.11.0-SNAPSHOT-test-sources.jar
[JENKINS] Archiving <https://builds.apache.org/job/brooklyn-server-master/ws/karaf/features/pom.xml>
to org.apache.brooklyn/brooklyn-features/0.11.0-SNAPSHOT/brooklyn-features-0.11.0-SNAPSHOT.pom
[JENKINS] Archiving <https://builds.apache.org/job/brooklyn-server-master/ws/rest/rest-api/pom.xml>
to org.apache.brooklyn/brooklyn-rest-api/0.11.0-SNAPSHOT/brooklyn-rest-api-0.11.0-SNAPSHOT.pom
[JENKINS] Archiving <https://builds.apache.org/job/brooklyn-server-master/ws/utils/jmx/jmxrmi-agent/pom.xml>
to org.apache.brooklyn/brooklyn-jmxrmi-agent/0.11.0-SNAPSHOT/brooklyn-jmxrmi-agent-0.11.0-SNAPSHOT.pom
[JENKINS] Archiving <https://builds.apache.org/job/brooklyn-server-master/ws/utils/jmx/jmxrmi-agent/target/brooklyn-jmxrmi-agent-0.11.0-SNAPSHOT.jar>
to org.apache.brooklyn/brooklyn-jmxrmi-agent/0.11.0-SNAPSHOT/brooklyn-jmxrmi-agent-0.11.0-SNAPSHOT.jar
[JENKINS] Archiving <https://builds.apache.org/job/brooklyn-server-master/ws/utils/jmx/jmxrmi-agent/target/brooklyn-jmxrmi-agent-0.11.0-SNAPSHOT-tests.jar>
to org.apache.brooklyn/brooklyn-jmxrmi-agent/0.11.0-SNAPSHOT/brooklyn-jmxrmi-agent-0.11.0-SNAPSHOT-tests.jar
[JENKINS] Archiving <https://builds.apache.org/job/brooklyn-server-master/ws/utils/jmx/jmxrmi-agent/target/brooklyn-jmxrmi-agent-0.11.0-SNAPSHOT-sources.jar>
to org.apache.brooklyn/brooklyn-jmxrmi-agent/0.11.0-SNAPSHOT/brooklyn-jmxrmi-agent-0.11.0-SNAPSHOT-sources.jar
[JENKINS] Archiving <https://builds.apache.org/job/brooklyn-server-master/ws/utils/jmx/jmxrmi-agent/target/brooklyn-jmxrmi-agent-0.11.0-SNAPSHOT-test-sources.jar>
to org.apache.brooklyn/brooklyn-jmxrmi-agent/0.11.0-SNAPSHOT/brooklyn-jmxrmi-agent-0.11.0-SNAPSHOT-test-sources.jar
[JENKINS] Archiving <https://builds.apache.org/job/brooklyn-server-master/ws/policy/pom.xml>
to org.apache.brooklyn/brooklyn-policy/0.11.0-SNAPSHOT/brooklyn-policy-0.11.0-SNAPSHOT.pom
[JENKINS] Archiving <https://builds.apache.org/job/brooklyn-server-master/ws/policy/target/brooklyn-policy-0.11.0-SNAPSHOT.jar>
to org.apache.brooklyn/brooklyn-policy/0.11.0-SNAPSHOT/brooklyn-policy-0.11.0-SNAPSHOT.jar
[JENKINS] Archiving <https://builds.apache.org/job/brooklyn-server-master/ws/policy/target/brooklyn-policy-0.11.0-SNAPSHOT-tests.jar>
to org.apache.brooklyn/brooklyn-policy/0.11.0-SNAPSHOT/brooklyn-policy-0.11.0-SNAPSHOT-tests.jar
[JENKINS] Archiving <https://builds.apache.org/job/brooklyn-server-master/ws/policy/target/brooklyn-policy-0.11.0-SNAPSHOT-sources.jar>
to org.apache.brooklyn/brooklyn-policy/0.11.0-SNAPSHOT/brooklyn-policy-0.11.0-SNAPSHOT-sources.jar
[JENKINS] Archiving <https://builds.apache.org/job/brooklyn-server-master/ws/policy/target/brooklyn-policy-0.11.0-SNAPSHOT-test-sources.jar>
to org.apache.brooklyn/brooklyn-policy/0.11.0-SNAPSHOT/brooklyn-policy-0.11.0-SNAPSHOT-test-sources.jar
[JENKINS] Archiving <https://builds.apache.org/job/brooklyn-server-master/ws/karaf/init/pom.xml>
to org.apache.brooklyn/brooklyn-karaf-init/0.11.0-SNAPSHOT/brooklyn-karaf-init-0.11.0-SNAPSHOT.pom
[JENKINS] Archiving <https://builds.apache.org/job/brooklyn-server-master/ws/karaf/commands/pom.xml>
to org.apache.brooklyn/brooklyn-commands/0.11.0-SNAPSHOT/brooklyn-commands-0.11.0-SNAPSHOT.pom
[JENKINS] Archiving <https://builds.apache.org/job/brooklyn-server-master/ws/storage/hazelcast/pom.xml>
to org.apache.brooklyn/brooklyn-storage-hazelcast/0.11.0-SNAPSHOT/brooklyn-storage-hazelcast-0.11.0-SNAPSHOT.pom
[JENKINS] Archiving <https://builds.apache.org/job/brooklyn-server-master/ws/logging/logback-includes/pom.xml>
to org.apache.brooklyn/brooklyn-logback-includes/0.11.0-SNAPSHOT/brooklyn-logback-includes-0.11.0-SNAPSHOT.pom
[JENKINS] Archiving <https://builds.apache.org/job/brooklyn-server-master/ws/logging/logback-includes/target/brooklyn-logback-includes-0.11.0-SNAPSHOT.jar>
to org.apache.brooklyn/brooklyn-logback-includes/0.11.0-SNAPSHOT/brooklyn-logback-includes-0.11.0-SNAPSHOT.jar
[JENKINS] Archiving <https://builds.apache.org/job/brooklyn-server-master/ws/logging/logback-includes/target/brooklyn-logback-includes-0.11.0-SNAPSHOT-sources.jar>
to org.apache.brooklyn/brooklyn-logback-includes/0.11.0-SNAPSHOT/brooklyn-logback-includes-0.11.0-SNAPSHOT-sources.jar
[JENKINS] Archiving <https://builds.apache.org/job/brooklyn-server-master/ws/logging/logback-includes/target/brooklyn-logback-includes-0.11.0-SNAPSHOT-test-sources.jar>
to org.apache.brooklyn/brooklyn-logback-includes/0.11.0-SNAPSHOT/brooklyn-logback-includes-0.11.0-SNAPSHOT-test-sources.jar
[JENKINS] Archiving <https://builds.apache.org/job/brooklyn-server-master/ws/rest/rest-resources/pom.xml>
to org.apache.brooklyn/brooklyn-rest-resources/0.11.0-SNAPSHOT/brooklyn-rest-resources-0.11.0-SNAPSHOT.pom
[JENKINS] Archiving <https://builds.apache.org/job/brooklyn-server-master/ws/utils/jmx/jmxmp-ssl-agent/pom.xml>
to org.apache.brooklyn/brooklyn-jmxmp-agent/0.11.0-SNAPSHOT/brooklyn-jmxmp-agent-0.11.0-SNAPSHOT.pom
[JENKINS] Archiving <https://builds.apache.org/job/brooklyn-server-master/ws/utils/jmx/jmxmp-ssl-agent/target/brooklyn-jmxmp-agent-0.11.0-SNAPSHOT.jar>
to org.apache.brooklyn/brooklyn-jmxmp-agent/0.11.0-SNAPSHOT/brooklyn-jmxmp-agent-0.11.0-SNAPSHOT.jar
[JENKINS] Archiving <https://builds.apache.org/job/brooklyn-server-master/ws/utils/jmx/jmxmp-ssl-agent/target/brooklyn-jmxmp-agent-0.11.0-SNAPSHOT-tests.jar>
to org.apache.brooklyn/brooklyn-jmxmp-agent/0.11.0-SNAPSHOT/brooklyn-jmxmp-agent-0.11.0-SNAPSHOT-tests.jar
[JENKINS] Archiving <https://builds.apache.org/job/brooklyn-server-master/ws/utils/jmx/jmxmp-ssl-agent/target/brooklyn-jmxmp-agent-shaded-0.11.0-SNAPSHOT.jar>
to org.apache.brooklyn/brooklyn-jmxmp-agent/0.11.0-SNAPSHOT/brooklyn-jmxmp-agent-0.11.0-SNAPSHOT-with-dependencies.jar
[JENKINS] Archiving <https://builds.apache.org/job/brooklyn-server-master/ws/utils/jmx/jmxmp-ssl-agent/target/brooklyn-jmxmp-agent-0.11.0-SNAPSHOT-sources.jar>
to org.apache.brooklyn/brooklyn-jmxmp-agent/0.11.0-SNAPSHOT/brooklyn-jmxmp-agent-0.11.0-SNAPSHOT-sources.jar
[JENKINS] Archiving <https://builds.apache.org/job/brooklyn-server-master/ws/utils/jmx/jmxmp-ssl-agent/target/brooklyn-jmxmp-agent-0.11.0-SNAPSHOT-test-sources.jar>
to org.apache.brooklyn/brooklyn-jmxmp-agent/0.11.0-SNAPSHOT/brooklyn-jmxmp-agent-0.11.0-SNAPSHOT-test-sources.jar
[JENKINS] Archiving <https://builds.apache.org/job/brooklyn-server-master/ws/parent/pom.xml>
to org.apache.brooklyn/brooklyn-parent/0.11.0-SNAPSHOT/brooklyn-parent-0.11.0-SNAPSHOT.pom
Compressed 80.50 KB of artifacts by 79.5% relative to #388
[JENKINS] Archiving <https://builds.apache.org/job/brooklyn-server-master/ws/software/winrm/pom.xml>
to org.apache.brooklyn/brooklyn-software-winrm/0.11.0-SNAPSHOT/brooklyn-software-winrm-0.11.0-SNAPSHOT.pom
[JENKINS] Archiving <https://builds.apache.org/job/brooklyn-server-master/ws/software/winrm/target/brooklyn-software-winrm-0.11.0-SNAPSHOT.jar>
to org.apache.brooklyn/brooklyn-software-winrm/0.11.0-SNAPSHOT/brooklyn-software-winrm-0.11.0-SNAPSHOT.jar
[JENKINS] Archiving <https://builds.apache.org/job/brooklyn-server-master/ws/software/winrm/target/brooklyn-software-winrm-0.11.0-SNAPSHOT-tests.jar>
to org.apache.brooklyn/brooklyn-software-winrm/0.11.0-SNAPSHOT/brooklyn-software-winrm-0.11.0-SNAPSHOT-tests.jar
[JENKINS] Archiving <https://builds.apache.org/job/brooklyn-server-master/ws/software/winrm/target/brooklyn-software-winrm-0.11.0-SNAPSHOT-sources.jar>
to org.apache.brooklyn/brooklyn-software-winrm/0.11.0-SNAPSHOT/brooklyn-software-winrm-0.11.0-SNAPSHOT-sources.jar
[JENKINS] Archiving <https://builds.apache.org/job/brooklyn-server-master/ws/software/winrm/target/brooklyn-software-winrm-0.11.0-SNAPSHOT-test-sources.jar>
to org.apache.brooklyn/brooklyn-software-winrm/0.11.0-SNAPSHOT/brooklyn-software-winrm-0.11.0-SNAPSHOT-test-sources.jar
channel stopped

Mime
View raw message