brooklyn-dev mailing list archives

Site index · List index
Message view « Date » · « Thread »
Top « Date » · « Thread »
From Apache Jenkins Server <jenk...@builds.apache.org>
Subject Build failed in Jenkins: brooklyn-server-master #327
Date Fri, 11 Nov 2016 10:10:25 GMT
See <https://builds.apache.org/job/brooklyn-server-master/327/changes>

Changes:

[svetoslav.neykov] Fix integration tests in brooklyn-core

[svetoslav.neykov] Convert integration tests to unit tests and fix timing related failures

[svetoslav.neykov] Use ssh cli in batch mode - don't ask for passwords

[svetoslav.neykov] Upgrade testng to latest version

[svetoslav.neykov] brooklyn-locations-jclouds integration test fixes

[svetoslav.neykov] Make sure entity doesn't equal null

[svetoslav.neykov] more integration test fixes

------------------------------------------
[...truncated 20910 lines...]
2016-11-11 10:07:40,919 INFO  TESTNG PASSED CONFIGURATION: "Surefire test" - @AfterMethod
org.apache.brooklyn.core.test.BrooklynMgmtUnitTestSupport.tearDown() finished in 27 ms
2016-11-11 10:07:40,919 INFO  TESTNG INVOKING CONFIGURATION: "Surefire test" - @BeforeMethod
org.apache.brooklyn.core.entity.EntityTypeTest.setUp()
2016-11-11 10:07:40,965 INFO  TESTNG PASSED CONFIGURATION: "Surefire test" - @BeforeMethod
org.apache.brooklyn.core.entity.EntityTypeTest.setUp() finished in 46 ms
2016-11-11 10:07:40,965 INFO  TESTNG INVOKING: "Surefire test" - org.apache.brooklyn.core.entity.EntityTypeTest.testHasSensor()
2016-11-11 10:07:40,965 INFO  TESTNG PASSED: "Surefire test" - org.apache.brooklyn.core.entity.EntityTypeTest.testHasSensor()
finished in 0 ms
2016-11-11 10:07:40,966 INFO  TESTNG INVOKING CONFIGURATION: "Surefire test" - @AfterMethod
org.apache.brooklyn.core.test.BrooklynMgmtUnitTestSupport.tearDown()
2016-11-11 10:07:40,977 INFO  TESTNG PASSED CONFIGURATION: "Surefire test" - @AfterMethod
org.apache.brooklyn.core.test.BrooklynMgmtUnitTestSupport.tearDown() finished in 11 ms
2016-11-11 10:07:40,978 INFO  TESTNG INVOKING CONFIGURATION: "Surefire test" - @BeforeMethod
org.apache.brooklyn.core.entity.EntityTypeTest.setUp()
2016-11-11 10:07:41,100 INFO  TESTNG PASSED CONFIGURATION: "Surefire test" - @BeforeMethod
org.apache.brooklyn.core.entity.EntityTypeTest.setUp() finished in 122 ms
2016-11-11 10:07:41,101 INFO  TESTNG INVOKING: "Surefire test" - org.apache.brooklyn.core.entity.EntityTypeTest.testRemoveSensor()
2016-11-11 10:07:41,102 INFO  TESTNG PASSED: "Surefire test" - org.apache.brooklyn.core.entity.EntityTypeTest.testRemoveSensor()
finished in 1 ms
2016-11-11 10:07:41,102 INFO  TESTNG INVOKING CONFIGURATION: "Surefire test" - @AfterMethod
org.apache.brooklyn.core.test.BrooklynMgmtUnitTestSupport.tearDown()
2016-11-11 10:07:41,138 INFO  TESTNG PASSED CONFIGURATION: "Surefire test" - @AfterMethod
org.apache.brooklyn.core.test.BrooklynMgmtUnitTestSupport.tearDown() finished in 36 ms
2016-11-11 10:07:41,139 INFO  TESTNG INVOKING CONFIGURATION: "Surefire test" - @BeforeMethod
org.apache.brooklyn.core.entity.EntityTypeTest.setUp()
2016-11-11 10:07:41,265 INFO  TESTNG PASSED CONFIGURATION: "Surefire test" - @BeforeMethod
org.apache.brooklyn.core.entity.EntityTypeTest.setUp() finished in 126 ms
2016-11-11 10:07:41,265 INFO  TESTNG INVOKING: "Surefire test" - org.apache.brooklyn.core.entity.EntityTypeTest.testRemoveSensorThroughEntity()
2016-11-11 10:07:41,267 INFO  TESTNG PASSED: "Surefire test" - org.apache.brooklyn.core.entity.EntityTypeTest.testRemoveSensorThroughEntity()
finished in 1 ms
2016-11-11 10:07:41,268 INFO  TESTNG INVOKING CONFIGURATION: "Surefire test" - @AfterMethod
org.apache.brooklyn.core.test.BrooklynMgmtUnitTestSupport.tearDown()
2016-11-11 10:07:41,310 INFO  TESTNG PASSED CONFIGURATION: "Surefire test" - @AfterMethod
org.apache.brooklyn.core.test.BrooklynMgmtUnitTestSupport.tearDown() finished in 43 ms
2016-11-11 10:07:41,311 INFO  TESTNG INVOKING CONFIGURATION: "Surefire test" - @BeforeMethod
org.apache.brooklyn.core.entity.EntityTypeTest.setUp()
2016-11-11 10:07:41,356 INFO  TESTNG PASSED CONFIGURATION: "Surefire test" - @BeforeMethod
org.apache.brooklyn.core.entity.EntityTypeTest.setUp() finished in 45 ms
2016-11-11 10:07:41,356 INFO  TESTNG INVOKING: "Surefire test" - org.apache.brooklyn.core.entity.EntityTypeTest.testRemoveSensors()
2016-11-11 10:07:41,366 INFO  TESTNG PASSED: "Surefire test" - org.apache.brooklyn.core.entity.EntityTypeTest.testRemoveSensors()
finished in 10 ms
2016-11-11 10:07:41,366 INFO  TESTNG INVOKING CONFIGURATION: "Surefire test" - @AfterMethod
org.apache.brooklyn.core.test.BrooklynMgmtUnitTestSupport.tearDown()
2016-11-11 10:07:41,378 INFO  TESTNG PASSED CONFIGURATION: "Surefire test" - @AfterMethod
org.apache.brooklyn.core.test.BrooklynMgmtUnitTestSupport.tearDown() finished in 12 ms
SUREFIRE-859: [GC 652553K->441409K(764928K), 0.1263030 secs]
2016-11-11 10:07:41,606 WARN  Task Task[LSM.publish(TestEntityImpl{id=hu4b5tiyqc}.Sensor:
service.state.expected (org.apache.brooklyn.core.entity.lifecycle.Lifecycle$Transition)=stopped
@ 1478858854687 / Fri Nov 11 10:07:34 UTC 2016 @ 1478858854687);[subscription-delivery-entity-hu4b5tiyqc[TestEntityImpl{id=hu4b5tiyqc}],
Wrapped[contextEntity:TestEntityImpl{id=hu4b5tiyqc}]]]@QAFElFGx is being finalized before
completion
2016-11-11 10:07:41,608 WARN  Task Task[LSM.publish(Application[cup6f37f].Sensor: entity.children.removed
(org.apache.brooklyn.api.entity.Entity)=TestEntityImpl{id=s3ibbz6hzm} @ 1478858856990);[Wrapped[contextEntity:Application[cup6f37f]],
subscription-delivery-entity-btcup6f37f[Application[cup6f37f]]]]@oeAcZWLw is being finalized
before completion
2016-11-11 10:07:41,608 WARN  Task Task[LSM.publish(Application[cup6f37f].Sensor: service.state.expected
(org.apache.brooklyn.core.entity.lifecycle.Lifecycle$Transition)=stopped @ 1478858856989 /
Fri Nov 11 10:07:36 UTC 2016 @ 1478858856989);[Wrapped[contextEntity:Application[cup6f37f]],
subscription-delivery-entity-btcup6f37f[Application[cup6f37f]]]]@RCIEoObS is being finalized
before completion
2016-11-11 10:07:41,608 WARN  Task Task[LSM.publish(Application[rwvux448].Sensor: entity.children.removed
(org.apache.brooklyn.api.entity.Entity)=TestEntityImpl{id=upghcdj7xb} @ 1478858856640);[Wrapped[contextEntity:Application[rwvux448]],
subscription-delivery-entity-u5rwvux448[Application[rwvux448]]]]@WfEC39Lu is being finalized
before completion
2016-11-11 10:07:41,608 WARN  Task Task[LSM.publish(Application[rwvux448].Sensor: service.state.expected
(org.apache.brooklyn.core.entity.lifecycle.Lifecycle$Transition)=stopped @ 1478858856640 /
Fri Nov 11 10:07:36 UTC 2016 @ 1478858856640);[Wrapped[contextEntity:Application[rwvux448]],
subscription-delivery-entity-u5rwvux448[Application[rwvux448]]]]@ImHLYv8x is being finalized
before completion
2016-11-11 10:07:41,608 WARN  Task Task[LSM.publish(Application[rwvux448].Sensor: service.notUp.indicators
(java.util.Map)={service.state=Application stopped} @ 1478858856640);[Wrapped[contextEntity:Application[rwvux448]],
subscription-delivery-entity-u5rwvux448[Application[rwvux448]]]]@iR4nRUjU is being finalized
before completion
2016-11-11 10:07:41,608 WARN  Task Task[LSM.publish(TestEntityImpl{id=upghcdj7xb}.Sensor:
service.state (org.apache.brooklyn.core.entity.lifecycle.Lifecycle)=stopped @ 1478858856639);[Wrapped[contextEntity:Application[rwvux448]],
subscription-delivery-entity-u5rwvux448[Application[rwvux448]]]]@mwXQ0FBH is being finalized
before completion
2016-11-11 10:07:41,610 WARN  Task Task[LSM.publish(Application[se3jt235].Sensor: entity.children.removed
(org.apache.brooklyn.api.entity.Entity)=TestEntityImpl{id=ihsuq9iq9p} @ 1478858858662);[Wrapped[contextEntity:Application[se3jt235]],
subscription-delivery-entity-vcse3jt235[Application[se3jt235]]]]@A6oanrrz is being finalized
before completion
2016-11-11 10:07:41,610 WARN  Task Task[LSM.publish(Application[se3jt235].Sensor: service.state.expected
(org.apache.brooklyn.core.entity.lifecycle.Lifecycle$Transition)=stopped @ 1478858858648 /
Fri Nov 11 10:07:38 UTC 2016 @ 1478858858648);[Wrapped[contextEntity:Application[se3jt235]],
subscription-delivery-entity-vcse3jt235[Application[se3jt235]]]]@BuzoSTDE is being finalized
before completion
2016-11-11 10:07:41,610 WARN  Task Task[LSM.publish(Application[se3jt235].Sensor: service.notUp.indicators
(java.util.Map)={service.state=Application stopped} @ 1478858858648);[Wrapped[contextEntity:Application[se3jt235]],
subscription-delivery-entity-vcse3jt235[Application[se3jt235]]]]@QkddSFrZ is being finalized
before completion
2016-11-11 10:07:41,610 WARN  Task Task[LSM.publish(TestEntityImpl{id=ihsuq9iq9p}.Sensor:
service.state (org.apache.brooklyn.core.entity.lifecycle.Lifecycle)=stopped @ 1478858858647);[Wrapped[contextEntity:Application[se3jt235]],
subscription-delivery-entity-vcse3jt235[Application[se3jt235]]]]@JWk2jvit is being finalized
before completion
2016-11-11 10:07:41,610 WARN  Task Task[LSM.publish(TestEntityImpl{id=ihsuq9iq9p}.Sensor:
service.isUp (java.lang.Boolean)=false @ 1478858858647);[Wrapped[contextEntity:Application[se3jt235]],
subscription-delivery-entity-vcse3jt235[Application[se3jt235]]]]@YWehXkRu is being finalized
before completion
2016-11-11 10:07:41,612 WARN  Task Task[LSM.publish(Application[cmayw7m6].Sensor: entity.children.removed
(org.apache.brooklyn.api.entity.Entity)=EntityWithToStringAccessingConfig{id=j7npjynm0u}defaultval
@ 1478858860031);[subscription-delivery-entity-elcmayw7m6[Application[cmayw7m6]], Wrapped[contextEntity:Application[cmayw7m6]]]]@SSDHMKqh
is being finalized before completion
2016-11-11 10:07:41,612 WARN  Task Task[LSM.publish(Application[cmayw7m6].Sensor: entity.children.removed
(org.apache.brooklyn.api.entity.Entity)=EmptyEntityForTesting{id=jg3d7n4qmk} @ 1478858860031);[subscription-delivery-entity-elcmayw7m6[Application[cmayw7m6]],
Wrapped[contextEntity:Application[cmayw7m6]]]]@JOmNYYju is being finalized before completion
2016-11-11 10:07:41,612 WARN  Task Task[LSM.publish(Application[cmayw7m6].Sensor: service.state.expected
(org.apache.brooklyn.core.entity.lifecycle.Lifecycle$Transition)=stopped @ 1478858860030 /
Fri Nov 11 10:07:40 UTC 2016 @ 1478858860030);[subscription-delivery-entity-elcmayw7m6[Application[cmayw7m6]],
Wrapped[contextEntity:Application[cmayw7m6]]]]@phvXVrFe is being finalized before completion
2016-11-11 10:07:41,977 INFO  TESTNG 
===============================================
    Surefire test
    Tests run: 1950, Failures: 1, Skips: 0
===============================================
2016-11-11 10:07:41,978 WARN  Management Context LocalManagementContext[PGD7N0tU-cNBmPQ92]
running, creation stacktrace:
java.lang.Throwable: for construction stacktrace
	at org.apache.brooklyn.core.mgmt.internal.LocalManagementContext.<init>(LocalManagementContext.java:131)
	at org.apache.brooklyn.core.mgmt.internal.LocalManagementContext.<init>(LocalManagementContext.java:164)
	at org.apache.brooklyn.core.mgmt.internal.LocalManagementContext.<init>(LocalManagementContext.java:156)
	at org.apache.brooklyn.core.mgmt.internal.LocalManagementContext.<init>(LocalManagementContext.java:143)
	at org.apache.brooklyn.core.test.entity.LocalManagementContextForTests.<init>(LocalManagementContextForTests.java:43)
	at org.apache.brooklyn.core.test.entity.LocalManagementContextForTests$Builder.build(LocalManagementContextForTests.java:145)
	at org.apache.brooklyn.core.BrooklynVersionTest.testGetFeatures(BrooklynVersionTest.java:97)
	at sun.reflect.NativeMethodAccessorImpl.invoke0(Native Method)
	at sun.reflect.NativeMethodAccessorImpl.invoke(NativeMethodAccessorImpl.java:57)
	at sun.reflect.DelegatingMethodAccessorImpl.invoke(DelegatingMethodAccessorImpl.java:43)
	at java.lang.reflect.Method.invoke(Method.java:606)
	at org.testng.internal.MethodInvocationHelper.invokeMethod(MethodInvocationHelper.java:86)
	at org.testng.internal.Invoker.invokeMethod(Invoker.java:643)
	at org.testng.internal.Invoker.invokeTestMethod(Invoker.java:820)
	at org.testng.internal.Invoker.invokeTestMethods(Invoker.java:1128)
	at org.testng.internal.TestMethodWorker.invokeTestMethods(TestMethodWorker.java:129)
	at org.testng.internal.TestMethodWorker.run(TestMethodWorker.java:112)
	at org.testng.TestRunner.privateRun(TestRunner.java:782)
	at org.testng.TestRunner.run(TestRunner.java:632)
	at org.testng.SuiteRunner.runTest(SuiteRunner.java:366)
	at org.testng.SuiteRunner.runSequentially(SuiteRunner.java:361)
	at org.testng.SuiteRunner.privateRun(SuiteRunner.java:319)
	at org.testng.SuiteRunner.run(SuiteRunner.java:268)
	at org.testng.SuiteRunnerWorker.runSuite(SuiteRunnerWorker.java:52)
	at org.testng.SuiteRunnerWorker.run(SuiteRunnerWorker.java:86)
	at org.testng.TestNG.runSuitesSequentially(TestNG.java:1244)
	at org.testng.TestNG.runSuitesLocally(TestNG.java:1169)
	at org.testng.TestNG.run(TestNG.java:1064)
	at org.apache.maven.surefire.testng.TestNGExecutor.run(TestNGExecutor.java:115)
	at org.apache.maven.surefire.testng.TestNGDirectoryTestSuite.executeMulti(TestNGDirectoryTestSuite.java:205)
	at org.apache.maven.surefire.testng.TestNGDirectoryTestSuite.execute(TestNGDirectoryTestSuite.java:108)
	at org.apache.maven.surefire.testng.TestNGProvider.invoke(TestNGProvider.java:111)
	at org.apache.maven.surefire.booter.ForkedBooter.invokeProviderInSameClassLoader(ForkedBooter.java:203)
	at org.apache.maven.surefire.booter.ForkedBooter.runSuitesInProcess(ForkedBooter.java:155)
	at org.apache.maven.surefire.booter.ForkedBooter.main(ForkedBooter.java:103)

2016-11-11 10:07:42,057 INFO  BrooklynLeakListener.onFinish attempting to terminate all extant
ManagementContexts: name=Surefire test; includedGroups=[]; excludedGroups=[Integration, Live-sanity,
Acceptance, Live, Broken, WIP]; suiteName=Surefire suite; outDir=<https://builds.apache.org/job/brooklyn-server-master/ws/core/target/surefire-reports/Surefire>
suite: 1 ManagementContexts terminated
SUREFIRE-859: [GC 659521K->435708K(763904K), 0.0509720 secs]
Tests run: 1950, Failures: 1, Errors: 0, Skipped: 0, Time elapsed: 503.28 sec <<<
FAILURE! - in TestSuite
testGetTasksAndGcBoringTags(org.apache.brooklyn.core.mgmt.internal.EntityExecutionManagerTest)
 Time elapsed: 0.088 sec  <<< FAILURE!
java.lang.AssertionError: Tasks were [Task[LSM.publishInitialValue(TestEntityImpl{id=koolwkjpnn},
Sensor: service.notUp.indicators (java.util.Map));[subscription-delivery-entity-koolwkjpnn[TestEntityImpl{id=koolwkjpnn}],
Wrapped[contextEntity:TestEntityImpl{id=koolwkjpnn}]]]@bMZ5nWzQ, Task[should-be-kept]@U068tlNQ]
expected [1] but found [2]
	at org.testng.Assert.fail(Assert.java:94)
	at org.testng.Assert.failNotEquals(Assert.java:513)
	at org.testng.Assert.assertEqualsImpl(Assert.java:135)
	at org.testng.Assert.assertEquals(Assert.java:116)
	at org.testng.Assert.assertEquals(Assert.java:389)
	at org.apache.brooklyn.core.mgmt.internal.EntityExecutionManagerTest$2.call(EntityExecutionManagerTest.java:150)
	at org.apache.brooklyn.core.mgmt.internal.EntityExecutionManagerTest$2.call(EntityExecutionManagerTest.java:145)
	at org.apache.brooklyn.util.repeat.Repeater.runKeepingError(Repeater.java:336)
	at org.apache.brooklyn.util.repeat.Repeater.runRequiringTrue(Repeater.java:307)
	at org.apache.brooklyn.core.mgmt.internal.EntityExecutionManagerTest.assertTaskCountForEntitySoon(EntityExecutionManagerTest.java:145)
	at org.apache.brooklyn.core.mgmt.internal.EntityExecutionManagerTest.testGetTasksAndGcBoringTags(EntityExecutionManagerTest.java:164)

2016-11-11 10:07:46,050 INFO  Brooklyn shutdown: stopping entities [TestEntityImpl{id=vf1tg89nop},
TestEntityImpl{id=kegko18uol}, BlockingEntityImpl{id=pl7xdn0pml}]

Results :

Failed tests: 
  EntityExecutionManagerTest.testGetTasksAndGcBoringTags:164->assertTaskCountForEntitySoon:145
Tasks were [Task[LSM.publishInitialValue(TestEntityImpl{id=koolwkjpnn}, Sensor: service.notUp.indicators
(java.util.Map));[subscription-delivery-entity-koolwkjpnn[TestEntityImpl{id=koolwkjpnn}],
Wrapped[contextEntity:TestEntityImpl{id=koolwkjpnn}]]]@bMZ5nWzQ, Task[should-be-kept]@U068tlNQ]
expected [1] but found [2]

Tests run: 1950, Failures: 1, Errors: 0, Skipped: 0

[JENKINS] Recording test results
[INFO] ------------------------------------------------------------------------
[INFO] Reactor Summary:
[INFO] 
[INFO] Brooklyn Server Root ............................... SUCCESS [  4.544 s]
[INFO] Brooklyn Parent Project ............................ SUCCESS [  5.563 s]
[INFO] Brooklyn Test Support Utilities .................... SUCCESS [ 10.699 s]
[INFO] Brooklyn Logback Includable Configuration .......... SUCCESS [  3.499 s]
[INFO] Brooklyn Common Utilities .......................... SUCCESS [ 46.178 s]
[INFO] Brooklyn API ....................................... SUCCESS [  6.727 s]
[INFO] CAMP Server Parent Project ......................... SUCCESS [  1.170 s]
[INFO] CAMP Base .......................................... SUCCESS [  8.122 s]
[INFO] Brooklyn Test Support .............................. SUCCESS [  4.601 s]
[INFO] Brooklyn REST Swagger Apidoc Utilities ............. SUCCESS [  5.005 s]
[INFO] Brooklyn Logback Configuration ..................... SUCCESS [  2.564 s]
[INFO] CAMP Server ........................................ SUCCESS [ 11.135 s]
[INFO] Brooklyn Felix Runtime ............................. SUCCESS [  7.704 s]
[INFO] Brooklyn Groovy Utilities .......................... SUCCESS [  3.540 s]
[INFO] Brooklyn Core ...................................... FAILURE [09:29 min]
[INFO] Brooklyn Policies .................................. SKIPPED
[INFO] Brooklyn WinRM Software Entities ................... SKIPPED
[INFO] Brooklyn Secure JMXMP Agent ........................ SKIPPED
[INFO] Brooklyn JMX RMI Agent ............................. SKIPPED
[INFO] Brooklyn Jclouds Location Targets .................. SKIPPED
[INFO] Brooklyn Software Base ............................. SKIPPED
[INFO] Brooklyn CAMP ...................................... SKIPPED
[INFO] Brooklyn Hazelcast Storage ......................... SKIPPED
[INFO] Brooklyn Launcher Common ........................... SKIPPED
[INFO] Brooklyn REST API .................................. SKIPPED
[INFO] Brooklyn REST Resources ............................ SKIPPED
[INFO] Brooklyn REST Server ............................... SKIPPED
[INFO] Brooklyn Launcher .................................. SKIPPED
[INFO] Brooklyn Command Line Interface .................... SKIPPED
[INFO] Brooklyn Test Framework ............................ SKIPPED
[INFO] Brooklyn OSGi init ................................. SKIPPED
[INFO] Brooklyn Karaf ..................................... SKIPPED
[INFO] Jetty config fragment .............................. SKIPPED
[INFO] Apache Http Component extension .................... SKIPPED
[INFO] Brooklyn Karaf Features ............................ SKIPPED
[INFO] Brooklyn Karaf Shell Commands ...................... SKIPPED
[INFO] ------------------------------------------------------------------------
[INFO] BUILD FAILURE
[INFO] ------------------------------------------------------------------------
[INFO] Total time: 12:06 min
[INFO] Finished at: 2016-11-11T10:07:58+00:00
[INFO] Final Memory: 103M/588M
[INFO] ------------------------------------------------------------------------
Waiting for Jenkins to finish collecting data[ERROR] Failed to execute goal org.apache.maven.plugins:maven-surefire-plugin:2.18.1:test
(default-test) on project brooklyn-core: There are test failures.
[ERROR] 
[ERROR] Please refer to <https://builds.apache.org/job/brooklyn-server-master/ws/core/target/surefire-reports>
for the individual test results.
[ERROR] -> [Help 1]
[ERROR] 
[ERROR] To see the full stack trace of the errors, re-run Maven with the -e switch.
[ERROR] Re-run Maven using the -X switch to enable full debug logging.
[ERROR] 
[ERROR] For more information about the errors and possible solutions, please read the following
articles:
[ERROR] [Help 1] http://cwiki.apache.org/confluence/display/MAVEN/MojoFailureException
[ERROR] 
[ERROR] After correcting the problems, you can resume the build with the command
[ERROR]   mvn <goals> -rf :brooklyn-core

[JENKINS] Archiving <https://builds.apache.org/job/brooklyn-server-master/ws/camp/pom.xml>
to org.apache.brooklyn.camp/camp-parent/0.10.0-SNAPSHOT/camp-parent-0.10.0-SNAPSHOT.pom
[JENKINS] Archiving <https://builds.apache.org/job/brooklyn-server-master/ws/utils/rt-felix/pom.xml>
to org.apache.brooklyn/brooklyn-rt-felix/0.10.0-SNAPSHOT/brooklyn-rt-felix-0.10.0-SNAPSHOT.pom
[JENKINS] Archiving <https://builds.apache.org/job/brooklyn-server-master/ws/utils/rt-felix/target/brooklyn-rt-felix-0.10.0-SNAPSHOT.jar>
to org.apache.brooklyn/brooklyn-rt-felix/0.10.0-SNAPSHOT/brooklyn-rt-felix-0.10.0-SNAPSHOT.jar
[JENKINS] Archiving <https://builds.apache.org/job/brooklyn-server-master/ws/utils/rt-felix/target/brooklyn-rt-felix-0.10.0-SNAPSHOT-tests.jar>
to org.apache.brooklyn/brooklyn-rt-felix/0.10.0-SNAPSHOT/brooklyn-rt-felix-0.10.0-SNAPSHOT-tests.jar
[JENKINS] Archiving <https://builds.apache.org/job/brooklyn-server-master/ws/utils/rt-felix/target/brooklyn-rt-felix-0.10.0-SNAPSHOT-sources.jar>
to org.apache.brooklyn/brooklyn-rt-felix/0.10.0-SNAPSHOT/brooklyn-rt-felix-0.10.0-SNAPSHOT-sources.jar
[JENKINS] Archiving <https://builds.apache.org/job/brooklyn-server-master/ws/utils/rt-felix/target/brooklyn-rt-felix-0.10.0-SNAPSHOT-test-sources.jar>
to org.apache.brooklyn/brooklyn-rt-felix/0.10.0-SNAPSHOT/brooklyn-rt-felix-0.10.0-SNAPSHOT-test-sources.jar
[JENKINS] Archiving <https://builds.apache.org/job/brooklyn-server-master/ws/test-framework/pom.xml>
to org.apache.brooklyn/brooklyn-test-framework/0.10.0-SNAPSHOT/brooklyn-test-framework-0.10.0-SNAPSHOT.pom
[JENKINS] Archiving <https://builds.apache.org/job/brooklyn-server-master/ws/core/pom.xml>
to org.apache.brooklyn/brooklyn-core/0.10.0-SNAPSHOT/brooklyn-core-0.10.0-SNAPSHOT.pom
[JENKINS] Archiving <https://builds.apache.org/job/brooklyn-server-master/ws/camp/camp-server/pom.xml>
to org.apache.brooklyn.camp/camp-server/0.10.0-SNAPSHOT/camp-server-0.10.0-SNAPSHOT.pom
[JENKINS] Archiving <https://builds.apache.org/job/brooklyn-server-master/ws/camp/camp-server/target/camp-server-0.10.0-SNAPSHOT.jar>
to org.apache.brooklyn.camp/camp-server/0.10.0-SNAPSHOT/camp-server-0.10.0-SNAPSHOT.jar
[JENKINS] Archiving <https://builds.apache.org/job/brooklyn-server-master/ws/camp/camp-server/target/camp-server-0.10.0-SNAPSHOT-tests.jar>
to org.apache.brooklyn.camp/camp-server/0.10.0-SNAPSHOT/camp-server-0.10.0-SNAPSHOT-tests.jar
[JENKINS] Archiving <https://builds.apache.org/job/brooklyn-server-master/ws/camp/camp-server/target/camp-server-0.10.0-SNAPSHOT-sources.jar>
to org.apache.brooklyn.camp/camp-server/0.10.0-SNAPSHOT/camp-server-0.10.0-SNAPSHOT-sources.jar
[JENKINS] Archiving <https://builds.apache.org/job/brooklyn-server-master/ws/camp/camp-server/target/camp-server-0.10.0-SNAPSHOT-test-sources.jar>
to org.apache.brooklyn.camp/camp-server/0.10.0-SNAPSHOT/camp-server-0.10.0-SNAPSHOT-test-sources.jar
[JENKINS] Archiving <https://builds.apache.org/job/brooklyn-server-master/ws/launcher/pom.xml>
to org.apache.brooklyn/brooklyn-launcher/0.10.0-SNAPSHOT/brooklyn-launcher-0.10.0-SNAPSHOT.pom
[JENKINS] Archiving <https://builds.apache.org/job/brooklyn-server-master/ws/karaf/pom.xml>
to org.apache.brooklyn/brooklyn-karaf/0.10.0-SNAPSHOT/brooklyn-karaf-0.10.0-SNAPSHOT.pom
[JENKINS] Archiving <https://builds.apache.org/job/brooklyn-server-master/ws/karaf/httpcomponent-extension/pom.xml>
to org.apache.brooklyn/brooklyn-karaf-httpcomponents-extension/0.10.0-SNAPSHOT/brooklyn-karaf-httpcomponents-extension-0.10.0-SNAPSHOT.pom
[JENKINS] Archiving <https://builds.apache.org/job/brooklyn-server-master/ws/utils/test-support/pom.xml>
to org.apache.brooklyn/brooklyn-utils-test-support/0.10.0-SNAPSHOT/brooklyn-utils-test-support-0.10.0-SNAPSHOT.pom
[JENKINS] Archiving <https://builds.apache.org/job/brooklyn-server-master/ws/utils/test-support/target/brooklyn-utils-test-support-0.10.0-SNAPSHOT.jar>
to org.apache.brooklyn/brooklyn-utils-test-support/0.10.0-SNAPSHOT/brooklyn-utils-test-support-0.10.0-SNAPSHOT.jar
[JENKINS] Archiving <https://builds.apache.org/job/brooklyn-server-master/ws/utils/test-support/target/brooklyn-utils-test-support-0.10.0-SNAPSHOT-sources.jar>
to org.apache.brooklyn/brooklyn-utils-test-support/0.10.0-SNAPSHOT/brooklyn-utils-test-support-0.10.0-SNAPSHOT-sources.jar
[JENKINS] Archiving <https://builds.apache.org/job/brooklyn-server-master/ws/utils/test-support/target/brooklyn-utils-test-support-0.10.0-SNAPSHOT-test-sources.jar>
to org.apache.brooklyn/brooklyn-utils-test-support/0.10.0-SNAPSHOT/brooklyn-utils-test-support-0.10.0-SNAPSHOT-test-sources.jar
[JENKINS] Archiving <https://builds.apache.org/job/brooklyn-server-master/ws/software/base/pom.xml>
to org.apache.brooklyn/brooklyn-software-base/0.10.0-SNAPSHOT/brooklyn-software-base-0.10.0-SNAPSHOT.pom
[JENKINS] Archiving <https://builds.apache.org/job/brooklyn-server-master/ws/utils/groovy/pom.xml>
to org.apache.brooklyn/brooklyn-utils-groovy/0.10.0-SNAPSHOT/brooklyn-utils-groovy-0.10.0-SNAPSHOT.pom
[JENKINS] Archiving <https://builds.apache.org/job/brooklyn-server-master/ws/utils/groovy/target/brooklyn-utils-groovy-0.10.0-SNAPSHOT.jar>
to org.apache.brooklyn/brooklyn-utils-groovy/0.10.0-SNAPSHOT/brooklyn-utils-groovy-0.10.0-SNAPSHOT.jar
[JENKINS] Archiving <https://builds.apache.org/job/brooklyn-server-master/ws/utils/groovy/target/brooklyn-utils-groovy-0.10.0-SNAPSHOT-tests.jar>
to org.apache.brooklyn/brooklyn-utils-groovy/0.10.0-SNAPSHOT/brooklyn-utils-groovy-0.10.0-SNAPSHOT-tests.jar
[JENKINS] Archiving <https://builds.apache.org/job/brooklyn-server-master/ws/utils/groovy/target/brooklyn-utils-groovy-0.10.0-SNAPSHOT-sources.jar>
to org.apache.brooklyn/brooklyn-utils-groovy/0.10.0-SNAPSHOT/brooklyn-utils-groovy-0.10.0-SNAPSHOT-sources.jar
[JENKINS] Archiving <https://builds.apache.org/job/brooklyn-server-master/ws/utils/groovy/target/brooklyn-utils-groovy-0.10.0-SNAPSHOT-test-sources.jar>
to org.apache.brooklyn/brooklyn-utils-groovy/0.10.0-SNAPSHOT/brooklyn-utils-groovy-0.10.0-SNAPSHOT-test-sources.jar
[JENKINS] Archiving <https://builds.apache.org/job/brooklyn-server-master/ws/utils/rest-swagger/pom.xml>
to org.apache.brooklyn/brooklyn-utils-rest-swagger/0.10.0-SNAPSHOT/brooklyn-utils-rest-swagger-0.10.0-SNAPSHOT.pom
[JENKINS] Archiving <https://builds.apache.org/job/brooklyn-server-master/ws/utils/rest-swagger/target/brooklyn-utils-rest-swagger-0.10.0-SNAPSHOT.jar>
to org.apache.brooklyn/brooklyn-utils-rest-swagger/0.10.0-SNAPSHOT/brooklyn-utils-rest-swagger-0.10.0-SNAPSHOT.jar
[JENKINS] Archiving <https://builds.apache.org/job/brooklyn-server-master/ws/utils/rest-swagger/target/brooklyn-utils-rest-swagger-0.10.0-SNAPSHOT-sources.jar>
to org.apache.brooklyn/brooklyn-utils-rest-swagger/0.10.0-SNAPSHOT/brooklyn-utils-rest-swagger-0.10.0-SNAPSHOT-sources.jar
[JENKINS] Archiving <https://builds.apache.org/job/brooklyn-server-master/ws/utils/rest-swagger/target/brooklyn-utils-rest-swagger-0.10.0-SNAPSHOT-test-sources.jar>
to org.apache.brooklyn/brooklyn-utils-rest-swagger/0.10.0-SNAPSHOT/brooklyn-utils-rest-swagger-0.10.0-SNAPSHOT-test-sources.jar
[JENKINS] Archiving <https://builds.apache.org/job/brooklyn-server-master/ws/launcher-common/pom.xml>
to org.apache.brooklyn/brooklyn-launcher-common/0.10.0-SNAPSHOT/brooklyn-launcher-common-0.10.0-SNAPSHOT.pom
[JENKINS] Archiving <https://builds.apache.org/job/brooklyn-server-master/ws/camp/camp-base/pom.xml>
to org.apache.brooklyn.camp/camp-base/0.10.0-SNAPSHOT/camp-base-0.10.0-SNAPSHOT.pom
[JENKINS] Archiving <https://builds.apache.org/job/brooklyn-server-master/ws/camp/camp-base/target/camp-base-0.10.0-SNAPSHOT.jar>
to org.apache.brooklyn.camp/camp-base/0.10.0-SNAPSHOT/camp-base-0.10.0-SNAPSHOT.jar
[JENKINS] Archiving <https://builds.apache.org/job/brooklyn-server-master/ws/camp/camp-base/target/camp-base-0.10.0-SNAPSHOT-tests.jar>
to org.apache.brooklyn.camp/camp-base/0.10.0-SNAPSHOT/camp-base-0.10.0-SNAPSHOT-tests.jar
[JENKINS] Archiving <https://builds.apache.org/job/brooklyn-server-master/ws/camp/camp-base/target/camp-base-0.10.0-SNAPSHOT-sources.jar>
to org.apache.brooklyn.camp/camp-base/0.10.0-SNAPSHOT/camp-base-0.10.0-SNAPSHOT-sources.jar
[JENKINS] Archiving <https://builds.apache.org/job/brooklyn-server-master/ws/camp/camp-base/target/camp-base-0.10.0-SNAPSHOT-test-sources.jar>
to org.apache.brooklyn.camp/camp-base/0.10.0-SNAPSHOT/camp-base-0.10.0-SNAPSHOT-test-sources.jar
[JENKINS] Archiving <https://builds.apache.org/job/brooklyn-server-master/ws/camp/camp-brooklyn/pom.xml>
to org.apache.brooklyn/brooklyn-camp/0.10.0-SNAPSHOT/brooklyn-camp-0.10.0-SNAPSHOT.pom
[JENKINS] Archiving <https://builds.apache.org/job/brooklyn-server-master/ws/karaf/jetty-config/pom.xml>
to org.apache.brooklyn/brooklyn-karaf-jetty-config/0.10.0-SNAPSHOT/brooklyn-karaf-jetty-config-0.10.0-SNAPSHOT.pom
[JENKINS] Archiving <https://builds.apache.org/job/brooklyn-server-master/ws/server-cli/pom.xml>
to org.apache.brooklyn/brooklyn-cli/0.10.0-SNAPSHOT/brooklyn-cli-0.10.0-SNAPSHOT.pom
[JENKINS] Archiving <https://builds.apache.org/job/brooklyn-server-master/ws/logging/logback-xml/pom.xml>
to org.apache.brooklyn/brooklyn-logback-xml/0.10.0-SNAPSHOT/brooklyn-logback-xml-0.10.0-SNAPSHOT.pom
[JENKINS] Archiving <https://builds.apache.org/job/brooklyn-server-master/ws/logging/logback-xml/target/brooklyn-logback-xml-0.10.0-SNAPSHOT.jar>
to org.apache.brooklyn/brooklyn-logback-xml/0.10.0-SNAPSHOT/brooklyn-logback-xml-0.10.0-SNAPSHOT.jar
[JENKINS] Archiving <https://builds.apache.org/job/brooklyn-server-master/ws/logging/logback-xml/target/brooklyn-logback-xml-0.10.0-SNAPSHOT-sources.jar>
to org.apache.brooklyn/brooklyn-logback-xml/0.10.0-SNAPSHOT/brooklyn-logback-xml-0.10.0-SNAPSHOT-sources.jar
[JENKINS] Archiving <https://builds.apache.org/job/brooklyn-server-master/ws/logging/logback-xml/target/brooklyn-logback-xml-0.10.0-SNAPSHOT-test-sources.jar>
to org.apache.brooklyn/brooklyn-logback-xml/0.10.0-SNAPSHOT/brooklyn-logback-xml-0.10.0-SNAPSHOT-test-sources.jar
[JENKINS] Archiving <https://builds.apache.org/job/brooklyn-server-master/ws/test-support/pom.xml>
to org.apache.brooklyn/brooklyn-test-support/0.10.0-SNAPSHOT/brooklyn-test-support-0.10.0-SNAPSHOT.pom
[JENKINS] Archiving <https://builds.apache.org/job/brooklyn-server-master/ws/test-support/target/brooklyn-test-support-0.10.0-SNAPSHOT.jar>
to org.apache.brooklyn/brooklyn-test-support/0.10.0-SNAPSHOT/brooklyn-test-support-0.10.0-SNAPSHOT.jar
[JENKINS] Archiving <https://builds.apache.org/job/brooklyn-server-master/ws/test-support/target/brooklyn-test-support-0.10.0-SNAPSHOT-sources.jar>
to org.apache.brooklyn/brooklyn-test-support/0.10.0-SNAPSHOT/brooklyn-test-support-0.10.0-SNAPSHOT-sources.jar
[JENKINS] Archiving <https://builds.apache.org/job/brooklyn-server-master/ws/test-support/target/brooklyn-test-support-0.10.0-SNAPSHOT-test-sources.jar>
to org.apache.brooklyn/brooklyn-test-support/0.10.0-SNAPSHOT/brooklyn-test-support-0.10.0-SNAPSHOT-test-sources.jar
[JENKINS] Archiving <https://builds.apache.org/job/brooklyn-server-master/ws/rest/rest-server/pom.xml>
to org.apache.brooklyn/brooklyn-rest-server/0.10.0-SNAPSHOT/brooklyn-rest-server-0.10.0-SNAPSHOT.pom
[JENKINS] Archiving <https://builds.apache.org/job/brooklyn-server-master/ws/api/pom.xml>
to org.apache.brooklyn/brooklyn-api/0.10.0-SNAPSHOT/brooklyn-api-0.10.0-SNAPSHOT.pom
[JENKINS] Archiving <https://builds.apache.org/job/brooklyn-server-master/ws/api/target/brooklyn-api-0.10.0-SNAPSHOT.jar>
to org.apache.brooklyn/brooklyn-api/0.10.0-SNAPSHOT/brooklyn-api-0.10.0-SNAPSHOT.jar
[JENKINS] Archiving <https://builds.apache.org/job/brooklyn-server-master/ws/api/target/brooklyn-api-0.10.0-SNAPSHOT-sources.jar>
to org.apache.brooklyn/brooklyn-api/0.10.0-SNAPSHOT/brooklyn-api-0.10.0-SNAPSHOT-sources.jar
[JENKINS] Archiving <https://builds.apache.org/job/brooklyn-server-master/ws/api/target/brooklyn-api-0.10.0-SNAPSHOT-test-sources.jar>
to org.apache.brooklyn/brooklyn-api/0.10.0-SNAPSHOT/brooklyn-api-0.10.0-SNAPSHOT-test-sources.jar
Compressed 287.67 KB of artifacts by 33.4% relative to #326
[JENKINS] Archiving <https://builds.apache.org/job/brooklyn-server-master/ws/pom.xml>
to org.apache.brooklyn/brooklyn-server/0.10.0-SNAPSHOT/brooklyn-server-0.10.0-SNAPSHOT.pom
[JENKINS] Archiving <https://builds.apache.org/job/brooklyn-server-master/ws/locations/jclouds/pom.xml>
to org.apache.brooklyn/brooklyn-locations-jclouds/0.10.0-SNAPSHOT/brooklyn-locations-jclouds-0.10.0-SNAPSHOT.pom
[JENKINS] Archiving <https://builds.apache.org/job/brooklyn-server-master/ws/utils/common/pom.xml>
to org.apache.brooklyn/brooklyn-utils-common/0.10.0-SNAPSHOT/brooklyn-utils-common-0.10.0-SNAPSHOT.pom
[JENKINS] Archiving <https://builds.apache.org/job/brooklyn-server-master/ws/utils/common/target/brooklyn-utils-common-0.10.0-SNAPSHOT.jar>
to org.apache.brooklyn/brooklyn-utils-common/0.10.0-SNAPSHOT/brooklyn-utils-common-0.10.0-SNAPSHOT.jar
[JENKINS] Archiving <https://builds.apache.org/job/brooklyn-server-master/ws/utils/common/target/brooklyn-utils-common-0.10.0-SNAPSHOT-tests.jar>
to org.apache.brooklyn/brooklyn-utils-common/0.10.0-SNAPSHOT/brooklyn-utils-common-0.10.0-SNAPSHOT-tests.jar
[JENKINS] Archiving <https://builds.apache.org/job/brooklyn-server-master/ws/utils/common/target/brooklyn-utils-common-0.10.0-SNAPSHOT-sources.jar>
to org.apache.brooklyn/brooklyn-utils-common/0.10.0-SNAPSHOT/brooklyn-utils-common-0.10.0-SNAPSHOT-sources.jar
[JENKINS] Archiving <https://builds.apache.org/job/brooklyn-server-master/ws/utils/common/target/brooklyn-utils-common-0.10.0-SNAPSHOT-test-sources.jar>
to org.apache.brooklyn/brooklyn-utils-common/0.10.0-SNAPSHOT/brooklyn-utils-common-0.10.0-SNAPSHOT-test-sources.jar
Compressed 1.36 MB of artifacts by 23.0% relative to #326
[JENKINS] Archiving <https://builds.apache.org/job/brooklyn-server-master/ws/karaf/features/pom.xml>
to org.apache.brooklyn/brooklyn-features/0.10.0-SNAPSHOT/brooklyn-features-0.10.0-SNAPSHOT.pom
[JENKINS] Archiving <https://builds.apache.org/job/brooklyn-server-master/ws/rest/rest-api/pom.xml>
to org.apache.brooklyn/brooklyn-rest-api/0.10.0-SNAPSHOT/brooklyn-rest-api-0.10.0-SNAPSHOT.pom
[JENKINS] Archiving <https://builds.apache.org/job/brooklyn-server-master/ws/utils/jmx/jmxrmi-agent/pom.xml>
to org.apache.brooklyn/brooklyn-jmxrmi-agent/0.10.0-SNAPSHOT/brooklyn-jmxrmi-agent-0.10.0-SNAPSHOT.pom
[JENKINS] Archiving <https://builds.apache.org/job/brooklyn-server-master/ws/policy/pom.xml>
to org.apache.brooklyn/brooklyn-policy/0.10.0-SNAPSHOT/brooklyn-policy-0.10.0-SNAPSHOT.pom
[JENKINS] Archiving <https://builds.apache.org/job/brooklyn-server-master/ws/karaf/init/pom.xml>
to org.apache.brooklyn/brooklyn-karaf-init/0.10.0-SNAPSHOT/brooklyn-karaf-init-0.10.0-SNAPSHOT.pom
[JENKINS] Archiving <https://builds.apache.org/job/brooklyn-server-master/ws/karaf/commands/pom.xml>
to org.apache.brooklyn/brooklyn-commands/0.10.0-SNAPSHOT/brooklyn-commands-0.10.0-SNAPSHOT.pom
[JENKINS] Archiving <https://builds.apache.org/job/brooklyn-server-master/ws/storage/hazelcast/pom.xml>
to org.apache.brooklyn/brooklyn-storage-hazelcast/0.10.0-SNAPSHOT/brooklyn-storage-hazelcast-0.10.0-SNAPSHOT.pom
[JENKINS] Archiving <https://builds.apache.org/job/brooklyn-server-master/ws/logging/logback-includes/pom.xml>
to org.apache.brooklyn/brooklyn-logback-includes/0.10.0-SNAPSHOT/brooklyn-logback-includes-0.10.0-SNAPSHOT.pom
[JENKINS] Archiving <https://builds.apache.org/job/brooklyn-server-master/ws/logging/logback-includes/target/brooklyn-logback-includes-0.10.0-SNAPSHOT.jar>
to org.apache.brooklyn/brooklyn-logback-includes/0.10.0-SNAPSHOT/brooklyn-logback-includes-0.10.0-SNAPSHOT.jar
[JENKINS] Archiving <https://builds.apache.org/job/brooklyn-server-master/ws/logging/logback-includes/target/brooklyn-logback-includes-0.10.0-SNAPSHOT-sources.jar>
to org.apache.brooklyn/brooklyn-logback-includes/0.10.0-SNAPSHOT/brooklyn-logback-includes-0.10.0-SNAPSHOT-sources.jar
[JENKINS] Archiving <https://builds.apache.org/job/brooklyn-server-master/ws/logging/logback-includes/target/brooklyn-logback-includes-0.10.0-SNAPSHOT-test-sources.jar>
to org.apache.brooklyn/brooklyn-logback-includes/0.10.0-SNAPSHOT/brooklyn-logback-includes-0.10.0-SNAPSHOT-test-sources.jar
[JENKINS] Archiving <https://builds.apache.org/job/brooklyn-server-master/ws/rest/rest-resources/pom.xml>
to org.apache.brooklyn/brooklyn-rest-resources/0.10.0-SNAPSHOT/brooklyn-rest-resources-0.10.0-SNAPSHOT.pom
[JENKINS] Archiving <https://builds.apache.org/job/brooklyn-server-master/ws/utils/jmx/jmxmp-ssl-agent/pom.xml>
to org.apache.brooklyn/brooklyn-jmxmp-agent/0.10.0-SNAPSHOT/brooklyn-jmxmp-agent-0.10.0-SNAPSHOT.pom
[JENKINS] Archiving <https://builds.apache.org/job/brooklyn-server-master/ws/parent/pom.xml>
to org.apache.brooklyn/brooklyn-parent/0.10.0-SNAPSHOT/brooklyn-parent-0.10.0-SNAPSHOT.pom
Compressed 81.96 KB of artifacts by 78.1% relative to #326
[JENKINS] Archiving <https://builds.apache.org/job/brooklyn-server-master/ws/software/winrm/pom.xml>
to org.apache.brooklyn/brooklyn-software-winrm/0.10.0-SNAPSHOT/brooklyn-software-winrm-0.10.0-SNAPSHOT.pom
channel stopped

Mime
View raw message