brooklyn-dev mailing list archives

Site index · List index
Message view « Date » · « Thread »
Top « Date » · « Thread »
From Apache Jenkins Server <jenk...@builds.apache.org>
Subject Build failed in Jenkins: brooklyn-server-master #364
Date Mon, 28 Nov 2016 12:00:39 GMT
See <https://builds.apache.org/job/brooklyn-server-master/364/changes>

Changes:

[svetoslav.neykov] Update LICENSE with changes in project dependencies

------------------------------------------
[...truncated 20791 lines...]
2016-11-28 11:39:25,923 INFO  TESTNG INVOKING CONFIGURATION: "Surefire test" - @AfterMethod
org.apache.brooklyn.core.server.entity.BrooklynMetricsTest.tearDown()
2016-11-28 11:39:25,928 INFO  TESTNG PASSED CONFIGURATION: "Surefire test" - @AfterMethod
org.apache.brooklyn.core.server.entity.BrooklynMetricsTest.tearDown() finished in 5 ms
2016-11-28 11:39:25,929 INFO  TESTNG INVOKING CONFIGURATION: "Surefire test" - @BeforeMethod
org.apache.brooklyn.core.test.BrooklynAppUnitTestSupport.setUp()
2016-11-28 11:39:25,956 INFO  TESTNG PASSED CONFIGURATION: "Surefire test" - @BeforeMethod
org.apache.brooklyn.core.test.BrooklynAppUnitTestSupport.setUp() finished in 27 ms
2016-11-28 11:39:25,956 INFO  TESTNG INVOKING: "Surefire test" - org.apache.brooklyn.core.sensor.DurationSinceSensorTest.testSensorAddedAndUpdated()
2016-11-28 11:39:26,060 INFO  TESTNG PASSED: "Surefire test" - org.apache.brooklyn.core.sensor.DurationSinceSensorTest.testSensorAddedAndUpdated()
finished in 104 ms
2016-11-28 11:39:26,061 INFO  TESTNG INVOKING CONFIGURATION: "Surefire test" - @AfterMethod
org.apache.brooklyn.core.test.BrooklynMgmtUnitTestSupport.tearDown()
2016-11-28 11:39:26,070 INFO  TESTNG PASSED CONFIGURATION: "Surefire test" - @AfterMethod
org.apache.brooklyn.core.test.BrooklynMgmtUnitTestSupport.tearDown() finished in 10 ms
2016-11-28 11:39:26,071 INFO  TESTNG INVOKING CONFIGURATION: "Surefire test" - @BeforeClass
org.apache.brooklyn.core.sensor.http.HttpRequestSensorTest.setUp()
2016-11-28 11:39:26,134 INFO  No Camp-YAML parser registered for parsing catalog item DSL;
skipping DSL-parsing
2016-11-28 11:39:26,151 INFO  TESTNG PASSED CONFIGURATION: "Surefire test" - @BeforeClass
org.apache.brooklyn.core.sensor.http.HttpRequestSensorTest.setUp() finished in 80 ms
2016-11-28 11:39:26,151 INFO  TESTNG INVOKING: "Surefire test" - org.apache.brooklyn.core.sensor.http.HttpRequestSensorTest.testHttpSensor()
[GC 648436K->462004K(749056K), 0.0346120 secs]
2016-11-28 11:39:26,213 INFO  TESTNG PASSED: "Surefire test" - org.apache.brooklyn.core.sensor.http.HttpRequestSensorTest.testHttpSensor()
finished in 62 ms
2016-11-28 11:39:26,213 INFO  TESTNG INVOKING CONFIGURATION: "Surefire test" - @AfterMethod
org.apache.brooklyn.core.sensor.http.HttpRequestSensorTest.tearDown()
2016-11-28 11:39:26,222 INFO  TESTNG PASSED CONFIGURATION: "Surefire test" - @AfterMethod
org.apache.brooklyn.core.sensor.http.HttpRequestSensorTest.tearDown() finished in 9 ms
2016-11-28 11:39:26,222 INFO  TESTNG INVOKING CONFIGURATION: "Surefire test" - @BeforeMethod
org.apache.brooklyn.core.test.BrooklynAppUnitTestSupport.setUp()
2016-11-28 11:39:26,241 INFO  TESTNG PASSED CONFIGURATION: "Surefire test" - @BeforeMethod
org.apache.brooklyn.core.test.BrooklynAppUnitTestSupport.setUp() finished in 19 ms
2016-11-28 11:39:26,242 INFO  TESTNG INVOKING: "Surefire test" - org.apache.brooklyn.core.sensor.StaticSensorTest.testAddsStaticSensorOfTypeInteger()
2016-11-28 11:39:26,272 INFO  TESTNG PASSED: "Surefire test" - org.apache.brooklyn.core.sensor.StaticSensorTest.testAddsStaticSensorOfTypeInteger()
finished in 30 ms
2016-11-28 11:39:26,273 INFO  TESTNG INVOKING CONFIGURATION: "Surefire test" - @AfterMethod
org.apache.brooklyn.core.test.BrooklynMgmtUnitTestSupport.tearDown()
2016-11-28 11:39:26,277 INFO  TESTNG PASSED CONFIGURATION: "Surefire test" - @AfterMethod
org.apache.brooklyn.core.test.BrooklynMgmtUnitTestSupport.tearDown() finished in 4 ms
2016-11-28 11:39:26,278 INFO  TESTNG INVOKING CONFIGURATION: "Surefire test" - @BeforeMethod
org.apache.brooklyn.core.test.BrooklynAppUnitTestSupport.setUp()
2016-11-28 11:39:26,299 INFO  TESTNG PASSED CONFIGURATION: "Surefire test" - @BeforeMethod
org.apache.brooklyn.core.test.BrooklynAppUnitTestSupport.setUp() finished in 21 ms
2016-11-28 11:39:26,299 INFO  TESTNG INVOKING: "Surefire test" - org.apache.brooklyn.core.sensor.StaticSensorTest.testAddsStaticSensorOfTypeString()
2016-11-28 11:39:26,317 INFO  TESTNG PASSED: "Surefire test" - org.apache.brooklyn.core.sensor.StaticSensorTest.testAddsStaticSensorOfTypeString()
finished in 18 ms
2016-11-28 11:39:26,317 INFO  TESTNG INVOKING CONFIGURATION: "Surefire test" - @AfterMethod
org.apache.brooklyn.core.test.BrooklynMgmtUnitTestSupport.tearDown()
2016-11-28 11:39:26,321 INFO  TESTNG PASSED CONFIGURATION: "Surefire test" - @AfterMethod
org.apache.brooklyn.core.test.BrooklynMgmtUnitTestSupport.tearDown() finished in 4 ms
2016-11-28 11:39:26,321 INFO  TESTNG INVOKING CONFIGURATION: "Surefire test" - @BeforeMethod
org.apache.brooklyn.core.test.BrooklynAppUnitTestSupport.setUp()
2016-11-28 11:39:26,339 INFO  TESTNG PASSED CONFIGURATION: "Surefire test" - @BeforeMethod
org.apache.brooklyn.core.test.BrooklynAppUnitTestSupport.setUp() finished in 18 ms
2016-11-28 11:39:26,340 INFO  TESTNG INVOKING CONFIGURATION: "Surefire test" - @BeforeMethod
org.apache.brooklyn.core.sensor.password.CreatePasswordSensorTest.setup()
2016-11-28 11:39:26,381 INFO  No Camp-YAML parser registered for parsing catalog item DSL;
skipping DSL-parsing
2016-11-28 11:39:26,395 INFO  TESTNG PASSED CONFIGURATION: "Surefire test" - @BeforeMethod
org.apache.brooklyn.core.sensor.password.CreatePasswordSensorTest.setup() finished in 56 ms
2016-11-28 11:39:26,395 INFO  TESTNG INVOKING: "Surefire test" - org.apache.brooklyn.core.sensor.password.CreatePasswordSensorTest.testCreatePasswordCreatesAPasswordOfDefaultLength()
2016-11-28 11:39:26,401 INFO  TESTNG PASSED: "Surefire test" - org.apache.brooklyn.core.sensor.password.CreatePasswordSensorTest.testCreatePasswordCreatesAPasswordOfDefaultLength()
finished in 6 ms
2016-11-28 11:39:26,402 INFO  TESTNG INVOKING CONFIGURATION: "Surefire test" - @AfterMethod
org.apache.brooklyn.core.test.BrooklynMgmtUnitTestSupport.tearDown()
2016-11-28 11:39:26,407 INFO  TESTNG PASSED CONFIGURATION: "Surefire test" - @AfterMethod
org.apache.brooklyn.core.test.BrooklynMgmtUnitTestSupport.tearDown() finished in 6 ms
2016-11-28 11:39:26,628 INFO  TESTNG 
===============================================
    Surefire test
    Tests run: 1969, Failures: 1, Skips: 0
===============================================
2016-11-28 11:39:26,629 WARN  Management Context LocalManagementContext[RMhBjMPI-pDOGDNeq]
running, creation stacktrace:
java.lang.Throwable: for construction stacktrace
	at org.apache.brooklyn.core.mgmt.internal.LocalManagementContext.<init>(LocalManagementContext.java:131)
	at org.apache.brooklyn.core.mgmt.internal.LocalManagementContext.<init>(LocalManagementContext.java:164)
	at org.apache.brooklyn.core.mgmt.internal.LocalManagementContext.<init>(LocalManagementContext.java:156)
	at org.apache.brooklyn.core.mgmt.internal.LocalManagementContext.<init>(LocalManagementContext.java:143)
	at org.apache.brooklyn.core.test.entity.LocalManagementContextForTests.<init>(LocalManagementContextForTests.java:43)
	at org.apache.brooklyn.core.test.entity.LocalManagementContextForTests$Builder.build(LocalManagementContextForTests.java:145)
	at org.apache.brooklyn.core.BrooklynVersionTest.testGetFeatures(BrooklynVersionTest.java:97)
	at sun.reflect.NativeMethodAccessorImpl.invoke0(Native Method)
	at sun.reflect.NativeMethodAccessorImpl.invoke(NativeMethodAccessorImpl.java:57)
	at sun.reflect.DelegatingMethodAccessorImpl.invoke(DelegatingMethodAccessorImpl.java:43)
	at java.lang.reflect.Method.invoke(Method.java:606)
	at org.testng.internal.MethodInvocationHelper.invokeMethod(MethodInvocationHelper.java:86)
	at org.testng.internal.Invoker.invokeMethod(Invoker.java:643)
	at org.testng.internal.Invoker.invokeTestMethod(Invoker.java:820)
	at org.testng.internal.Invoker.invokeTestMethods(Invoker.java:1128)
	at org.testng.internal.TestMethodWorker.invokeTestMethods(TestMethodWorker.java:129)
	at org.testng.internal.TestMethodWorker.run(TestMethodWorker.java:112)
	at org.testng.TestRunner.privateRun(TestRunner.java:782)
	at org.testng.TestRunner.run(TestRunner.java:632)
	at org.testng.SuiteRunner.runTest(SuiteRunner.java:366)
	at org.testng.SuiteRunner.runSequentially(SuiteRunner.java:361)
	at org.testng.SuiteRunner.privateRun(SuiteRunner.java:319)
	at org.testng.SuiteRunner.run(SuiteRunner.java:268)
	at org.testng.SuiteRunnerWorker.runSuite(SuiteRunnerWorker.java:52)
	at org.testng.SuiteRunnerWorker.run(SuiteRunnerWorker.java:86)
	at org.testng.TestNG.runSuitesSequentially(TestNG.java:1244)
	at org.testng.TestNG.runSuitesLocally(TestNG.java:1169)
	at org.testng.TestNG.run(TestNG.java:1064)
	at org.apache.maven.surefire.testng.TestNGExecutor.run(TestNGExecutor.java:132)
	at org.apache.maven.surefire.testng.TestNGDirectoryTestSuite.executeMulti(TestNGDirectoryTestSuite.java:193)
	at org.apache.maven.surefire.testng.TestNGDirectoryTestSuite.execute(TestNGDirectoryTestSuite.java:94)
	at org.apache.maven.surefire.testng.TestNGProvider.invoke(TestNGProvider.java:147)
	at org.apache.maven.surefire.booter.ForkedBooter.invokeProviderInSameClassLoader(ForkedBooter.java:290)
	at org.apache.maven.surefire.booter.ForkedBooter.runSuitesInProcess(ForkedBooter.java:242)
	at org.apache.maven.surefire.booter.ForkedBooter.main(ForkedBooter.java:121)

2016-11-28 11:39:26,645 INFO  BrooklynLeakListener.onFinish attempting to terminate all extant
ManagementContexts: name=Surefire test; includedGroups=[]; excludedGroups=[Integration, Live-sanity,
Acceptance, Live, Broken, WIP]; suiteName=Surefire suite; outDir=<https://builds.apache.org/job/brooklyn-server-master/ws/core/target/surefire-reports/Surefire>
suite: 1 ManagementContexts terminated
[GC 649908K->461969K(750592K), 0.0203570 secs]
[GC 651921K->461852K(750080K), 0.0244870 secs]
Tests run: 1969, Failures: 1, Errors: 0, Skipped: 0, Time elapsed: 200.423 sec <<<
FAILURE! - in TestSuite
(org.apache.brooklyn.core.entity.ApplicationLifecycleStateTest)  Time elapsed: 0.151 sec 
<<< FAILURE!
java.lang.AssertionError: entity=Application[92lnbogg]; attribute=Sensor: service.state (org.apache.brooklyn.core.entity.lifecycle.Lifecycle)
expected [running] but found [on-fire]
	at org.apache.brooklyn.core.entity.ApplicationLifecycleStateTest.assertHealthContinually(ApplicationLifecycleStateTest.java:196)
	at org.apache.brooklyn.core.entity.ApplicationLifecycleStateTest.testStartsThenChildFailsButWithQuorumCausesAppToSucceed(ApplicationLifecycleStateTest.java:170)

2016-11-28 11:39:28,249 INFO  Brooklyn shutdown: stopping entities [TestEntityImpl{id=sakr4wiuqp},
TestEntityImpl{id=tugcdahd70}, BlockingEntityImpl{id=xrs1rx55qx}]

Results :

Failed tests: 
org.apache.brooklyn.core.entity.ApplicationLifecycleStateTest.(org.apache.brooklyn.core.entity.ApplicationLifecycleStateTest)
  Run 1: PASS
  Run 2: PASS
  Run 3: PASS
  Run 4: PASS
  Run 5: PASS
  Run 6: PASS
  Run 7: PASS
  Run 8: ApplicationLifecycleStateTest.testStartsThenChildFailsButWithQuorumCausesAppToSucceed:170->assertHealthContinually:196
entity=Application[92lnbogg]; attribute=Sensor: service.state (org.apache.brooklyn.core.entity.lifecycle.Lifecycle)
expected [running] but found [on-fire]
  Run 9: PASS
  Run 10: PASS


Tests run: 1960, Failures: 1, Errors: 0, Skipped: 0

[JENKINS] Recording test results
[INFO] ------------------------------------------------------------------------
[INFO] Reactor Summary:
[INFO] 
[INFO] Brooklyn Server Root ............................... SUCCESS [ 16.719 s]
[INFO] Brooklyn Parent Project ............................ SUCCESS [ 14.992 s]
[INFO] Brooklyn Test Support Utilities .................... SUCCESS [ 15.347 s]
[INFO] Brooklyn Logback Includable Configuration .......... SUCCESS [  5.635 s]
[INFO] Brooklyn Common Utilities .......................... SUCCESS [ 29.311 s]
[INFO] Brooklyn API ....................................... SUCCESS [  9.674 s]
[INFO] CAMP Server Parent Project ......................... SUCCESS [  8.254 s]
[INFO] CAMP Base .......................................... SUCCESS [ 19.325 s]
[INFO] Brooklyn Test Support .............................. SUCCESS [ 10.543 s]
[INFO] Brooklyn REST Swagger Apidoc Utilities ............. SUCCESS [  7.119 s]
[INFO] Brooklyn Logback Configuration ..................... SUCCESS [  4.860 s]
[INFO] CAMP Server ........................................ SUCCESS [ 10.601 s]
[INFO] Brooklyn Felix Runtime ............................. SUCCESS [ 10.145 s]
[INFO] Brooklyn Groovy Utilities .......................... SUCCESS [  5.407 s]
[INFO] Brooklyn Core ...................................... FAILURE [03:58 min]
[INFO] Brooklyn Policies .................................. SKIPPED
[INFO] Brooklyn WinRM Software Entities ................... SKIPPED
[INFO] Brooklyn Secure JMXMP Agent ........................ SKIPPED
[INFO] Brooklyn JMX RMI Agent ............................. SKIPPED
[INFO] Brooklyn Jclouds Location Targets .................. SKIPPED
[INFO] Brooklyn Software Base ............................. SKIPPED
[INFO] Brooklyn CAMP ...................................... SKIPPED
[INFO] Brooklyn Hazelcast Storage ......................... SKIPPED
[INFO] Brooklyn Launcher Common ........................... SKIPPED
[INFO] Brooklyn REST API .................................. SKIPPED
[INFO] Brooklyn REST Resources ............................ SKIPPED
[INFO] Brooklyn REST Server ............................... SKIPPED
[INFO] Brooklyn Launcher .................................. SKIPPED
[INFO] Brooklyn Command Line Interface .................... SKIPPED
[INFO] Brooklyn Test Framework ............................ SKIPPED
[INFO] Brooklyn OSGi init ................................. SKIPPED
[INFO] Brooklyn Karaf ..................................... SKIPPED
[INFO] Jetty config fragment .............................. SKIPPED
[INFO] Apache Http Component extension .................... SKIPPED
[INFO] Brooklyn Karaf Features ............................ SKIPPED
[INFO] Brooklyn Karaf Shell Commands ...................... SKIPPED
[INFO] ------------------------------------------------------------------------
[INFO] BUILD FAILURE
[INFO] ------------------------------------------------------------------------
[INFO] Total time: 08:50 min
[INFO] Finished at: 2016-11-28T11:39:50+00:00
[INFO] Final Memory: 88M/592M
[INFO] ------------------------------------------------------------------------
Waiting for Jenkins to finish collecting data
[ERROR] Failed to execute goal org.apache.maven.plugins:maven-surefire-plugin:2.19.1:test
(default-test) on project brooklyn-core: There are test failures.
[ERROR] 
[ERROR] Please refer to <https://builds.apache.org/job/brooklyn-server-master/ws/core/target/surefire-reports>
for the individual test results.
[ERROR] -> [Help 1]
[ERROR] 
[ERROR] To see the full stack trace of the errors, re-run Maven with the -e switch.
[ERROR] Re-run Maven using the -X switch to enable full debug logging.
[ERROR] 
[ERROR] For more information about the errors and possible solutions, please read the following
articles:
[ERROR] [Help 1] http://cwiki.apache.org/confluence/display/MAVEN/MojoFailureException
[ERROR] 
[ERROR] After correcting the problems, you can resume the build with the command
[ERROR]   mvn <goals> -rf :brooklyn-core
[JENKINS] Archiving <https://builds.apache.org/job/brooklyn-server-master/ws/camp/pom.xml>
to org.apache.brooklyn.camp/camp-parent/0.10.0-SNAPSHOT/camp-parent-0.10.0-SNAPSHOT.pom
[JENKINS] Archiving <https://builds.apache.org/job/brooklyn-server-master/ws/utils/rt-felix/pom.xml>
to org.apache.brooklyn/brooklyn-rt-felix/0.10.0-SNAPSHOT/brooklyn-rt-felix-0.10.0-SNAPSHOT.pom
[JENKINS] Archiving <https://builds.apache.org/job/brooklyn-server-master/ws/utils/rt-felix/target/brooklyn-rt-felix-0.10.0-SNAPSHOT.jar>
to org.apache.brooklyn/brooklyn-rt-felix/0.10.0-SNAPSHOT/brooklyn-rt-felix-0.10.0-SNAPSHOT.jar
[JENKINS] Archiving <https://builds.apache.org/job/brooklyn-server-master/ws/utils/rt-felix/target/brooklyn-rt-felix-0.10.0-SNAPSHOT-tests.jar>
to org.apache.brooklyn/brooklyn-rt-felix/0.10.0-SNAPSHOT/brooklyn-rt-felix-0.10.0-SNAPSHOT-tests.jar
[JENKINS] Archiving <https://builds.apache.org/job/brooklyn-server-master/ws/utils/rt-felix/target/brooklyn-rt-felix-0.10.0-SNAPSHOT-sources.jar>
to org.apache.brooklyn/brooklyn-rt-felix/0.10.0-SNAPSHOT/brooklyn-rt-felix-0.10.0-SNAPSHOT-sources.jar
[JENKINS] Archiving <https://builds.apache.org/job/brooklyn-server-master/ws/utils/rt-felix/target/brooklyn-rt-felix-0.10.0-SNAPSHOT-test-sources.jar>
to org.apache.brooklyn/brooklyn-rt-felix/0.10.0-SNAPSHOT/brooklyn-rt-felix-0.10.0-SNAPSHOT-test-sources.jar
[JENKINS] Archiving <https://builds.apache.org/job/brooklyn-server-master/ws/test-framework/pom.xml>
to org.apache.brooklyn/brooklyn-test-framework/0.10.0-SNAPSHOT/brooklyn-test-framework-0.10.0-SNAPSHOT.pom
[JENKINS] Archiving <https://builds.apache.org/job/brooklyn-server-master/ws/core/pom.xml>
to org.apache.brooklyn/brooklyn-core/0.10.0-SNAPSHOT/brooklyn-core-0.10.0-SNAPSHOT.pom
[JENKINS] Archiving <https://builds.apache.org/job/brooklyn-server-master/ws/camp/camp-server/pom.xml>
to org.apache.brooklyn.camp/camp-server/0.10.0-SNAPSHOT/camp-server-0.10.0-SNAPSHOT.pom
[JENKINS] Archiving <https://builds.apache.org/job/brooklyn-server-master/ws/camp/camp-server/target/camp-server-0.10.0-SNAPSHOT.jar>
to org.apache.brooklyn.camp/camp-server/0.10.0-SNAPSHOT/camp-server-0.10.0-SNAPSHOT.jar
[JENKINS] Archiving <https://builds.apache.org/job/brooklyn-server-master/ws/camp/camp-server/target/camp-server-0.10.0-SNAPSHOT-tests.jar>
to org.apache.brooklyn.camp/camp-server/0.10.0-SNAPSHOT/camp-server-0.10.0-SNAPSHOT-tests.jar
[JENKINS] Archiving <https://builds.apache.org/job/brooklyn-server-master/ws/camp/camp-server/target/camp-server-0.10.0-SNAPSHOT-sources.jar>
to org.apache.brooklyn.camp/camp-server/0.10.0-SNAPSHOT/camp-server-0.10.0-SNAPSHOT-sources.jar
[JENKINS] Archiving <https://builds.apache.org/job/brooklyn-server-master/ws/camp/camp-server/target/camp-server-0.10.0-SNAPSHOT-test-sources.jar>
to org.apache.brooklyn.camp/camp-server/0.10.0-SNAPSHOT/camp-server-0.10.0-SNAPSHOT-test-sources.jar
[JENKINS] Archiving <https://builds.apache.org/job/brooklyn-server-master/ws/launcher/pom.xml>
to org.apache.brooklyn/brooklyn-launcher/0.10.0-SNAPSHOT/brooklyn-launcher-0.10.0-SNAPSHOT.pom
[JENKINS] Archiving <https://builds.apache.org/job/brooklyn-server-master/ws/karaf/pom.xml>
to org.apache.brooklyn/brooklyn-karaf/0.10.0-SNAPSHOT/brooklyn-karaf-0.10.0-SNAPSHOT.pom
[JENKINS] Archiving <https://builds.apache.org/job/brooklyn-server-master/ws/karaf/httpcomponent-extension/pom.xml>
to org.apache.brooklyn/brooklyn-karaf-httpcomponents-extension/0.10.0-SNAPSHOT/brooklyn-karaf-httpcomponents-extension-0.10.0-SNAPSHOT.pom
[JENKINS] Archiving <https://builds.apache.org/job/brooklyn-server-master/ws/utils/test-support/pom.xml>
to org.apache.brooklyn/brooklyn-utils-test-support/0.10.0-SNAPSHOT/brooklyn-utils-test-support-0.10.0-SNAPSHOT.pom
[JENKINS] Archiving <https://builds.apache.org/job/brooklyn-server-master/ws/utils/test-support/target/brooklyn-utils-test-support-0.10.0-SNAPSHOT.jar>
to org.apache.brooklyn/brooklyn-utils-test-support/0.10.0-SNAPSHOT/brooklyn-utils-test-support-0.10.0-SNAPSHOT.jar
[JENKINS] Archiving <https://builds.apache.org/job/brooklyn-server-master/ws/utils/test-support/target/brooklyn-utils-test-support-0.10.0-SNAPSHOT-sources.jar>
to org.apache.brooklyn/brooklyn-utils-test-support/0.10.0-SNAPSHOT/brooklyn-utils-test-support-0.10.0-SNAPSHOT-sources.jar
[JENKINS] Archiving <https://builds.apache.org/job/brooklyn-server-master/ws/utils/test-support/target/brooklyn-utils-test-support-0.10.0-SNAPSHOT-test-sources.jar>
to org.apache.brooklyn/brooklyn-utils-test-support/0.10.0-SNAPSHOT/brooklyn-utils-test-support-0.10.0-SNAPSHOT-test-sources.jar
No artifacts from brooklyn-server-master » Brooklyn Test Support Utilities #365 to compare,
so performing full copy of artifacts
[JENKINS] Archiving <https://builds.apache.org/job/brooklyn-server-master/ws/software/base/pom.xml>
to org.apache.brooklyn/brooklyn-software-base/0.10.0-SNAPSHOT/brooklyn-software-base-0.10.0-SNAPSHOT.pom
[JENKINS] Archiving <https://builds.apache.org/job/brooklyn-server-master/ws/utils/groovy/pom.xml>
to org.apache.brooklyn/brooklyn-utils-groovy/0.10.0-SNAPSHOT/brooklyn-utils-groovy-0.10.0-SNAPSHOT.pom
[JENKINS] Archiving <https://builds.apache.org/job/brooklyn-server-master/ws/utils/groovy/target/brooklyn-utils-groovy-0.10.0-SNAPSHOT.jar>
to org.apache.brooklyn/brooklyn-utils-groovy/0.10.0-SNAPSHOT/brooklyn-utils-groovy-0.10.0-SNAPSHOT.jar
[JENKINS] Archiving <https://builds.apache.org/job/brooklyn-server-master/ws/utils/groovy/target/brooklyn-utils-groovy-0.10.0-SNAPSHOT-tests.jar>
to org.apache.brooklyn/brooklyn-utils-groovy/0.10.0-SNAPSHOT/brooklyn-utils-groovy-0.10.0-SNAPSHOT-tests.jar
[JENKINS] Archiving <https://builds.apache.org/job/brooklyn-server-master/ws/utils/groovy/target/brooklyn-utils-groovy-0.10.0-SNAPSHOT-sources.jar>
to org.apache.brooklyn/brooklyn-utils-groovy/0.10.0-SNAPSHOT/brooklyn-utils-groovy-0.10.0-SNAPSHOT-sources.jar
[JENKINS] Archiving <https://builds.apache.org/job/brooklyn-server-master/ws/utils/groovy/target/brooklyn-utils-groovy-0.10.0-SNAPSHOT-test-sources.jar>
to org.apache.brooklyn/brooklyn-utils-groovy/0.10.0-SNAPSHOT/brooklyn-utils-groovy-0.10.0-SNAPSHOT-test-sources.jar
[JENKINS] Archiving <https://builds.apache.org/job/brooklyn-server-master/ws/utils/rest-swagger/pom.xml>
to org.apache.brooklyn/brooklyn-utils-rest-swagger/0.10.0-SNAPSHOT/brooklyn-utils-rest-swagger-0.10.0-SNAPSHOT.pom
[JENKINS] Archiving <https://builds.apache.org/job/brooklyn-server-master/ws/utils/rest-swagger/target/brooklyn-utils-rest-swagger-0.10.0-SNAPSHOT.jar>
to org.apache.brooklyn/brooklyn-utils-rest-swagger/0.10.0-SNAPSHOT/brooklyn-utils-rest-swagger-0.10.0-SNAPSHOT.jar
[JENKINS] Archiving <https://builds.apache.org/job/brooklyn-server-master/ws/utils/rest-swagger/target/brooklyn-utils-rest-swagger-0.10.0-SNAPSHOT-sources.jar>
to org.apache.brooklyn/brooklyn-utils-rest-swagger/0.10.0-SNAPSHOT/brooklyn-utils-rest-swagger-0.10.0-SNAPSHOT-sources.jar
[JENKINS] Archiving <https://builds.apache.org/job/brooklyn-server-master/ws/utils/rest-swagger/target/brooklyn-utils-rest-swagger-0.10.0-SNAPSHOT-test-sources.jar>
to org.apache.brooklyn/brooklyn-utils-rest-swagger/0.10.0-SNAPSHOT/brooklyn-utils-rest-swagger-0.10.0-SNAPSHOT-test-sources.jar
[JENKINS] Archiving <https://builds.apache.org/job/brooklyn-server-master/ws/launcher-common/pom.xml>
to org.apache.brooklyn/brooklyn-launcher-common/0.10.0-SNAPSHOT/brooklyn-launcher-common-0.10.0-SNAPSHOT.pom
[JENKINS] Archiving <https://builds.apache.org/job/brooklyn-server-master/ws/camp/camp-base/pom.xml>
to org.apache.brooklyn.camp/camp-base/0.10.0-SNAPSHOT/camp-base-0.10.0-SNAPSHOT.pom
[JENKINS] Archiving <https://builds.apache.org/job/brooklyn-server-master/ws/camp/camp-base/target/camp-base-0.10.0-SNAPSHOT.jar>
to org.apache.brooklyn.camp/camp-base/0.10.0-SNAPSHOT/camp-base-0.10.0-SNAPSHOT.jar
[JENKINS] Archiving <https://builds.apache.org/job/brooklyn-server-master/ws/camp/camp-base/target/camp-base-0.10.0-SNAPSHOT-tests.jar>
to org.apache.brooklyn.camp/camp-base/0.10.0-SNAPSHOT/camp-base-0.10.0-SNAPSHOT-tests.jar
[JENKINS] Archiving <https://builds.apache.org/job/brooklyn-server-master/ws/camp/camp-base/target/camp-base-0.10.0-SNAPSHOT-sources.jar>
to org.apache.brooklyn.camp/camp-base/0.10.0-SNAPSHOT/camp-base-0.10.0-SNAPSHOT-sources.jar
[JENKINS] Archiving <https://builds.apache.org/job/brooklyn-server-master/ws/camp/camp-base/target/camp-base-0.10.0-SNAPSHOT-test-sources.jar>
to org.apache.brooklyn.camp/camp-base/0.10.0-SNAPSHOT/camp-base-0.10.0-SNAPSHOT-test-sources.jar
[JENKINS] Archiving <https://builds.apache.org/job/brooklyn-server-master/ws/camp/camp-brooklyn/pom.xml>
to org.apache.brooklyn/brooklyn-camp/0.10.0-SNAPSHOT/brooklyn-camp-0.10.0-SNAPSHOT.pom
[JENKINS] Archiving <https://builds.apache.org/job/brooklyn-server-master/ws/karaf/jetty-config/pom.xml>
to org.apache.brooklyn/brooklyn-karaf-jetty-config/0.10.0-SNAPSHOT/brooklyn-karaf-jetty-config-0.10.0-SNAPSHOT.pom
[JENKINS] Archiving <https://builds.apache.org/job/brooklyn-server-master/ws/server-cli/pom.xml>
to org.apache.brooklyn/brooklyn-cli/0.10.0-SNAPSHOT/brooklyn-cli-0.10.0-SNAPSHOT.pom
[JENKINS] Archiving <https://builds.apache.org/job/brooklyn-server-master/ws/logging/logback-xml/pom.xml>
to org.apache.brooklyn/brooklyn-logback-xml/0.10.0-SNAPSHOT/brooklyn-logback-xml-0.10.0-SNAPSHOT.pom
[JENKINS] Archiving <https://builds.apache.org/job/brooklyn-server-master/ws/logging/logback-xml/target/brooklyn-logback-xml-0.10.0-SNAPSHOT.jar>
to org.apache.brooklyn/brooklyn-logback-xml/0.10.0-SNAPSHOT/brooklyn-logback-xml-0.10.0-SNAPSHOT.jar
[JENKINS] Archiving <https://builds.apache.org/job/brooklyn-server-master/ws/logging/logback-xml/target/brooklyn-logback-xml-0.10.0-SNAPSHOT-sources.jar>
to org.apache.brooklyn/brooklyn-logback-xml/0.10.0-SNAPSHOT/brooklyn-logback-xml-0.10.0-SNAPSHOT-sources.jar
[JENKINS] Archiving <https://builds.apache.org/job/brooklyn-server-master/ws/logging/logback-xml/target/brooklyn-logback-xml-0.10.0-SNAPSHOT-test-sources.jar>
to org.apache.brooklyn/brooklyn-logback-xml/0.10.0-SNAPSHOT/brooklyn-logback-xml-0.10.0-SNAPSHOT-test-sources.jar
[JENKINS] Archiving <https://builds.apache.org/job/brooklyn-server-master/ws/test-support/pom.xml>
to org.apache.brooklyn/brooklyn-test-support/0.10.0-SNAPSHOT/brooklyn-test-support-0.10.0-SNAPSHOT.pom
[JENKINS] Archiving <https://builds.apache.org/job/brooklyn-server-master/ws/test-support/target/brooklyn-test-support-0.10.0-SNAPSHOT.jar>
to org.apache.brooklyn/brooklyn-test-support/0.10.0-SNAPSHOT/brooklyn-test-support-0.10.0-SNAPSHOT.jar
[JENKINS] Archiving <https://builds.apache.org/job/brooklyn-server-master/ws/test-support/target/brooklyn-test-support-0.10.0-SNAPSHOT-sources.jar>
to org.apache.brooklyn/brooklyn-test-support/0.10.0-SNAPSHOT/brooklyn-test-support-0.10.0-SNAPSHOT-sources.jar
[JENKINS] Archiving <https://builds.apache.org/job/brooklyn-server-master/ws/test-support/target/brooklyn-test-support-0.10.0-SNAPSHOT-test-sources.jar>
to org.apache.brooklyn/brooklyn-test-support/0.10.0-SNAPSHOT/brooklyn-test-support-0.10.0-SNAPSHOT-test-sources.jar
[JENKINS] Archiving <https://builds.apache.org/job/brooklyn-server-master/ws/rest/rest-server/pom.xml>
to org.apache.brooklyn/brooklyn-rest-server/0.10.0-SNAPSHOT/brooklyn-rest-server-0.10.0-SNAPSHOT.pom
[JENKINS] Archiving <https://builds.apache.org/job/brooklyn-server-master/ws/api/pom.xml>
to org.apache.brooklyn/brooklyn-api/0.10.0-SNAPSHOT/brooklyn-api-0.10.0-SNAPSHOT.pom
[JENKINS] Archiving <https://builds.apache.org/job/brooklyn-server-master/ws/api/target/brooklyn-api-0.10.0-SNAPSHOT.jar>
to org.apache.brooklyn/brooklyn-api/0.10.0-SNAPSHOT/brooklyn-api-0.10.0-SNAPSHOT.jar
[JENKINS] Archiving <https://builds.apache.org/job/brooklyn-server-master/ws/api/target/brooklyn-api-0.10.0-SNAPSHOT-sources.jar>
to org.apache.brooklyn/brooklyn-api/0.10.0-SNAPSHOT/brooklyn-api-0.10.0-SNAPSHOT-sources.jar
[JENKINS] Archiving <https://builds.apache.org/job/brooklyn-server-master/ws/api/target/brooklyn-api-0.10.0-SNAPSHOT-test-sources.jar>
to org.apache.brooklyn/brooklyn-api/0.10.0-SNAPSHOT/brooklyn-api-0.10.0-SNAPSHOT-test-sources.jar
[JENKINS] Archiving <https://builds.apache.org/job/brooklyn-server-master/ws/pom.xml>
to org.apache.brooklyn/brooklyn-server/0.10.0-SNAPSHOT/brooklyn-server-0.10.0-SNAPSHOT.pom
No artifacts from brooklyn-server-master » Brooklyn Server Root #365 to compare, so performing
full copy of artifacts
[JENKINS] Archiving <https://builds.apache.org/job/brooklyn-server-master/ws/locations/jclouds/pom.xml>
to org.apache.brooklyn/brooklyn-locations-jclouds/0.10.0-SNAPSHOT/brooklyn-locations-jclouds-0.10.0-SNAPSHOT.pom
[JENKINS] Archiving <https://builds.apache.org/job/brooklyn-server-master/ws/utils/common/pom.xml>
to org.apache.brooklyn/brooklyn-utils-common/0.10.0-SNAPSHOT/brooklyn-utils-common-0.10.0-SNAPSHOT.pom
[JENKINS] Archiving <https://builds.apache.org/job/brooklyn-server-master/ws/utils/common/target/brooklyn-utils-common-0.10.0-SNAPSHOT.jar>
to org.apache.brooklyn/brooklyn-utils-common/0.10.0-SNAPSHOT/brooklyn-utils-common-0.10.0-SNAPSHOT.jar
[JENKINS] Archiving <https://builds.apache.org/job/brooklyn-server-master/ws/utils/common/target/brooklyn-utils-common-0.10.0-SNAPSHOT-tests.jar>
to org.apache.brooklyn/brooklyn-utils-common/0.10.0-SNAPSHOT/brooklyn-utils-common-0.10.0-SNAPSHOT-tests.jar
[JENKINS] Archiving <https://builds.apache.org/job/brooklyn-server-master/ws/utils/common/target/brooklyn-utils-common-0.10.0-SNAPSHOT-sources.jar>
to org.apache.brooklyn/brooklyn-utils-common/0.10.0-SNAPSHOT/brooklyn-utils-common-0.10.0-SNAPSHOT-sources.jar
[JENKINS] Archiving <https://builds.apache.org/job/brooklyn-server-master/ws/utils/common/target/brooklyn-utils-common-0.10.0-SNAPSHOT-test-sources.jar>
to org.apache.brooklyn/brooklyn-utils-common/0.10.0-SNAPSHOT/brooklyn-utils-common-0.10.0-SNAPSHOT-test-sources.jar
[JENKINS] Archiving <https://builds.apache.org/job/brooklyn-server-master/ws/karaf/features/pom.xml>
to org.apache.brooklyn/brooklyn-features/0.10.0-SNAPSHOT/brooklyn-features-0.10.0-SNAPSHOT.pom
[JENKINS] Archiving <https://builds.apache.org/job/brooklyn-server-master/ws/rest/rest-api/pom.xml>
to org.apache.brooklyn/brooklyn-rest-api/0.10.0-SNAPSHOT/brooklyn-rest-api-0.10.0-SNAPSHOT.pom
[JENKINS] Archiving <https://builds.apache.org/job/brooklyn-server-master/ws/utils/jmx/jmxrmi-agent/pom.xml>
to org.apache.brooklyn/brooklyn-jmxrmi-agent/0.10.0-SNAPSHOT/brooklyn-jmxrmi-agent-0.10.0-SNAPSHOT.pom
[JENKINS] Archiving <https://builds.apache.org/job/brooklyn-server-master/ws/policy/pom.xml>
to org.apache.brooklyn/brooklyn-policy/0.10.0-SNAPSHOT/brooklyn-policy-0.10.0-SNAPSHOT.pom
[JENKINS] Archiving <https://builds.apache.org/job/brooklyn-server-master/ws/karaf/init/pom.xml>
to org.apache.brooklyn/brooklyn-karaf-init/0.10.0-SNAPSHOT/brooklyn-karaf-init-0.10.0-SNAPSHOT.pom
[JENKINS] Archiving <https://builds.apache.org/job/brooklyn-server-master/ws/karaf/commands/pom.xml>
to org.apache.brooklyn/brooklyn-commands/0.10.0-SNAPSHOT/brooklyn-commands-0.10.0-SNAPSHOT.pom
[JENKINS] Archiving <https://builds.apache.org/job/brooklyn-server-master/ws/storage/hazelcast/pom.xml>
to org.apache.brooklyn/brooklyn-storage-hazelcast/0.10.0-SNAPSHOT/brooklyn-storage-hazelcast-0.10.0-SNAPSHOT.pom
[JENKINS] Archiving <https://builds.apache.org/job/brooklyn-server-master/ws/logging/logback-includes/pom.xml>
to org.apache.brooklyn/brooklyn-logback-includes/0.10.0-SNAPSHOT/brooklyn-logback-includes-0.10.0-SNAPSHOT.pom
[JENKINS] Archiving <https://builds.apache.org/job/brooklyn-server-master/ws/logging/logback-includes/target/brooklyn-logback-includes-0.10.0-SNAPSHOT.jar>
to org.apache.brooklyn/brooklyn-logback-includes/0.10.0-SNAPSHOT/brooklyn-logback-includes-0.10.0-SNAPSHOT.jar
[JENKINS] Archiving <https://builds.apache.org/job/brooklyn-server-master/ws/logging/logback-includes/target/brooklyn-logback-includes-0.10.0-SNAPSHOT-sources.jar>
to org.apache.brooklyn/brooklyn-logback-includes/0.10.0-SNAPSHOT/brooklyn-logback-includes-0.10.0-SNAPSHOT-sources.jar
[JENKINS] Archiving <https://builds.apache.org/job/brooklyn-server-master/ws/logging/logback-includes/target/brooklyn-logback-includes-0.10.0-SNAPSHOT-test-sources.jar>
to org.apache.brooklyn/brooklyn-logback-includes/0.10.0-SNAPSHOT/brooklyn-logback-includes-0.10.0-SNAPSHOT-test-sources.jar
No artifacts from brooklyn-server-master » Brooklyn Logback Includable Configuration #365
to compare, so performing full copy of artifacts
[JENKINS] Archiving <https://builds.apache.org/job/brooklyn-server-master/ws/rest/rest-resources/pom.xml>
to org.apache.brooklyn/brooklyn-rest-resources/0.10.0-SNAPSHOT/brooklyn-rest-resources-0.10.0-SNAPSHOT.pom
[JENKINS] Archiving <https://builds.apache.org/job/brooklyn-server-master/ws/utils/jmx/jmxmp-ssl-agent/pom.xml>
to org.apache.brooklyn/brooklyn-jmxmp-agent/0.10.0-SNAPSHOT/brooklyn-jmxmp-agent-0.10.0-SNAPSHOT.pom
[JENKINS] Archiving <https://builds.apache.org/job/brooklyn-server-master/ws/parent/pom.xml>
to org.apache.brooklyn/brooklyn-parent/0.10.0-SNAPSHOT/brooklyn-parent-0.10.0-SNAPSHOT.pom
No artifacts from brooklyn-server-master » Brooklyn Parent Project #365 to compare, so performing
full copy of artifacts
[JENKINS] Archiving <https://builds.apache.org/job/brooklyn-server-master/ws/software/winrm/pom.xml>
to org.apache.brooklyn/brooklyn-software-winrm/0.10.0-SNAPSHOT/brooklyn-software-winrm-0.10.0-SNAPSHOT.pom
channel stopped

Mime
View raw message