brooklyn-dev mailing list archives

Site index · List index
Message view « Date » · « Thread »
Top « Date » · « Thread »
From Apache Jenkins Server <jenk...@builds.apache.org>
Subject Build failed in Jenkins: brooklyn-library-master #69
Date Wed, 16 Nov 2016 04:11:09 GMT
See <https://builds.apache.org/job/brooklyn-library-master/69/>

------------------------------------------
[...truncated 2119 lines...]
2016-11-16 04:07:20,922 INFO  GeoDns removing reference to TestEntityImpl{id=o3v7hcesrl}
2016-11-16 04:07:20,922 INFO  GeoDns removing reference to TestEntityImpl{id=g95koqqzms}
2016-11-16 04:07:20,964 ERROR Problem refreshing group membership: java.util.concurrent.CancellationException
java.util.concurrent.CancellationException: null
	at java.util.concurrent.FutureTask.report(FutureTask.java:121) [na:1.7.0_80]
2016-11-16 04:07:20,967 INFO  TESTNG PASSED CONFIGURATION: "Surefire test" - @AfterMethod
org.apache.brooklyn.core.test.BrooklynMgmtUnitTestSupport.tearDown() finished in 76 ms
2016-11-16 04:07:20,968 INFO  TESTNG INVOKING CONFIGURATION: "Surefire test" - @BeforeMethod
org.apache.brooklyn.entity.dns.AbstractGeoDnsServiceTest.setUp()
2016-11-16 04:07:20,970 WARN  Error calculating and setting aggregate for enricher Aggregator{uniqueTag=aggregator:fabric.size,
running=true, entity=DynamicRegionsFabricImpl{id=yh6ts2aigs}, id=ylqfu0zmz7}
java.lang.IllegalStateException: Entity DynamicRegionsFabricImpl{id=yh6ts2aigs} is no longer
managed, when trying to publish Sensor: fabric.size (java.lang.Integer) 0
	at org.apache.brooklyn.core.entity.AbstractEntity$BasicSensorSupport.emitInternal(AbstractEntity.java:1195)
~[brooklyn-core-0.10.0-SNAPSHOT.jar:0.10.0-SNAPSHOT]
2016-11-16 04:07:20,969 ERROR Problem refreshing group membership: java.lang.IllegalStateException:
Entity DynamicGroupImpl{id=hqbh09uqto} is no longer managed; execution context not available
java.lang.IllegalStateException: Entity DynamicGroupImpl{id=hqbh09uqto} is no longer managed;
execution context not available
	at org.apache.brooklyn.core.mgmt.internal.NonDeploymentManagementContext.getExecutionContext(NonDeploymentManagementContext.java:264)
~[brooklyn-core-0.10.0-SNAPSHOT.jar:0.10.0-SNAPSHOT]
2016-11-16 04:07:21,003 WARN  Deprecated use of unmanaged location (SshMachineLocation[West
child:null@100.0.0.1/100.0.0.1:22(id=qf7a7193xb)]); will be managed automatically now but
not supported in future versions
2016-11-16 04:07:21,006 WARN  Deprecated use of unmanaged location (SshMachineLocation[West
child with location:null@100.0.0.1/100.0.0.1:22(id=drcmdtoox1)]); will be managed automatically
now but not supported in future versions
2016-11-16 04:07:21,011 WARN  Deprecated use of unmanaged location (SshMachineLocation[East
child:null@100.0.0.2/100.0.0.2:22(id=vrqor0y63b)]); will be managed automatically now but
not supported in future versions
2016-11-16 04:07:21,014 WARN  Deprecated use of unmanaged location (SshMachineLocation[East
child with location:null@100.0.0.2/100.0.0.2:22(id=eqvfqu25sc)]); will be managed automatically
now but not supported in future versions
2016-11-16 04:07:21,018 WARN  Deprecated use of unmanaged location (SshMachineLocation[North
child:null@10.0.0.1/10.0.0.1:22(id=l51marz45f)]); will be managed automatically now but not
supported in future versions
2016-11-16 04:07:21,028 INFO  No Camp-YAML parser registered for parsing catalog item DSL;
skipping DSL-parsing
2016-11-16 04:07:21,116 INFO  TESTNG PASSED CONFIGURATION: "Surefire test" - @BeforeMethod
org.apache.brooklyn.entity.dns.AbstractGeoDnsServiceTest.setUp() finished in 147 ms
2016-11-16 04:07:21,116 INFO  TESTNG INVOKING: "Surefire test" - org.apache.brooklyn.entity.dns.AbstractGeoDnsServiceTest.testFiltersEntirelyPrivate()
2016-11-16 04:07:21,129 INFO  Creating entity in fabric DynamicRegionsFabricImpl{id=dzk29kljbi}
at SshMachineLocation[West child:null@100.0.0.1/100.0.0.1:22(id=qf7a7193xb)]
2016-11-16 04:07:21,168 INFO  Creating entity in fabric DynamicRegionsFabricImpl{id=dzk29kljbi}
at SshMachineLocation[East child with location:null@100.0.0.2/100.0.0.2:22(id=eqvfqu25sc)]
2016-11-16 04:07:21,213 INFO  Creating entity in fabric DynamicRegionsFabricImpl{id=dzk29kljbi}
at SshMachineLocation[North child:null@10.0.0.1/10.0.0.1:22(id=l51marz45f)]
2016-11-16 04:07:21,283 INFO  GeoDns adding TestEntityImpl{id=na1uqip18u} at HostGeoInfo[West
child: 100.0.0.1 at (0.0,-60.0)]
2016-11-16 04:07:21,285 INFO  GeoDns adding TestEntityImpl{id=quojfe07n8} at HostGeoInfo[East
child with location: 100.0.0.2 at (0.0,60.0)]
2016-11-16 04:07:21,286 WARN  GeoDns ignoring TestEntityImpl{id=t1h1kpt9ii} (private subnet
detected for localhost)
2016-11-16 04:07:21,289 INFO  TESTNG PASSED: "Surefire test" - org.apache.brooklyn.entity.dns.AbstractGeoDnsServiceTest.testFiltersEntirelyPrivate()
finished in 173 ms
2016-11-16 04:07:21,290 INFO  TESTNG INVOKING CONFIGURATION: "Surefire test" - @AfterMethod
org.apache.brooklyn.core.test.BrooklynMgmtUnitTestSupport.tearDown()
2016-11-16 04:07:21,325 INFO  GeoDns removing reference to TestEntityImpl{id=na1uqip18u}
2016-11-16 04:07:21,325 INFO  GeoDns removing reference to TestEntityImpl{id=quojfe07n8}
2016-11-16 04:07:21,359 INFO  TESTNG PASSED CONFIGURATION: "Surefire test" - @AfterMethod
org.apache.brooklyn.core.test.BrooklynMgmtUnitTestSupport.tearDown() finished in 69 ms
2016-11-16 04:07:21,361 INFO  TESTNG INVOKING CONFIGURATION: "Surefire test" - @BeforeMethod
org.apache.brooklyn.entity.dns.AbstractGeoDnsServiceTest.setUp()
2016-11-16 04:07:21,366 ERROR Problem refreshing group membership: java.lang.IllegalStateException:
Entity DynamicGroupImpl{id=d9wx2i3am2} is no longer managed; execution context not available
java.lang.IllegalStateException: Entity DynamicGroupImpl{id=d9wx2i3am2} is no longer managed;
execution context not available
	at org.apache.brooklyn.core.mgmt.internal.NonDeploymentManagementContext.getExecutionContext(NonDeploymentManagementContext.java:264)
~[brooklyn-core-0.10.0-SNAPSHOT.jar:0.10.0-SNAPSHOT]
2016-11-16 04:07:21,392 WARN  Deprecated use of unmanaged location (SshMachineLocation[West
child:null@100.0.0.1/100.0.0.1:22(id=jl21scdw4c)]); will be managed automatically now but
not supported in future versions
2016-11-16 04:07:21,396 WARN  Deprecated use of unmanaged location (SshMachineLocation[West
child with location:null@100.0.0.1/100.0.0.1:22(id=p99z31lws8)]); will be managed automatically
now but not supported in future versions
2016-11-16 04:07:21,399 WARN  Deprecated use of unmanaged location (SshMachineLocation[East
child:null@100.0.0.2/100.0.0.2:22(id=k31ncbkwc4)]); will be managed automatically now but
not supported in future versions
2016-11-16 04:07:21,402 WARN  Deprecated use of unmanaged location (SshMachineLocation[East
child with location:null@100.0.0.2/100.0.0.2:22(id=lqns0g802e)]); will be managed automatically
now but not supported in future versions
2016-11-16 04:07:21,406 WARN  Deprecated use of unmanaged location (SshMachineLocation[North
child:null@10.0.0.1/10.0.0.1:22(id=i5si8vvuqd)]); will be managed automatically now but not
supported in future versions
2016-11-16 04:07:21,416 INFO  No Camp-YAML parser registered for parsing catalog item DSL;
skipping DSL-parsing
2016-11-16 04:07:21,489 INFO  TESTNG PASSED CONFIGURATION: "Surefire test" - @BeforeMethod
org.apache.brooklyn.entity.dns.AbstractGeoDnsServiceTest.setUp() finished in 129 ms
2016-11-16 04:07:21,489 INFO  TESTNG INVOKING: "Surefire test" - org.apache.brooklyn.entity.dns.AbstractGeoDnsServiceTest.testGeoInfoOnLocation()
2016-11-16 04:07:21,499 INFO  Creating entity in fabric DynamicRegionsFabricImpl{id=angwzkrj25}
at SshMachineLocation[West child with location:null@100.0.0.1/100.0.0.1:22(id=p99z31lws8)]
2016-11-16 04:07:21,536 INFO  Creating entity in fabric DynamicRegionsFabricImpl{id=angwzkrj25}
at SshMachineLocation[East child with location:null@100.0.0.2/100.0.0.2:22(id=lqns0g802e)]
2016-11-16 04:07:21,551 INFO  GeoDns TestService adding target host TestEntityImpl{id=ov5prj52in}
HostGeoInfo[West child with location: <address-ignored> at (0.0,-60.0)]
2016-11-16 04:07:21,558 INFO  GeoDns TestService adding target host TestEntityImpl{id=ov5prj52in}
HostGeoInfo[West child with location: <address-ignored> at (0.0,-60.0)]
2016-11-16 04:07:21,561 INFO  GeoDns TestService adding target host TestEntityImpl{id=ov5prj52in}
HostGeoInfo[West child with location: <address-ignored> at (0.0,-60.0)]
2016-11-16 04:07:21,566 INFO  GeoDns TestService adding target host TestEntityImpl{id=ov5prj52in}
HostGeoInfo[West child with location: <address-ignored> at (0.0,-60.0)]
2016-11-16 04:07:21,581 INFO  GeoDns TestService adding target host TestEntityImpl{id=ov5prj52in}
HostGeoInfo[West child with location: <address-ignored> at (0.0,-60.0)]
2016-11-16 04:07:21,582 INFO  GeoDns TestService adding target host TestEntityImpl{id=h99rzgjiyp}
HostGeoInfo[East child with location: <address-ignored> at (0.0,60.0)]
2016-11-16 04:07:21,585 INFO  GeoDns TestService adding target host TestEntityImpl{id=ov5prj52in}
HostGeoInfo[West child with location: <address-ignored> at (0.0,-60.0)]
2016-11-16 04:07:21,586 INFO  GeoDns TestService adding target host TestEntityImpl{id=h99rzgjiyp}
HostGeoInfo[East child with location: <address-ignored> at (0.0,60.0)]
2016-11-16 04:07:21,589 INFO  GeoDns TestService adding target host TestEntityImpl{id=ov5prj52in}
HostGeoInfo[West child with location: <address-ignored> at (0.0,-60.0)]
2016-11-16 04:07:21,589 INFO  GeoDns TestService adding target host TestEntityImpl{id=h99rzgjiyp}
HostGeoInfo[East child with location: <address-ignored> at (0.0,60.0)]
2016-11-16 04:07:21,599 INFO  TESTNG PASSED: "Surefire test" - org.apache.brooklyn.entity.dns.AbstractGeoDnsServiceTest.testGeoInfoOnLocation()
finished in 110 ms
2016-11-16 04:07:21,600 INFO  TESTNG INVOKING CONFIGURATION: "Surefire test" - @AfterMethod
org.apache.brooklyn.core.test.BrooklynMgmtUnitTestSupport.tearDown()
2016-11-16 04:07:21,601 INFO  GeoDns TestService adding target host TestEntityImpl{id=ov5prj52in}
HostGeoInfo[West child with location: <address-ignored> at (0.0,-60.0)]
2016-11-16 04:07:21,601 INFO  GeoDns TestService adding target host TestEntityImpl{id=h99rzgjiyp}
HostGeoInfo[East child with location: <address-ignored> at (0.0,60.0)]
2016-11-16 04:07:21,604 INFO  GeoDns TestService adding target host TestEntityImpl{id=ov5prj52in}
HostGeoInfo[West child with location: <address-ignored> at (0.0,-60.0)]
2016-11-16 04:07:21,605 INFO  GeoDns TestService adding target host TestEntityImpl{id=h99rzgjiyp}
HostGeoInfo[East child with location: <address-ignored> at (0.0,60.0)]
2016-11-16 04:07:21,608 INFO  GeoDns TestService adding target host TestEntityImpl{id=ov5prj52in}
HostGeoInfo[West child with location: <address-ignored> at (0.0,-60.0)]
2016-11-16 04:07:21,608 INFO  GeoDns TestService adding target host TestEntityImpl{id=h99rzgjiyp}
HostGeoInfo[East child with location: <address-ignored> at (0.0,60.0)]
2016-11-16 04:07:21,611 INFO  GeoDns TestService adding target host TestEntityImpl{id=ov5prj52in}
HostGeoInfo[West child with location: <address-ignored> at (0.0,-60.0)]
2016-11-16 04:07:21,611 INFO  GeoDns TestService adding target host TestEntityImpl{id=h99rzgjiyp}
HostGeoInfo[East child with location: <address-ignored> at (0.0,60.0)]
2016-11-16 04:07:21,619 INFO  GeoDns removing reference to TestEntityImpl{id=ov5prj52in}
2016-11-16 04:07:21,619 INFO  GeoDns removing reference to TestEntityImpl{id=h99rzgjiyp}
2016-11-16 04:07:21,647 ERROR Problem refreshing group membership: java.util.concurrent.CancellationException
java.util.concurrent.CancellationException: null
	at java.util.concurrent.FutureTask.report(FutureTask.java:121) [na:1.7.0_80]
2016-11-16 04:07:21,651 ERROR Problem refreshing group membership: java.lang.IllegalStateException:
Non-deployment context NonDeploymentManagementContext{entity=syfw4drvou, mode=MANAGEMENT_STOPPING}
is not valid for this operation.
java.lang.IllegalStateException: Non-deployment context NonDeploymentManagementContext{entity=syfw4drvou,
mode=MANAGEMENT_STOPPING} is not valid for this operation.
	at org.apache.brooklyn.core.mgmt.internal.NonDeploymentManagementContext.checkInitialManagementContextReal(NonDeploymentManagementContext.java:440)
~[brooklyn-core-0.10.0-SNAPSHOT.jar:0.10.0-SNAPSHOT]
2016-11-16 04:07:21,651 WARN  Error calculating and setting aggregate for enricher Aggregator{uniqueTag=aggregator:fabric.size,
running=true, entity=DynamicRegionsFabricImpl{id=angwzkrj25}, id=xp8koyh7ms}
java.lang.IllegalStateException: Entity DynamicRegionsFabricImpl{id=angwzkrj25} is no longer
managed, when trying to publish Sensor: fabric.size (java.lang.Integer) 0
	at org.apache.brooklyn.core.entity.AbstractEntity$BasicSensorSupport.emitInternal(AbstractEntity.java:1195)
~[brooklyn-core-0.10.0-SNAPSHOT.jar:0.10.0-SNAPSHOT]
2016-11-16 04:07:21,654 INFO  TESTNG PASSED CONFIGURATION: "Surefire test" - @AfterMethod
org.apache.brooklyn.core.test.BrooklynMgmtUnitTestSupport.tearDown() finished in 54 ms
2016-11-16 04:07:21,655 INFO  TESTNG INVOKING CONFIGURATION: "Surefire test" - @BeforeMethod
org.apache.brooklyn.entity.dns.AbstractGeoDnsServiceTest.setUp()
2016-11-16 04:07:21,683 WARN  Deprecated use of unmanaged location (SshMachineLocation[West
child:null@100.0.0.1/100.0.0.1:22(id=xzcy4x36yq)]); will be managed automatically now but
not supported in future versions
2016-11-16 04:07:21,686 WARN  Deprecated use of unmanaged location (SshMachineLocation[West
child with location:null@100.0.0.1/100.0.0.1:22(id=b7gqg5y17z)]); will be managed automatically
now but not supported in future versions
2016-11-16 04:07:21,689 WARN  Deprecated use of unmanaged location (SshMachineLocation[East
child:null@100.0.0.2/100.0.0.2:22(id=rjavp3h1xf)]); will be managed automatically now but
not supported in future versions
2016-11-16 04:07:21,692 WARN  Deprecated use of unmanaged location (SshMachineLocation[East
child with location:null@100.0.0.2/100.0.0.2:22(id=u9v9n1kn7r)]); will be managed automatically
now but not supported in future versions
2016-11-16 04:07:21,695 WARN  Deprecated use of unmanaged location (SshMachineLocation[North
child:null@10.0.0.1/10.0.0.1:22(id=gabz3646oz)]); will be managed automatically now but not
supported in future versions
2016-11-16 04:07:21,703 INFO  No Camp-YAML parser registered for parsing catalog item DSL;
skipping DSL-parsing
2016-11-16 04:07:21,778 INFO  TESTNG PASSED CONFIGURATION: "Surefire test" - @BeforeMethod
org.apache.brooklyn.entity.dns.AbstractGeoDnsServiceTest.setUp() finished in 123 ms
2016-11-16 04:07:21,778 INFO  TESTNG INVOKING: "Surefire test" - org.apache.brooklyn.entity.dns.AbstractGeoDnsServiceTest.testGeoInfoOnParentLocation()
2016-11-16 04:07:21,786 INFO  Creating entity in fabric DynamicRegionsFabricImpl{id=a3j1x089kg}
at SshMachineLocation[West child:null@100.0.0.1/100.0.0.1:22(id=xzcy4x36yq)]
2016-11-16 04:07:21,816 INFO  Creating entity in fabric DynamicRegionsFabricImpl{id=a3j1x089kg}
at SshMachineLocation[East child:null@100.0.0.2/100.0.0.2:22(id=rjavp3h1xf)]
2016-11-16 04:07:21,826 INFO  GeoDns TestService adding target host TestEntityImpl{id=to8gdcm7mr}
HostGeoInfo[West child: <address-ignored> at (0.0,-60.0)]
2016-11-16 04:07:21,830 INFO  GeoDns TestService adding target host TestEntityImpl{id=to8gdcm7mr}
HostGeoInfo[West child: <address-ignored> at (0.0,-60.0)]
2016-11-16 04:07:21,833 INFO  GeoDns TestService adding target host TestEntityImpl{id=to8gdcm7mr}
HostGeoInfo[West child: <address-ignored> at (0.0,-60.0)]
2016-11-16 04:07:21,838 INFO  GeoDns TestService adding target host TestEntityImpl{id=to8gdcm7mr}
HostGeoInfo[West child: <address-ignored> at (0.0,-60.0)]
2016-11-16 04:07:21,842 INFO  GeoDns TestService adding target host TestEntityImpl{id=to8gdcm7mr}
HostGeoInfo[West child: <address-ignored> at (0.0,-60.0)]
2016-11-16 04:07:21,860 INFO  GeoDns TestService adding target host TestEntityImpl{id=to8gdcm7mr}
HostGeoInfo[West child: <address-ignored> at (0.0,-60.0)]
2016-11-16 04:07:21,860 INFO  GeoDns TestService adding target host TestEntityImpl{id=qrhmk7l8zq}
HostGeoInfo[East child: <address-ignored> at (0.0,60.0)]
2016-11-16 04:07:21,864 INFO  GeoDns TestService adding target host TestEntityImpl{id=to8gdcm7mr}
HostGeoInfo[West child: <address-ignored> at (0.0,-60.0)]
2016-11-16 04:07:21,864 INFO  GeoDns TestService adding target host TestEntityImpl{id=qrhmk7l8zq}
HostGeoInfo[East child: <address-ignored> at (0.0,60.0)]
2016-11-16 04:07:21,867 INFO  GeoDns TestService adding target host TestEntityImpl{id=to8gdcm7mr}
HostGeoInfo[West child: <address-ignored> at (0.0,-60.0)]
2016-11-16 04:07:21,867 INFO  GeoDns TestService adding target host TestEntityImpl{id=qrhmk7l8zq}
HostGeoInfo[East child: <address-ignored> at (0.0,60.0)]
2016-11-16 04:07:21,882 INFO  TESTNG PASSED: "Surefire test" - org.apache.brooklyn.entity.dns.AbstractGeoDnsServiceTest.testGeoInfoOnParentLocation()
finished in 104 ms
2016-11-16 04:07:21,883 INFO  TESTNG INVOKING CONFIGURATION: "Surefire test" - @AfterMethod
org.apache.brooklyn.core.test.BrooklynMgmtUnitTestSupport.tearDown()
2016-11-16 04:07:21,899 INFO  GeoDns removing reference to TestEntityImpl{id=to8gdcm7mr}
2016-11-16 04:07:21,900 INFO  GeoDns removing reference to TestEntityImpl{id=qrhmk7l8zq}
2016-11-16 04:07:21,924 ERROR Problem refreshing group membership: java.util.concurrent.CancellationException
java.util.concurrent.CancellationException: null
	at java.util.concurrent.FutureTask.report(FutureTask.java:121) [na:1.7.0_80]
2016-11-16 04:07:21,926 INFO  TESTNG PASSED CONFIGURATION: "Surefire test" - @AfterMethod
org.apache.brooklyn.core.test.BrooklynMgmtUnitTestSupport.tearDown() finished in 43 ms
2016-11-16 04:07:21,927 INFO  TESTNG INVOKING CONFIGURATION: "Surefire test" - @BeforeMethod
org.apache.brooklyn.entity.dns.AbstractGeoDnsServiceTest.setUp()
2016-11-16 04:07:21,931 ERROR Problem refreshing group membership: java.lang.IllegalStateException:
Entity DynamicGroupImpl{id=epib5c2y5u} is no longer managed; execution context not available
java.lang.IllegalStateException: Entity DynamicGroupImpl{id=epib5c2y5u} is no longer managed;
execution context not available
	at org.apache.brooklyn.core.mgmt.internal.NonDeploymentManagementContext.getExecutionContext(NonDeploymentManagementContext.java:264)
~[brooklyn-core-0.10.0-SNAPSHOT.jar:0.10.0-SNAPSHOT]
2016-11-16 04:07:21,953 WARN  Deprecated use of unmanaged location (SshMachineLocation[West
child:null@100.0.0.1/100.0.0.1:22(id=vhubjcptmi)]); will be managed automatically now but
not supported in future versions
2016-11-16 04:07:21,956 WARN  Deprecated use of unmanaged location (SshMachineLocation[West
child with location:null@100.0.0.1/100.0.0.1:22(id=jp69ui0s1r)]); will be managed automatically
now but not supported in future versions
2016-11-16 04:07:21,959 WARN  Deprecated use of unmanaged location (SshMachineLocation[East
child:null@100.0.0.2/100.0.0.2:22(id=kpw7ws2za9)]); will be managed automatically now but
not supported in future versions
2016-11-16 04:07:21,962 WARN  Deprecated use of unmanaged location (SshMachineLocation[East
child with location:null@100.0.0.2/100.0.0.2:22(id=afbirbzxgo)]); will be managed automatically
now but not supported in future versions
2016-11-16 04:07:21,965 WARN  Deprecated use of unmanaged location (SshMachineLocation[North
child:null@10.0.0.1/10.0.0.1:22(id=bah5vq3qgo)]); will be managed automatically now but not
supported in future versions
2016-11-16 04:07:21,973 INFO  No Camp-YAML parser registered for parsing catalog item DSL;
skipping DSL-parsing
2016-11-16 04:07:22,042 INFO  TESTNG PASSED CONFIGURATION: "Surefire test" - @BeforeMethod
org.apache.brooklyn.entity.dns.AbstractGeoDnsServiceTest.setUp() finished in 115 ms
2016-11-16 04:07:22,042 INFO  TESTNG INVOKING: "Surefire test" - org.apache.brooklyn.entity.dns.AbstractGeoDnsServiceTest.testSubscribesToHostname()
2016-11-16 04:07:22,052 INFO  Creating entity in fabric DynamicRegionsFabricImpl{id=ec84s372g1}
at SshMachineLocation[West child:null@100.0.0.1/100.0.0.1:22(id=vhubjcptmi)]
2016-11-16 04:07:22,091 INFO  Creating entity in fabric DynamicRegionsFabricImpl{id=ec84s372g1}
at SshMachineLocation[East child with location:null@100.0.0.2/100.0.0.2:22(id=afbirbzxgo)]
2016-11-16 04:07:22,154 INFO  GeoDns adding TestEntityImpl{id=fkw3k5bybx} at HostGeoInfo[West
child: 100.0.0.1 at (0.0,-60.0)]
2016-11-16 04:07:22,155 INFO  GeoDns adding TestEntityImpl{id=xqwbp9a4gj} at HostGeoInfo[East
child with location: 100.0.0.2 at (0.0,60.0)]
2016-11-16 04:07:22,156 INFO  TESTNG PASSED: "Surefire test" - org.apache.brooklyn.entity.dns.AbstractGeoDnsServiceTest.testSubscribesToHostname()
finished in 114 ms
2016-11-16 04:07:22,157 INFO  TESTNG INVOKING CONFIGURATION: "Surefire test" - @AfterMethod
org.apache.brooklyn.core.test.BrooklynMgmtUnitTestSupport.tearDown()
2016-11-16 04:07:22,175 INFO  GeoDns removing reference to TestEntityImpl{id=fkw3k5bybx}
2016-11-16 04:07:22,175 INFO  GeoDns removing reference to TestEntityImpl{id=xqwbp9a4gj}
2016-11-16 04:07:22,207 INFO  TESTNG PASSED CONFIGURATION: "Surefire test" - @AfterMethod
org.apache.brooklyn.core.test.BrooklynMgmtUnitTestSupport.tearDown() finished in 50 ms
2016-11-16 04:07:22,209 INFO  TESTNG INVOKING: "Surefire test" - org.apache.brooklyn.entity.dns.geoscaling.GeoscalingScriptGeneratorTest.testScriptGeneration()
2016-11-16 04:07:22,215 INFO  TESTNG PASSED: "Surefire test" - org.apache.brooklyn.entity.dns.geoscaling.GeoscalingScriptGeneratorTest.testScriptGeneration()
finished in 7 ms
2016-11-16 04:07:22,250 INFO  TESTNG 
===============================================
    Surefire test
    Tests run: 41, Failures: 1, Skips: 0
===============================================
Tests run: 41, Failures: 1, Errors: 0, Skipped: 0, Time elapsed: 26.126 sec <<< FAILURE!
- in TestSuite
testUsesCustomControlledGroup(org.apache.brooklyn.entity.webapp.ControlledDynamicWebAppClusterTest)
 Time elapsed: 0.631 sec  <<< FAILURE!
java.lang.AssertionError: lists don't have the same size expected [1] but found [2]
	at org.testng.Assert.fail(Assert.java:94)
	at org.testng.Assert.failNotEquals(Assert.java:513)
	at org.testng.Assert.assertEqualsImpl(Assert.java:135)
	at org.testng.Assert.assertEquals(Assert.java:116)
	at org.testng.Assert.assertEquals(Assert.java:389)
	at org.testng.Assert.assertEquals(Assert.java:556)
	at org.testng.Assert.assertEquals(Assert.java:533)
	at org.apache.brooklyn.entity.webapp.ControlledDynamicWebAppClusterTest.testUsesCustomControlledGroup(ControlledDynamicWebAppClusterTest.java:106)


Results :

Failed tests: 
  ControlledDynamicWebAppClusterTest.testUsesCustomControlledGroup:106 lists don't have the
same size expected [1] but found [2]

Tests run: 41, Failures: 1, Errors: 0, Skipped: 0

[JENKINS] Recording test results
[INFO] ------------------------------------------------------------------------
[INFO] Reactor Summary:
[INFO] 
[INFO] Brooklyn Library Root .............................. SUCCESS [ 18.178 s]
[INFO] Brooklyn CM SaltStack .............................. SUCCESS [01:48 min]
[INFO] Brooklyn CM Ansible ................................ SUCCESS [ 25.751 s]
[INFO] Brooklyn CM Integration Root ....................... SUCCESS [  5.568 s]
[INFO] Brooklyn Network Software Entities ................. SUCCESS [ 20.704 s]
[INFO] Brooklyn OSGi Software Entities .................... SUCCESS [ 16.571 s]
[INFO] Brooklyn Database Software Entities ................ SUCCESS [ 33.355 s]
[INFO] Brooklyn Web App Software Entities ................. FAILURE [ 48.513 s]
[INFO] Brooklyn Messaging Software Entities ............... SKIPPED
[INFO] Brooklyn NoSQL Data Store Software Entities ........ SKIPPED
[INFO] Brooklyn Monitoring Software Entities .............. SKIPPED
[INFO] Brooklyn QA ........................................ SKIPPED
[INFO] Brooklyn Examples Aggregator Project ............... SKIPPED
[INFO] Brooklyn Examples Aggregator Project - Webapps ..... SKIPPED
[INFO] hello-world-webapp Maven Webapp .................... SKIPPED
[INFO] hello-world-sql-webapp Maven Webapp ................ SKIPPED
[INFO] Brooklyn Simple Web Cluster Example ................ SKIPPED
[INFO] Brooklyn Global Web Fabric Example ................. SKIPPED
[INFO] Brooklyn Simple Messaging Publish-Subscribe Example  SKIPPED
[INFO] Brooklyn NoSQL Cluster Examples .................... SKIPPED
[INFO] Brooklyn Library Karaf integration ................. SKIPPED
[INFO] Brooklyn Library Catalog ........................... SKIPPED
[INFO] Brooklyn Library Karaf Features .................... SKIPPED
[INFO] ------------------------------------------------------------------------
[INFO] BUILD FAILURE
[INFO] ------------------------------------------------------------------------
[INFO] Total time: 06:13 min
[INFO] Finished at: 2016-11-16T04:08:00+00:00
[INFO] Final Memory: 88M/643M
[INFO] ------------------------------------------------------------------------
Waiting for Jenkins to finish collecting data
[ERROR] Failed to execute goal org.apache.maven.plugins:maven-surefire-plugin:2.18.1:test
(default-test) on project brooklyn-software-webapp: There are test failures.
[ERROR] 
[ERROR] Please refer to <https://builds.apache.org/job/brooklyn-library-master/ws/software/webapp/target/surefire-reports>
for the individual test results.
[ERROR] -> [Help 1]
[ERROR] 
[ERROR] To see the full stack trace of the errors, re-run Maven with the -e switch.
[ERROR] Re-run Maven using the -X switch to enable full debug logging.
[ERROR] 
[ERROR] For more information about the errors and possible solutions, please read the following
articles:
[ERROR] [Help 1] http://cwiki.apache.org/confluence/display/MAVEN/MojoFailureException
[ERROR] 
[ERROR] After correcting the problems, you can resume the build with the command
[ERROR]   mvn <goals> -rf :brooklyn-software-webapp
[JENKINS] Archiving <https://builds.apache.org/job/brooklyn-library-master/ws/software/cm/salt/pom.xml>
to org.apache.brooklyn/brooklyn-software-cm-salt/0.10.0-SNAPSHOT/brooklyn-software-cm-salt-0.10.0-SNAPSHOT.pom
[JENKINS] Archiving <https://builds.apache.org/job/brooklyn-library-master/ws/software/cm/salt/target/brooklyn-software-cm-salt-0.10.0-SNAPSHOT.jar>
to org.apache.brooklyn/brooklyn-software-cm-salt/0.10.0-SNAPSHOT/brooklyn-software-cm-salt-0.10.0-SNAPSHOT.jar
[JENKINS] Archiving <https://builds.apache.org/job/brooklyn-library-master/ws/software/cm/salt/target/brooklyn-software-cm-salt-0.10.0-SNAPSHOT-tests.jar>
to org.apache.brooklyn/brooklyn-software-cm-salt/0.10.0-SNAPSHOT/brooklyn-software-cm-salt-0.10.0-SNAPSHOT-tests.jar
[JENKINS] Archiving <https://builds.apache.org/job/brooklyn-library-master/ws/software/cm/salt/target/brooklyn-software-cm-salt-0.10.0-SNAPSHOT-sources.jar>
to org.apache.brooklyn/brooklyn-software-cm-salt/0.10.0-SNAPSHOT/brooklyn-software-cm-salt-0.10.0-SNAPSHOT-sources.jar
[JENKINS] Archiving <https://builds.apache.org/job/brooklyn-library-master/ws/software/cm/salt/target/brooklyn-software-cm-salt-0.10.0-SNAPSHOT-test-sources.jar>
to org.apache.brooklyn/brooklyn-software-cm-salt/0.10.0-SNAPSHOT/brooklyn-software-cm-salt-0.10.0-SNAPSHOT-test-sources.jar
[JENKINS] Archiving <https://builds.apache.org/job/brooklyn-library-master/ws/software/osgi/pom.xml>
to org.apache.brooklyn/brooklyn-software-osgi/0.10.0-SNAPSHOT/brooklyn-software-osgi-0.10.0-SNAPSHOT.pom
[JENKINS] Archiving <https://builds.apache.org/job/brooklyn-library-master/ws/software/osgi/target/brooklyn-software-osgi-0.10.0-SNAPSHOT.jar>
to org.apache.brooklyn/brooklyn-software-osgi/0.10.0-SNAPSHOT/brooklyn-software-osgi-0.10.0-SNAPSHOT.jar
[JENKINS] Archiving <https://builds.apache.org/job/brooklyn-library-master/ws/software/osgi/target/brooklyn-software-osgi-0.10.0-SNAPSHOT-tests.jar>
to org.apache.brooklyn/brooklyn-software-osgi/0.10.0-SNAPSHOT/brooklyn-software-osgi-0.10.0-SNAPSHOT-tests.jar
[JENKINS] Archiving <https://builds.apache.org/job/brooklyn-library-master/ws/software/osgi/target/brooklyn-software-osgi-0.10.0-SNAPSHOT-sources.jar>
to org.apache.brooklyn/brooklyn-software-osgi/0.10.0-SNAPSHOT/brooklyn-software-osgi-0.10.0-SNAPSHOT-sources.jar
[JENKINS] Archiving <https://builds.apache.org/job/brooklyn-library-master/ws/software/osgi/target/brooklyn-software-osgi-0.10.0-SNAPSHOT-test-sources.jar>
to org.apache.brooklyn/brooklyn-software-osgi/0.10.0-SNAPSHOT/brooklyn-software-osgi-0.10.0-SNAPSHOT-test-sources.jar
[JENKINS] Archiving <https://builds.apache.org/job/brooklyn-library-master/ws/pom.xml>
to org.apache.brooklyn/brooklyn-library/0.10.0-SNAPSHOT/brooklyn-library-0.10.0-SNAPSHOT.pom
[JENKINS] Archiving <https://builds.apache.org/job/brooklyn-library-master/ws/software/database/pom.xml>
to org.apache.brooklyn/brooklyn-software-database/0.10.0-SNAPSHOT/brooklyn-software-database-0.10.0-SNAPSHOT.pom
[JENKINS] Archiving <https://builds.apache.org/job/brooklyn-library-master/ws/software/database/target/brooklyn-software-database-0.10.0-SNAPSHOT.jar>
to org.apache.brooklyn/brooklyn-software-database/0.10.0-SNAPSHOT/brooklyn-software-database-0.10.0-SNAPSHOT.jar
[JENKINS] Archiving <https://builds.apache.org/job/brooklyn-library-master/ws/software/database/target/brooklyn-software-database-0.10.0-SNAPSHOT-tests.jar>
to org.apache.brooklyn/brooklyn-software-database/0.10.0-SNAPSHOT/brooklyn-software-database-0.10.0-SNAPSHOT-tests.jar
[JENKINS] Archiving <https://builds.apache.org/job/brooklyn-library-master/ws/software/database/target/brooklyn-software-database-0.10.0-SNAPSHOT-sources.jar>
to org.apache.brooklyn/brooklyn-software-database/0.10.0-SNAPSHOT/brooklyn-software-database-0.10.0-SNAPSHOT-sources.jar
[JENKINS] Archiving <https://builds.apache.org/job/brooklyn-library-master/ws/software/database/target/brooklyn-software-database-0.10.0-SNAPSHOT-test-sources.jar>
to org.apache.brooklyn/brooklyn-software-database/0.10.0-SNAPSHOT/brooklyn-software-database-0.10.0-SNAPSHOT-test-sources.jar
Compressed 661.02 KB of artifacts by 19.4% relative to #68
[JENKINS] Archiving <https://builds.apache.org/job/brooklyn-library-master/ws/examples/webapps/hello-world-webapp/pom.xml>
to org.apache.brooklyn.example/brooklyn-example-hello-world-webapp/0.10.0-SNAPSHOT/brooklyn-example-hello-world-webapp-0.10.0-SNAPSHOT.pom
[JENKINS] Archiving <https://builds.apache.org/job/brooklyn-library-master/ws/software/messaging/pom.xml>
to org.apache.brooklyn/brooklyn-software-messaging/0.10.0-SNAPSHOT/brooklyn-software-messaging-0.10.0-SNAPSHOT.pom
[JENKINS] Archiving <https://builds.apache.org/job/brooklyn-library-master/ws/qa/pom.xml>
to org.apache.brooklyn/brooklyn-qa/0.10.0-SNAPSHOT/brooklyn-qa-0.10.0-SNAPSHOT.pom
[JENKINS] Archiving <https://builds.apache.org/job/brooklyn-library-master/ws/software/cm/ansible/pom.xml>
to org.apache.brooklyn/brooklyn-software-cm-ansible/0.10.0-SNAPSHOT/brooklyn-software-cm-ansible-0.10.0-SNAPSHOT.pom
[JENKINS] Archiving <https://builds.apache.org/job/brooklyn-library-master/ws/software/cm/ansible/target/brooklyn-software-cm-ansible-0.10.0-SNAPSHOT.jar>
to org.apache.brooklyn/brooklyn-software-cm-ansible/0.10.0-SNAPSHOT/brooklyn-software-cm-ansible-0.10.0-SNAPSHOT.jar
[JENKINS] Archiving <https://builds.apache.org/job/brooklyn-library-master/ws/software/cm/ansible/target/brooklyn-software-cm-ansible-0.10.0-SNAPSHOT-tests.jar>
to org.apache.brooklyn/brooklyn-software-cm-ansible/0.10.0-SNAPSHOT/brooklyn-software-cm-ansible-0.10.0-SNAPSHOT-tests.jar
[JENKINS] Archiving <https://builds.apache.org/job/brooklyn-library-master/ws/software/cm/ansible/target/brooklyn-software-cm-ansible-0.10.0-SNAPSHOT-sources.jar>
to org.apache.brooklyn/brooklyn-software-cm-ansible/0.10.0-SNAPSHOT/brooklyn-software-cm-ansible-0.10.0-SNAPSHOT-sources.jar
[JENKINS] Archiving <https://builds.apache.org/job/brooklyn-library-master/ws/software/cm/ansible/target/brooklyn-software-cm-ansible-0.10.0-SNAPSHOT-test-sources.jar>
to org.apache.brooklyn/brooklyn-software-cm-ansible/0.10.0-SNAPSHOT/brooklyn-software-cm-ansible-0.10.0-SNAPSHOT-test-sources.jar
[JENKINS] Archiving <https://builds.apache.org/job/brooklyn-library-master/ws/software/monitoring/pom.xml>
to org.apache.brooklyn/brooklyn-software-monitoring/0.10.0-SNAPSHOT/brooklyn-software-monitoring-0.10.0-SNAPSHOT.pom
[JENKINS] Archiving <https://builds.apache.org/job/brooklyn-library-master/ws/examples/global-web-fabric/pom.xml>
to org.apache.brooklyn.example/brooklyn-example-global-web-fabric/0.10.0-SNAPSHOT/brooklyn-example-global-web-fabric-0.10.0-SNAPSHOT.pom
[JENKINS] Archiving <https://builds.apache.org/job/brooklyn-library-master/ws/karaf/catalog/pom.xml>
to org.apache.brooklyn/brooklyn-library-catalog/0.10.0-SNAPSHOT/brooklyn-library-catalog-0.10.0-SNAPSHOT.pom
[JENKINS] Archiving <https://builds.apache.org/job/brooklyn-library-master/ws/software/cm/pom.xml>
to org.apache.brooklyn/brooklyn-software-cm/0.10.0-SNAPSHOT/brooklyn-software-cm-0.10.0-SNAPSHOT.pom
[JENKINS] Archiving <https://builds.apache.org/job/brooklyn-library-master/ws/examples/webapps/hello-world-sql/pom.xml>
to org.apache.brooklyn.example/brooklyn-example-hello-world-sql-webapp/0.10.0-SNAPSHOT/brooklyn-example-hello-world-sql-webapp-0.10.0-SNAPSHOT.pom
[JENKINS] Archiving <https://builds.apache.org/job/brooklyn-library-master/ws/examples/simple-messaging-pubsub/pom.xml>
to org.apache.brooklyn.example/brooklyn-example-simple-messaging-pubsub/0.10.0-SNAPSHOT/brooklyn-example-simple-messaging-pubsub-0.10.0-SNAPSHOT.pom
[JENKINS] Archiving <https://builds.apache.org/job/brooklyn-library-master/ws/software/network/pom.xml>
to org.apache.brooklyn/brooklyn-software-network/0.10.0-SNAPSHOT/brooklyn-software-network-0.10.0-SNAPSHOT.pom
[JENKINS] Archiving <https://builds.apache.org/job/brooklyn-library-master/ws/software/network/target/brooklyn-software-network-0.10.0-SNAPSHOT.jar>
to org.apache.brooklyn/brooklyn-software-network/0.10.0-SNAPSHOT/brooklyn-software-network-0.10.0-SNAPSHOT.jar
[JENKINS] Archiving <https://builds.apache.org/job/brooklyn-library-master/ws/software/network/target/brooklyn-software-network-0.10.0-SNAPSHOT-tests.jar>
to org.apache.brooklyn/brooklyn-software-network/0.10.0-SNAPSHOT/brooklyn-software-network-0.10.0-SNAPSHOT-tests.jar
[JENKINS] Archiving <https://builds.apache.org/job/brooklyn-library-master/ws/software/network/target/brooklyn-software-network-0.10.0-SNAPSHOT-sources.jar>
to org.apache.brooklyn/brooklyn-software-network/0.10.0-SNAPSHOT/brooklyn-software-network-0.10.0-SNAPSHOT-sources.jar
[JENKINS] Archiving <https://builds.apache.org/job/brooklyn-library-master/ws/software/network/target/brooklyn-software-network-0.10.0-SNAPSHOT-test-sources.jar>
to org.apache.brooklyn/brooklyn-software-network/0.10.0-SNAPSHOT/brooklyn-software-network-0.10.0-SNAPSHOT-test-sources.jar
[JENKINS] Archiving <https://builds.apache.org/job/brooklyn-library-master/ws/software/webapp/pom.xml>
to org.apache.brooklyn/brooklyn-software-webapp/0.10.0-SNAPSHOT/brooklyn-software-webapp-0.10.0-SNAPSHOT.pom
[JENKINS] Archiving <https://builds.apache.org/job/brooklyn-library-master/ws/software/nosql/pom.xml>
to org.apache.brooklyn/brooklyn-software-nosql/0.10.0-SNAPSHOT/brooklyn-software-nosql-0.10.0-SNAPSHOT.pom
[JENKINS] Archiving <https://builds.apache.org/job/brooklyn-library-master/ws/karaf/features/pom.xml>
to org.apache.brooklyn/brooklyn-library-features/0.10.0-SNAPSHOT/brooklyn-library-features-0.10.0-SNAPSHOT.pom
[JENKINS] Archiving <https://builds.apache.org/job/brooklyn-library-master/ws/karaf/pom.xml>
to org.apache.brooklyn/brooklyn-library-karaf/0.10.0-SNAPSHOT/brooklyn-library-karaf-0.10.0-SNAPSHOT.pom
[JENKINS] Archiving <https://builds.apache.org/job/brooklyn-library-master/ws/examples/simple-nosql-cluster/pom.xml>
to org.apache.brooklyn.example/brooklyn-example-simple-nosql-cluster/0.10.0-SNAPSHOT/brooklyn-example-simple-nosql-cluster-0.10.0-SNAPSHOT.pom
[JENKINS] Archiving <https://builds.apache.org/job/brooklyn-library-master/ws/examples/webapps/pom.xml>
to org.apache.brooklyn.example/brooklyn-examples-webapps-parent/0.10.0-SNAPSHOT/brooklyn-examples-webapps-parent-0.10.0-SNAPSHOT.pom
[JENKINS] Archiving <https://builds.apache.org/job/brooklyn-library-master/ws/examples/simple-web-cluster/pom.xml>
to org.apache.brooklyn.example/brooklyn-example-simple-web-cluster/0.10.0-SNAPSHOT/brooklyn-example-simple-web-cluster-0.10.0-SNAPSHOT.pom
[JENKINS] Archiving <https://builds.apache.org/job/brooklyn-library-master/ws/examples/pom.xml>
to org.apache.brooklyn.example/brooklyn-examples-parent/0.10.0-SNAPSHOT/brooklyn-examples-parent-0.10.0-SNAPSHOT.pom
channel stopped

Mime
View raw message