brooklyn-dev mailing list archives

Site index · List index
Message view « Date » · « Thread »
Top « Date » · « Thread »
From Apache Jenkins Server <jenk...@builds.apache.org>
Subject Build failed in Jenkins: brooklyn-server-master #344
Date Thu, 17 Nov 2016 16:57:22 GMT
See <https://builds.apache.org/job/brooklyn-server-master/344/changes>

Changes:

[yavor] Fixing HttpResponse headers value

[yavor] Adding test for HttpResponse headers value

[yavor] Simplifying the test according the PR comments

------------------------------------------
[...truncated 22241 lines...]
2016-11-17 16:54:51,606 INFO  TESTNG INVOKING CONFIGURATION: "Surefire test" - @BeforeMethod
org.apache.brooklyn.core.entity.EntityTypeTest.setUp()
2016-11-17 16:54:51,666 INFO  TESTNG PASSED CONFIGURATION: "Surefire test" - @BeforeMethod
org.apache.brooklyn.core.entity.EntityTypeTest.setUp() finished in 60 ms
2016-11-17 16:54:51,666 INFO  TESTNG INVOKING: "Surefire test" - org.apache.brooklyn.core.entity.EntityTypeTest.testGetSimpleName()
2016-11-17 16:54:51,707 INFO  TESTNG PASSED: "Surefire test" - org.apache.brooklyn.core.entity.EntityTypeTest.testGetSimpleName()
finished in 41 ms
2016-11-17 16:54:51,708 INFO  TESTNG INVOKING CONFIGURATION: "Surefire test" - @AfterMethod
org.apache.brooklyn.core.test.BrooklynMgmtUnitTestSupport.tearDown()
2016-11-17 16:54:51,719 INFO  TESTNG PASSED CONFIGURATION: "Surefire test" - @AfterMethod
org.apache.brooklyn.core.test.BrooklynMgmtUnitTestSupport.tearDown() finished in 12 ms
2016-11-17 16:54:51,719 INFO  TESTNG INVOKING CONFIGURATION: "Surefire test" - @BeforeMethod
org.apache.brooklyn.core.entity.EntityTypeTest.setUp()
2016-11-17 16:54:51,803 INFO  TESTNG PASSED CONFIGURATION: "Surefire test" - @BeforeMethod
org.apache.brooklyn.core.entity.EntityTypeTest.setUp() finished in 84 ms
2016-11-17 16:54:51,803 INFO  TESTNG INVOKING: "Surefire test" - org.apache.brooklyn.core.entity.EntityTypeTest.testHasSensor()
2016-11-17 16:54:51,804 INFO  TESTNG PASSED: "Surefire test" - org.apache.brooklyn.core.entity.EntityTypeTest.testHasSensor()
finished in 1 ms
2016-11-17 16:54:51,804 INFO  TESTNG INVOKING CONFIGURATION: "Surefire test" - @AfterMethod
org.apache.brooklyn.core.test.BrooklynMgmtUnitTestSupport.tearDown()
2016-11-17 16:54:51,848 INFO  TESTNG PASSED CONFIGURATION: "Surefire test" - @AfterMethod
org.apache.brooklyn.core.test.BrooklynMgmtUnitTestSupport.tearDown() finished in 44 ms
2016-11-17 16:54:51,849 INFO  TESTNG INVOKING CONFIGURATION: "Surefire test" - @BeforeMethod
org.apache.brooklyn.core.entity.EntityTypeTest.setUp()
2016-11-17 16:54:51,900 INFO  TESTNG PASSED CONFIGURATION: "Surefire test" - @BeforeMethod
org.apache.brooklyn.core.entity.EntityTypeTest.setUp() finished in 51 ms
2016-11-17 16:54:51,901 INFO  TESTNG INVOKING: "Surefire test" - org.apache.brooklyn.core.entity.EntityTypeTest.testRemoveSensor()
2016-11-17 16:54:51,901 INFO  TESTNG PASSED: "Surefire test" - org.apache.brooklyn.core.entity.EntityTypeTest.testRemoveSensor()
finished in 0 ms
2016-11-17 16:54:51,902 INFO  TESTNG INVOKING CONFIGURATION: "Surefire test" - @AfterMethod
org.apache.brooklyn.core.test.BrooklynMgmtUnitTestSupport.tearDown()
2016-11-17 16:54:51,908 INFO  TESTNG PASSED CONFIGURATION: "Surefire test" - @AfterMethod
org.apache.brooklyn.core.test.BrooklynMgmtUnitTestSupport.tearDown() finished in 6 ms
2016-11-17 16:54:51,909 INFO  TESTNG INVOKING CONFIGURATION: "Surefire test" - @BeforeMethod
org.apache.brooklyn.core.entity.EntityTypeTest.setUp()
2016-11-17 16:54:51,983 INFO  TESTNG PASSED CONFIGURATION: "Surefire test" - @BeforeMethod
org.apache.brooklyn.core.entity.EntityTypeTest.setUp() finished in 75 ms
2016-11-17 16:54:51,983 INFO  TESTNG INVOKING: "Surefire test" - org.apache.brooklyn.core.entity.EntityTypeTest.testRemoveSensorThroughEntity()
2016-11-17 16:54:51,984 INFO  TESTNG PASSED: "Surefire test" - org.apache.brooklyn.core.entity.EntityTypeTest.testRemoveSensorThroughEntity()
finished in 1 ms
2016-11-17 16:54:51,985 INFO  TESTNG INVOKING CONFIGURATION: "Surefire test" - @AfterMethod
org.apache.brooklyn.core.test.BrooklynMgmtUnitTestSupport.tearDown()
2016-11-17 16:54:51,992 INFO  TESTNG PASSED CONFIGURATION: "Surefire test" - @AfterMethod
org.apache.brooklyn.core.test.BrooklynMgmtUnitTestSupport.tearDown() finished in 8 ms
2016-11-17 16:54:51,992 INFO  TESTNG INVOKING CONFIGURATION: "Surefire test" - @BeforeMethod
org.apache.brooklyn.core.entity.EntityTypeTest.setUp()
2016-11-17 16:54:52,058 INFO  TESTNG PASSED CONFIGURATION: "Surefire test" - @BeforeMethod
org.apache.brooklyn.core.entity.EntityTypeTest.setUp() finished in 66 ms
2016-11-17 16:54:52,059 INFO  TESTNG INVOKING: "Surefire test" - org.apache.brooklyn.core.entity.EntityTypeTest.testRemoveSensors()
2016-11-17 16:54:52,061 INFO  TESTNG PASSED: "Surefire test" - org.apache.brooklyn.core.entity.EntityTypeTest.testRemoveSensors()
finished in 2 ms
2016-11-17 16:54:52,061 INFO  TESTNG INVOKING CONFIGURATION: "Surefire test" - @AfterMethod
org.apache.brooklyn.core.test.BrooklynMgmtUnitTestSupport.tearDown()
2016-11-17 16:54:52,095 INFO  TESTNG PASSED CONFIGURATION: "Surefire test" - @AfterMethod
org.apache.brooklyn.core.test.BrooklynMgmtUnitTestSupport.tearDown() finished in 34 ms
2016-11-17 16:54:52,551 INFO  TESTNG 
===============================================
    Surefire test
    Tests run: 1963, Failures: 1, Skips: 0
===============================================
2016-11-17 16:54:52,552 WARN  Management Context LocalManagementContext[FTqraMPI-bB7qylm1]
running, creation stacktrace:
java.lang.Throwable: for construction stacktrace
	at org.apache.brooklyn.core.mgmt.internal.LocalManagementContext.<init>(LocalManagementContext.java:131)
	at org.apache.brooklyn.core.mgmt.internal.LocalManagementContext.<init>(LocalManagementContext.java:164)
	at org.apache.brooklyn.core.mgmt.internal.LocalManagementContext.<init>(LocalManagementContext.java:156)
	at org.apache.brooklyn.core.mgmt.internal.LocalManagementContext.<init>(LocalManagementContext.java:143)
	at org.apache.brooklyn.core.test.entity.LocalManagementContextForTests.<init>(LocalManagementContextForTests.java:43)
	at org.apache.brooklyn.core.test.entity.LocalManagementContextForTests$Builder.build(LocalManagementContextForTests.java:145)
	at org.apache.brooklyn.core.BrooklynVersionTest.testGetFeatures(BrooklynVersionTest.java:97)
	at sun.reflect.NativeMethodAccessorImpl.invoke0(Native Method)
	at sun.reflect.NativeMethodAccessorImpl.invoke(NativeMethodAccessorImpl.java:57)
	at sun.reflect.DelegatingMethodAccessorImpl.invoke(DelegatingMethodAccessorImpl.java:43)
	at java.lang.reflect.Method.invoke(Method.java:606)
	at org.testng.internal.MethodInvocationHelper.invokeMethod(MethodInvocationHelper.java:86)
	at org.testng.internal.Invoker.invokeMethod(Invoker.java:643)
	at org.testng.internal.Invoker.invokeTestMethod(Invoker.java:820)
	at org.testng.internal.Invoker.invokeTestMethods(Invoker.java:1128)
	at org.testng.internal.TestMethodWorker.invokeTestMethods(TestMethodWorker.java:129)
	at org.testng.internal.TestMethodWorker.run(TestMethodWorker.java:112)
	at org.testng.TestRunner.privateRun(TestRunner.java:782)
	at org.testng.TestRunner.run(TestRunner.java:632)
	at org.testng.SuiteRunner.runTest(SuiteRunner.java:366)
	at org.testng.SuiteRunner.runSequentially(SuiteRunner.java:361)
	at org.testng.SuiteRunner.privateRun(SuiteRunner.java:319)
	at org.testng.SuiteRunner.run(SuiteRunner.java:268)
	at org.testng.SuiteRunnerWorker.runSuite(SuiteRunnerWorker.java:52)
	at org.testng.SuiteRunnerWorker.run(SuiteRunnerWorker.java:86)
	at org.testng.TestNG.runSuitesSequentially(TestNG.java:1244)
	at org.testng.TestNG.runSuitesLocally(TestNG.java:1169)
	at org.testng.TestNG.run(TestNG.java:1064)
	at org.apache.maven.surefire.testng.TestNGExecutor.run(TestNGExecutor.java:132)
	at org.apache.maven.surefire.testng.TestNGDirectoryTestSuite.executeMulti(TestNGDirectoryTestSuite.java:193)
	at org.apache.maven.surefire.testng.TestNGDirectoryTestSuite.execute(TestNGDirectoryTestSuite.java:94)
	at org.apache.maven.surefire.testng.TestNGProvider.invoke(TestNGProvider.java:147)
	at org.apache.maven.surefire.booter.ForkedBooter.invokeProviderInSameClassLoader(ForkedBooter.java:290)
	at org.apache.maven.surefire.booter.ForkedBooter.runSuitesInProcess(ForkedBooter.java:242)
	at org.apache.maven.surefire.booter.ForkedBooter.main(ForkedBooter.java:121)

2016-11-17 16:54:52,605 INFO  BrooklynLeakListener.onFinish attempting to terminate all extant
ManagementContexts: name=Surefire test; includedGroups=[]; excludedGroups=[Integration, Live-sanity,
Acceptance, Live, Broken, WIP]; suiteName=Surefire suite; outDir=<https://builds.apache.org/job/brooklyn-server-master/ws/core/target/surefire-reports/Surefire>
suite: 1 ManagementContexts terminated
[GC 640019K->427491K(763392K), 0.0445580 secs]
2016-11-17 16:54:53,895 WARN  Task Task[LSM.publish(Application[l05el5en].Sensor: entity.children.removed
(org.apache.brooklyn.api.entity.Entity)=TestEntityImpl{id=zvcaejamgw} @ 1479401691170);[Wrapped[contextEntity:Application[l05el5en]],
subscription-delivery-entity-dll05el5en[Application[l05el5en]]]]@epa1UJBt is being finalized
before completion
2016-11-17 16:54:53,896 WARN  Task Task[LSM.publish(Application[l05el5en].Sensor: entity.children.removed
(org.apache.brooklyn.api.entity.Entity)=EmptyEntityForTesting{id=qytzfl2ubb} @ 1479401691169);[Wrapped[contextEntity:Application[l05el5en]],
subscription-delivery-entity-dll05el5en[Application[l05el5en]]]]@Jcy4xJr5 is being finalized
before completion
2016-11-17 16:54:53,896 WARN  Task Task[LSM.publish(Application[l05el5en].Sensor: service.state.expected
(org.apache.brooklyn.core.entity.lifecycle.Lifecycle$Transition)=stopped @ 1479401691169 /
Thu Nov 17 16:54:51 UTC 2016 @ 1479401691169);[Wrapped[contextEntity:Application[l05el5en]],
subscription-delivery-entity-dll05el5en[Application[l05el5en]]]]@lbwgaS84 is being finalized
before completion
2016-11-17 16:54:53,896 WARN  Task Task[LSM.publish(Application[nx7drdm4].Sensor: entity.children.removed
(org.apache.brooklyn.api.entity.Entity)=TestEntityImpl{id=syxlk2bkqv} @ 1479401691248);[subscription-delivery-entity-i6nx7drdm4[Application[nx7drdm4]],
Wrapped[contextEntity:Application[nx7drdm4]]]]@xLFdd6d4 is being finalized before completion
2016-11-17 16:54:53,896 WARN  Task Task[LSM.publish(Application[ap7atyz9].Sensor: entity.children.removed
(org.apache.brooklyn.api.entity.Entity)=TestEntityImpl{id=tpn5ygsvco} @ 1479401691718);[Wrapped[contextEntity:Application[ap7atyz9]],
subscription-delivery-entity-djap7atyz9[Application[ap7atyz9]]]]@pUqVHvHu is being finalized
before completion
2016-11-17 16:54:53,896 WARN  Task Task[LSM.publish(Application[ap7atyz9].Sensor: entity.children.removed
(org.apache.brooklyn.api.entity.Entity)=EmptyEntityForTesting{id=lgjijzwvic} @ 1479401691717);[Wrapped[contextEntity:Application[ap7atyz9]],
subscription-delivery-entity-djap7atyz9[Application[ap7atyz9]]]]@pi5PukWs is being finalized
before completion
2016-11-17 16:54:53,896 WARN  Task Task[LSM.publish(Application[ap7atyz9].Sensor: service.state.expected
(org.apache.brooklyn.core.entity.lifecycle.Lifecycle$Transition)=stopped @ 1479401691713 /
Thu Nov 17 16:54:51 UTC 2016 @ 1479401691713);[Wrapped[contextEntity:Application[ap7atyz9]],
subscription-delivery-entity-djap7atyz9[Application[ap7atyz9]]]]@kZq80Uzk is being finalized
before completion
[GC 641117K->429314K(762880K), 0.0830170 secs]
Tests run: 1963, Failures: 1, Errors: 0, Skipped: 0, Time elapsed: 459.356 sec <<<
FAILURE! - in TestSuite
(org.apache.brooklyn.core.entity.ApplicationLifecycleStateTest)  Time elapsed: 0.145 sec 
<<< FAILURE!
java.lang.AssertionError: entity=Application[rjkw3sil]; attribute=Sensor: service.state (org.apache.brooklyn.core.entity.lifecycle.Lifecycle)
expected [running] but found [on-fire]
	at org.apache.brooklyn.core.entity.ApplicationLifecycleStateTest.assertHealthContinually(ApplicationLifecycleStateTest.java:187)
	at org.apache.brooklyn.core.entity.ApplicationLifecycleStateTest.testStartsThenChildFailsButWithQuorumCausesAppToSucceed(ApplicationLifecycleStateTest.java:161)

2016-11-17 16:54:56,072 INFO  Brooklyn shutdown: stopping entities [TestEntityImpl{id=zk1dql6u1q},
TestEntityImpl{id=so4n3h0mlq}, BlockingEntityImpl{id=m2m7ovjivh}]

Results :

Failed tests: 
org.apache.brooklyn.core.entity.ApplicationLifecycleStateTest.(org.apache.brooklyn.core.entity.ApplicationLifecycleStateTest)
  Run 1: PASS
  Run 2: PASS
  Run 3: PASS
  Run 4: PASS
  Run 5: PASS
  Run 6: PASS
  Run 7: PASS
  Run 8: PASS
  Run 9: ApplicationLifecycleStateTest.testStartsThenChildFailsButWithQuorumCausesAppToSucceed:161->assertHealthContinually:187
entity=Application[rjkw3sil]; attribute=Sensor: service.state (org.apache.brooklyn.core.entity.lifecycle.Lifecycle)
expected [running] but found [on-fire]
  Run 10: PASS
  Run 11: PASS


Tests run: 1953, Failures: 1, Errors: 0, Skipped: 0

[JENKINS] Recording test results
[INFO] ------------------------------------------------------------------------
[INFO] Reactor Summary:
[INFO] 
[INFO] Brooklyn Server Root ............................... SUCCESS [  2.780 s]
[INFO] Brooklyn Parent Project ............................ SUCCESS [  4.549 s]
[INFO] Brooklyn Test Support Utilities .................... SUCCESS [  9.552 s]
[INFO] Brooklyn Logback Includable Configuration .......... SUCCESS [  2.836 s]
[INFO] Brooklyn Common Utilities .......................... SUCCESS [ 38.694 s]
[INFO] Brooklyn API ....................................... SUCCESS [  5.619 s]
[INFO] CAMP Server Parent Project ......................... SUCCESS [  1.246 s]
[INFO] CAMP Base .......................................... SUCCESS [  6.482 s]
[INFO] Brooklyn Test Support .............................. SUCCESS [  6.038 s]
[INFO] Brooklyn REST Swagger Apidoc Utilities ............. SUCCESS [  3.794 s]
[INFO] Brooklyn Logback Configuration ..................... SUCCESS [  2.296 s]
[INFO] CAMP Server ........................................ SUCCESS [  9.976 s]
[INFO] Brooklyn Felix Runtime ............................. SUCCESS [  7.473 s]
[INFO] Brooklyn Groovy Utilities .......................... SUCCESS [  3.579 s]
[INFO] Brooklyn Core ...................................... FAILURE [08:37 min]
[INFO] Brooklyn Policies .................................. SKIPPED
[INFO] Brooklyn WinRM Software Entities ................... SKIPPED
[INFO] Brooklyn Secure JMXMP Agent ........................ SKIPPED
[INFO] Brooklyn JMX RMI Agent ............................. SKIPPED
[INFO] Brooklyn Jclouds Location Targets .................. SKIPPED
[INFO] Brooklyn Software Base ............................. SKIPPED
[INFO] Brooklyn CAMP ...................................... SKIPPED
[INFO] Brooklyn Hazelcast Storage ......................... SKIPPED
[INFO] Brooklyn Launcher Common ........................... SKIPPED
[INFO] Brooklyn REST API .................................. SKIPPED
[INFO] Brooklyn REST Resources ............................ SKIPPED
[INFO] Brooklyn REST Server ............................... SKIPPED
[INFO] Brooklyn Launcher .................................. SKIPPED
[INFO] Brooklyn Command Line Interface .................... SKIPPED
[INFO] Brooklyn Test Framework ............................ SKIPPED
[INFO] Brooklyn OSGi init ................................. SKIPPED
[INFO] Brooklyn Karaf ..................................... SKIPPED
[INFO] Jetty config fragment .............................. SKIPPED
[INFO] Apache Http Component extension .................... SKIPPED
[INFO] Brooklyn Karaf Features ............................ SKIPPED
[INFO] Brooklyn Karaf Shell Commands ...................... SKIPPED
[INFO] ------------------------------------------------------------------------
[INFO] BUILD FAILURE
[INFO] ------------------------------------------------------------------------
[INFO] Total time: 10:46 min
[INFO] Finished at: 2016-11-17T16:55:05+00:00
[INFO] Final Memory: 83M/635M
[INFO] ------------------------------------------------------------------------
Waiting for Jenkins to finish collecting data
[ERROR] Failed to execute goal org.apache.maven.plugins:maven-surefire-plugin:2.19.1:test
(default-test) on project brooklyn-core: There are test failures.
[ERROR] 
[ERROR] Please refer to <https://builds.apache.org/job/brooklyn-server-master/ws/core/target/surefire-reports>
for the individual test results.
[ERROR] -> [Help 1]
[ERROR] 
[ERROR] To see the full stack trace of the errors, re-run Maven with the -e switch.
[ERROR] Re-run Maven using the -X switch to enable full debug logging.
[ERROR] 
[ERROR] For more information about the errors and possible solutions, please read the following
articles:
[ERROR] [Help 1] http://cwiki.apache.org/confluence/display/MAVEN/MojoFailureException
[ERROR] 
[ERROR] After correcting the problems, you can resume the build with the command
[ERROR]   mvn <goals> -rf :brooklyn-core
[JENKINS] Archiving <https://builds.apache.org/job/brooklyn-server-master/ws/camp/pom.xml>
to org.apache.brooklyn.camp/camp-parent/0.10.0-SNAPSHOT/camp-parent-0.10.0-SNAPSHOT.pom
[JENKINS] Archiving <https://builds.apache.org/job/brooklyn-server-master/ws/utils/rt-felix/pom.xml>
to org.apache.brooklyn/brooklyn-rt-felix/0.10.0-SNAPSHOT/brooklyn-rt-felix-0.10.0-SNAPSHOT.pom
[JENKINS] Archiving <https://builds.apache.org/job/brooklyn-server-master/ws/utils/rt-felix/target/brooklyn-rt-felix-0.10.0-SNAPSHOT.jar>
to org.apache.brooklyn/brooklyn-rt-felix/0.10.0-SNAPSHOT/brooklyn-rt-felix-0.10.0-SNAPSHOT.jar
[JENKINS] Archiving <https://builds.apache.org/job/brooklyn-server-master/ws/utils/rt-felix/target/brooklyn-rt-felix-0.10.0-SNAPSHOT-tests.jar>
to org.apache.brooklyn/brooklyn-rt-felix/0.10.0-SNAPSHOT/brooklyn-rt-felix-0.10.0-SNAPSHOT-tests.jar
[JENKINS] Archiving <https://builds.apache.org/job/brooklyn-server-master/ws/utils/rt-felix/target/brooklyn-rt-felix-0.10.0-SNAPSHOT-sources.jar>
to org.apache.brooklyn/brooklyn-rt-felix/0.10.0-SNAPSHOT/brooklyn-rt-felix-0.10.0-SNAPSHOT-sources.jar
[JENKINS] Archiving <https://builds.apache.org/job/brooklyn-server-master/ws/utils/rt-felix/target/brooklyn-rt-felix-0.10.0-SNAPSHOT-test-sources.jar>
to org.apache.brooklyn/brooklyn-rt-felix/0.10.0-SNAPSHOT/brooklyn-rt-felix-0.10.0-SNAPSHOT-test-sources.jar
[JENKINS] Archiving <https://builds.apache.org/job/brooklyn-server-master/ws/test-framework/pom.xml>
to org.apache.brooklyn/brooklyn-test-framework/0.10.0-SNAPSHOT/brooklyn-test-framework-0.10.0-SNAPSHOT.pom
[JENKINS] Archiving <https://builds.apache.org/job/brooklyn-server-master/ws/core/pom.xml>
to org.apache.brooklyn/brooklyn-core/0.10.0-SNAPSHOT/brooklyn-core-0.10.0-SNAPSHOT.pom
[JENKINS] Archiving <https://builds.apache.org/job/brooklyn-server-master/ws/camp/camp-server/pom.xml>
to org.apache.brooklyn.camp/camp-server/0.10.0-SNAPSHOT/camp-server-0.10.0-SNAPSHOT.pom
[JENKINS] Archiving <https://builds.apache.org/job/brooklyn-server-master/ws/camp/camp-server/target/camp-server-0.10.0-SNAPSHOT.jar>
to org.apache.brooklyn.camp/camp-server/0.10.0-SNAPSHOT/camp-server-0.10.0-SNAPSHOT.jar
[JENKINS] Archiving <https://builds.apache.org/job/brooklyn-server-master/ws/camp/camp-server/target/camp-server-0.10.0-SNAPSHOT-tests.jar>
to org.apache.brooklyn.camp/camp-server/0.10.0-SNAPSHOT/camp-server-0.10.0-SNAPSHOT-tests.jar
[JENKINS] Archiving <https://builds.apache.org/job/brooklyn-server-master/ws/camp/camp-server/target/camp-server-0.10.0-SNAPSHOT-sources.jar>
to org.apache.brooklyn.camp/camp-server/0.10.0-SNAPSHOT/camp-server-0.10.0-SNAPSHOT-sources.jar
[JENKINS] Archiving <https://builds.apache.org/job/brooklyn-server-master/ws/camp/camp-server/target/camp-server-0.10.0-SNAPSHOT-test-sources.jar>
to org.apache.brooklyn.camp/camp-server/0.10.0-SNAPSHOT/camp-server-0.10.0-SNAPSHOT-test-sources.jar
[JENKINS] Archiving <https://builds.apache.org/job/brooklyn-server-master/ws/launcher/pom.xml>
to org.apache.brooklyn/brooklyn-launcher/0.10.0-SNAPSHOT/brooklyn-launcher-0.10.0-SNAPSHOT.pom
[JENKINS] Archiving <https://builds.apache.org/job/brooklyn-server-master/ws/karaf/pom.xml>
to org.apache.brooklyn/brooklyn-karaf/0.10.0-SNAPSHOT/brooklyn-karaf-0.10.0-SNAPSHOT.pom
[JENKINS] Archiving <https://builds.apache.org/job/brooklyn-server-master/ws/karaf/httpcomponent-extension/pom.xml>
to org.apache.brooklyn/brooklyn-karaf-httpcomponents-extension/0.10.0-SNAPSHOT/brooklyn-karaf-httpcomponents-extension-0.10.0-SNAPSHOT.pom
[JENKINS] Archiving <https://builds.apache.org/job/brooklyn-server-master/ws/utils/test-support/pom.xml>
to org.apache.brooklyn/brooklyn-utils-test-support/0.10.0-SNAPSHOT/brooklyn-utils-test-support-0.10.0-SNAPSHOT.pom
[JENKINS] Archiving <https://builds.apache.org/job/brooklyn-server-master/ws/utils/test-support/target/brooklyn-utils-test-support-0.10.0-SNAPSHOT.jar>
to org.apache.brooklyn/brooklyn-utils-test-support/0.10.0-SNAPSHOT/brooklyn-utils-test-support-0.10.0-SNAPSHOT.jar
[JENKINS] Archiving <https://builds.apache.org/job/brooklyn-server-master/ws/utils/test-support/target/brooklyn-utils-test-support-0.10.0-SNAPSHOT-sources.jar>
to org.apache.brooklyn/brooklyn-utils-test-support/0.10.0-SNAPSHOT/brooklyn-utils-test-support-0.10.0-SNAPSHOT-sources.jar
[JENKINS] Archiving <https://builds.apache.org/job/brooklyn-server-master/ws/utils/test-support/target/brooklyn-utils-test-support-0.10.0-SNAPSHOT-test-sources.jar>
to org.apache.brooklyn/brooklyn-utils-test-support/0.10.0-SNAPSHOT/brooklyn-utils-test-support-0.10.0-SNAPSHOT-test-sources.jar
[JENKINS] Archiving <https://builds.apache.org/job/brooklyn-server-master/ws/software/base/pom.xml>
to org.apache.brooklyn/brooklyn-software-base/0.10.0-SNAPSHOT/brooklyn-software-base-0.10.0-SNAPSHOT.pom
[JENKINS] Archiving <https://builds.apache.org/job/brooklyn-server-master/ws/utils/groovy/pom.xml>
to org.apache.brooklyn/brooklyn-utils-groovy/0.10.0-SNAPSHOT/brooklyn-utils-groovy-0.10.0-SNAPSHOT.pom
[JENKINS] Archiving <https://builds.apache.org/job/brooklyn-server-master/ws/utils/groovy/target/brooklyn-utils-groovy-0.10.0-SNAPSHOT.jar>
to org.apache.brooklyn/brooklyn-utils-groovy/0.10.0-SNAPSHOT/brooklyn-utils-groovy-0.10.0-SNAPSHOT.jar
[JENKINS] Archiving <https://builds.apache.org/job/brooklyn-server-master/ws/utils/groovy/target/brooklyn-utils-groovy-0.10.0-SNAPSHOT-tests.jar>
to org.apache.brooklyn/brooklyn-utils-groovy/0.10.0-SNAPSHOT/brooklyn-utils-groovy-0.10.0-SNAPSHOT-tests.jar
[JENKINS] Archiving <https://builds.apache.org/job/brooklyn-server-master/ws/utils/groovy/target/brooklyn-utils-groovy-0.10.0-SNAPSHOT-sources.jar>
to org.apache.brooklyn/brooklyn-utils-groovy/0.10.0-SNAPSHOT/brooklyn-utils-groovy-0.10.0-SNAPSHOT-sources.jar
[JENKINS] Archiving <https://builds.apache.org/job/brooklyn-server-master/ws/utils/groovy/target/brooklyn-utils-groovy-0.10.0-SNAPSHOT-test-sources.jar>
to org.apache.brooklyn/brooklyn-utils-groovy/0.10.0-SNAPSHOT/brooklyn-utils-groovy-0.10.0-SNAPSHOT-test-sources.jar
[JENKINS] Archiving <https://builds.apache.org/job/brooklyn-server-master/ws/utils/rest-swagger/pom.xml>
to org.apache.brooklyn/brooklyn-utils-rest-swagger/0.10.0-SNAPSHOT/brooklyn-utils-rest-swagger-0.10.0-SNAPSHOT.pom
[JENKINS] Archiving <https://builds.apache.org/job/brooklyn-server-master/ws/utils/rest-swagger/target/brooklyn-utils-rest-swagger-0.10.0-SNAPSHOT.jar>
to org.apache.brooklyn/brooklyn-utils-rest-swagger/0.10.0-SNAPSHOT/brooklyn-utils-rest-swagger-0.10.0-SNAPSHOT.jar
[JENKINS] Archiving <https://builds.apache.org/job/brooklyn-server-master/ws/utils/rest-swagger/target/brooklyn-utils-rest-swagger-0.10.0-SNAPSHOT-sources.jar>
to org.apache.brooklyn/brooklyn-utils-rest-swagger/0.10.0-SNAPSHOT/brooklyn-utils-rest-swagger-0.10.0-SNAPSHOT-sources.jar
[JENKINS] Archiving <https://builds.apache.org/job/brooklyn-server-master/ws/utils/rest-swagger/target/brooklyn-utils-rest-swagger-0.10.0-SNAPSHOT-test-sources.jar>
to org.apache.brooklyn/brooklyn-utils-rest-swagger/0.10.0-SNAPSHOT/brooklyn-utils-rest-swagger-0.10.0-SNAPSHOT-test-sources.jar
[JENKINS] Archiving <https://builds.apache.org/job/brooklyn-server-master/ws/launcher-common/pom.xml>
to org.apache.brooklyn/brooklyn-launcher-common/0.10.0-SNAPSHOT/brooklyn-launcher-common-0.10.0-SNAPSHOT.pom
[JENKINS] Archiving <https://builds.apache.org/job/brooklyn-server-master/ws/camp/camp-base/pom.xml>
to org.apache.brooklyn.camp/camp-base/0.10.0-SNAPSHOT/camp-base-0.10.0-SNAPSHOT.pom
[JENKINS] Archiving <https://builds.apache.org/job/brooklyn-server-master/ws/camp/camp-base/target/camp-base-0.10.0-SNAPSHOT.jar>
to org.apache.brooklyn.camp/camp-base/0.10.0-SNAPSHOT/camp-base-0.10.0-SNAPSHOT.jar
[JENKINS] Archiving <https://builds.apache.org/job/brooklyn-server-master/ws/camp/camp-base/target/camp-base-0.10.0-SNAPSHOT-tests.jar>
to org.apache.brooklyn.camp/camp-base/0.10.0-SNAPSHOT/camp-base-0.10.0-SNAPSHOT-tests.jar
[JENKINS] Archiving <https://builds.apache.org/job/brooklyn-server-master/ws/camp/camp-base/target/camp-base-0.10.0-SNAPSHOT-sources.jar>
to org.apache.brooklyn.camp/camp-base/0.10.0-SNAPSHOT/camp-base-0.10.0-SNAPSHOT-sources.jar
[JENKINS] Archiving <https://builds.apache.org/job/brooklyn-server-master/ws/camp/camp-base/target/camp-base-0.10.0-SNAPSHOT-test-sources.jar>
to org.apache.brooklyn.camp/camp-base/0.10.0-SNAPSHOT/camp-base-0.10.0-SNAPSHOT-test-sources.jar
[JENKINS] Archiving <https://builds.apache.org/job/brooklyn-server-master/ws/camp/camp-brooklyn/pom.xml>
to org.apache.brooklyn/brooklyn-camp/0.10.0-SNAPSHOT/brooklyn-camp-0.10.0-SNAPSHOT.pom
[JENKINS] Archiving <https://builds.apache.org/job/brooklyn-server-master/ws/karaf/jetty-config/pom.xml>
to org.apache.brooklyn/brooklyn-karaf-jetty-config/0.10.0-SNAPSHOT/brooklyn-karaf-jetty-config-0.10.0-SNAPSHOT.pom
[JENKINS] Archiving <https://builds.apache.org/job/brooklyn-server-master/ws/server-cli/pom.xml>
to org.apache.brooklyn/brooklyn-cli/0.10.0-SNAPSHOT/brooklyn-cli-0.10.0-SNAPSHOT.pom
[JENKINS] Archiving <https://builds.apache.org/job/brooklyn-server-master/ws/logging/logback-xml/pom.xml>
to org.apache.brooklyn/brooklyn-logback-xml/0.10.0-SNAPSHOT/brooklyn-logback-xml-0.10.0-SNAPSHOT.pom
[JENKINS] Archiving <https://builds.apache.org/job/brooklyn-server-master/ws/logging/logback-xml/target/brooklyn-logback-xml-0.10.0-SNAPSHOT.jar>
to org.apache.brooklyn/brooklyn-logback-xml/0.10.0-SNAPSHOT/brooklyn-logback-xml-0.10.0-SNAPSHOT.jar
[JENKINS] Archiving <https://builds.apache.org/job/brooklyn-server-master/ws/logging/logback-xml/target/brooklyn-logback-xml-0.10.0-SNAPSHOT-sources.jar>
to org.apache.brooklyn/brooklyn-logback-xml/0.10.0-SNAPSHOT/brooklyn-logback-xml-0.10.0-SNAPSHOT-sources.jar
[JENKINS] Archiving <https://builds.apache.org/job/brooklyn-server-master/ws/logging/logback-xml/target/brooklyn-logback-xml-0.10.0-SNAPSHOT-test-sources.jar>
to org.apache.brooklyn/brooklyn-logback-xml/0.10.0-SNAPSHOT/brooklyn-logback-xml-0.10.0-SNAPSHOT-test-sources.jar
[JENKINS] Archiving <https://builds.apache.org/job/brooklyn-server-master/ws/test-support/pom.xml>
to org.apache.brooklyn/brooklyn-test-support/0.10.0-SNAPSHOT/brooklyn-test-support-0.10.0-SNAPSHOT.pom
[JENKINS] Archiving <https://builds.apache.org/job/brooklyn-server-master/ws/test-support/target/brooklyn-test-support-0.10.0-SNAPSHOT.jar>
to org.apache.brooklyn/brooklyn-test-support/0.10.0-SNAPSHOT/brooklyn-test-support-0.10.0-SNAPSHOT.jar
[JENKINS] Archiving <https://builds.apache.org/job/brooklyn-server-master/ws/test-support/target/brooklyn-test-support-0.10.0-SNAPSHOT-sources.jar>
to org.apache.brooklyn/brooklyn-test-support/0.10.0-SNAPSHOT/brooklyn-test-support-0.10.0-SNAPSHOT-sources.jar
[JENKINS] Archiving <https://builds.apache.org/job/brooklyn-server-master/ws/test-support/target/brooklyn-test-support-0.10.0-SNAPSHOT-test-sources.jar>
to org.apache.brooklyn/brooklyn-test-support/0.10.0-SNAPSHOT/brooklyn-test-support-0.10.0-SNAPSHOT-test-sources.jar
[JENKINS] Archiving <https://builds.apache.org/job/brooklyn-server-master/ws/rest/rest-server/pom.xml>
to org.apache.brooklyn/brooklyn-rest-server/0.10.0-SNAPSHOT/brooklyn-rest-server-0.10.0-SNAPSHOT.pom
[JENKINS] Archiving <https://builds.apache.org/job/brooklyn-server-master/ws/api/pom.xml>
to org.apache.brooklyn/brooklyn-api/0.10.0-SNAPSHOT/brooklyn-api-0.10.0-SNAPSHOT.pom
[JENKINS] Archiving <https://builds.apache.org/job/brooklyn-server-master/ws/api/target/brooklyn-api-0.10.0-SNAPSHOT.jar>
to org.apache.brooklyn/brooklyn-api/0.10.0-SNAPSHOT/brooklyn-api-0.10.0-SNAPSHOT.jar
[JENKINS] Archiving <https://builds.apache.org/job/brooklyn-server-master/ws/api/target/brooklyn-api-0.10.0-SNAPSHOT-sources.jar>
to org.apache.brooklyn/brooklyn-api/0.10.0-SNAPSHOT/brooklyn-api-0.10.0-SNAPSHOT-sources.jar
[JENKINS] Archiving <https://builds.apache.org/job/brooklyn-server-master/ws/api/target/brooklyn-api-0.10.0-SNAPSHOT-test-sources.jar>
to org.apache.brooklyn/brooklyn-api/0.10.0-SNAPSHOT/brooklyn-api-0.10.0-SNAPSHOT-test-sources.jar
Compressed 287.90 KB of artifacts by 33.3% relative to #343
[JENKINS] Archiving <https://builds.apache.org/job/brooklyn-server-master/ws/pom.xml>
to org.apache.brooklyn/brooklyn-server/0.10.0-SNAPSHOT/brooklyn-server-0.10.0-SNAPSHOT.pom
[JENKINS] Archiving <https://builds.apache.org/job/brooklyn-server-master/ws/locations/jclouds/pom.xml>
to org.apache.brooklyn/brooklyn-locations-jclouds/0.10.0-SNAPSHOT/brooklyn-locations-jclouds-0.10.0-SNAPSHOT.pom
[JENKINS] Archiving <https://builds.apache.org/job/brooklyn-server-master/ws/utils/common/pom.xml>
to org.apache.brooklyn/brooklyn-utils-common/0.10.0-SNAPSHOT/brooklyn-utils-common-0.10.0-SNAPSHOT.pom
[JENKINS] Archiving <https://builds.apache.org/job/brooklyn-server-master/ws/utils/common/target/brooklyn-utils-common-0.10.0-SNAPSHOT.jar>
to org.apache.brooklyn/brooklyn-utils-common/0.10.0-SNAPSHOT/brooklyn-utils-common-0.10.0-SNAPSHOT.jar
[JENKINS] Archiving <https://builds.apache.org/job/brooklyn-server-master/ws/utils/common/target/brooklyn-utils-common-0.10.0-SNAPSHOT-tests.jar>
to org.apache.brooklyn/brooklyn-utils-common/0.10.0-SNAPSHOT/brooklyn-utils-common-0.10.0-SNAPSHOT-tests.jar
[JENKINS] Archiving <https://builds.apache.org/job/brooklyn-server-master/ws/utils/common/target/brooklyn-utils-common-0.10.0-SNAPSHOT-sources.jar>
to org.apache.brooklyn/brooklyn-utils-common/0.10.0-SNAPSHOT/brooklyn-utils-common-0.10.0-SNAPSHOT-sources.jar
[JENKINS] Archiving <https://builds.apache.org/job/brooklyn-server-master/ws/utils/common/target/brooklyn-utils-common-0.10.0-SNAPSHOT-test-sources.jar>
to org.apache.brooklyn/brooklyn-utils-common/0.10.0-SNAPSHOT/brooklyn-utils-common-0.10.0-SNAPSHOT-test-sources.jar
Compressed 1.36 MB of artifacts by 27.5% relative to #343
[JENKINS] Archiving <https://builds.apache.org/job/brooklyn-server-master/ws/karaf/features/pom.xml>
to org.apache.brooklyn/brooklyn-features/0.10.0-SNAPSHOT/brooklyn-features-0.10.0-SNAPSHOT.pom
[JENKINS] Archiving <https://builds.apache.org/job/brooklyn-server-master/ws/rest/rest-api/pom.xml>
to org.apache.brooklyn/brooklyn-rest-api/0.10.0-SNAPSHOT/brooklyn-rest-api-0.10.0-SNAPSHOT.pom
[JENKINS] Archiving <https://builds.apache.org/job/brooklyn-server-master/ws/utils/jmx/jmxrmi-agent/pom.xml>
to org.apache.brooklyn/brooklyn-jmxrmi-agent/0.10.0-SNAPSHOT/brooklyn-jmxrmi-agent-0.10.0-SNAPSHOT.pom
[JENKINS] Archiving <https://builds.apache.org/job/brooklyn-server-master/ws/policy/pom.xml>
to org.apache.brooklyn/brooklyn-policy/0.10.0-SNAPSHOT/brooklyn-policy-0.10.0-SNAPSHOT.pom
[JENKINS] Archiving <https://builds.apache.org/job/brooklyn-server-master/ws/karaf/init/pom.xml>
to org.apache.brooklyn/brooklyn-karaf-init/0.10.0-SNAPSHOT/brooklyn-karaf-init-0.10.0-SNAPSHOT.pom
[JENKINS] Archiving <https://builds.apache.org/job/brooklyn-server-master/ws/karaf/commands/pom.xml>
to org.apache.brooklyn/brooklyn-commands/0.10.0-SNAPSHOT/brooklyn-commands-0.10.0-SNAPSHOT.pom
[JENKINS] Archiving <https://builds.apache.org/job/brooklyn-server-master/ws/storage/hazelcast/pom.xml>
to org.apache.brooklyn/brooklyn-storage-hazelcast/0.10.0-SNAPSHOT/brooklyn-storage-hazelcast-0.10.0-SNAPSHOT.pom
[JENKINS] Archiving <https://builds.apache.org/job/brooklyn-server-master/ws/logging/logback-includes/pom.xml>
to org.apache.brooklyn/brooklyn-logback-includes/0.10.0-SNAPSHOT/brooklyn-logback-includes-0.10.0-SNAPSHOT.pom
[JENKINS] Archiving <https://builds.apache.org/job/brooklyn-server-master/ws/logging/logback-includes/target/brooklyn-logback-includes-0.10.0-SNAPSHOT.jar>
to org.apache.brooklyn/brooklyn-logback-includes/0.10.0-SNAPSHOT/brooklyn-logback-includes-0.10.0-SNAPSHOT.jar
[JENKINS] Archiving <https://builds.apache.org/job/brooklyn-server-master/ws/logging/logback-includes/target/brooklyn-logback-includes-0.10.0-SNAPSHOT-sources.jar>
to org.apache.brooklyn/brooklyn-logback-includes/0.10.0-SNAPSHOT/brooklyn-logback-includes-0.10.0-SNAPSHOT-sources.jar
[JENKINS] Archiving <https://builds.apache.org/job/brooklyn-server-master/ws/logging/logback-includes/target/brooklyn-logback-includes-0.10.0-SNAPSHOT-test-sources.jar>
to org.apache.brooklyn/brooklyn-logback-includes/0.10.0-SNAPSHOT/brooklyn-logback-includes-0.10.0-SNAPSHOT-test-sources.jar
[JENKINS] Archiving <https://builds.apache.org/job/brooklyn-server-master/ws/rest/rest-resources/pom.xml>
to org.apache.brooklyn/brooklyn-rest-resources/0.10.0-SNAPSHOT/brooklyn-rest-resources-0.10.0-SNAPSHOT.pom
[JENKINS] Archiving <https://builds.apache.org/job/brooklyn-server-master/ws/utils/jmx/jmxmp-ssl-agent/pom.xml>
to org.apache.brooklyn/brooklyn-jmxmp-agent/0.10.0-SNAPSHOT/brooklyn-jmxmp-agent-0.10.0-SNAPSHOT.pom
[JENKINS] Archiving <https://builds.apache.org/job/brooklyn-server-master/ws/parent/pom.xml>
to org.apache.brooklyn/brooklyn-parent/0.10.0-SNAPSHOT/brooklyn-parent-0.10.0-SNAPSHOT.pom
Compressed 81.77 KB of artifacts by 78.3% relative to #343
[JENKINS] Archiving <https://builds.apache.org/job/brooklyn-server-master/ws/software/winrm/pom.xml>
to org.apache.brooklyn/brooklyn-software-winrm/0.10.0-SNAPSHOT/brooklyn-software-winrm-0.10.0-SNAPSHOT.pom
channel stopped

Mime
View raw message