brooklyn-dev mailing list archives

Site index · List index
Message view « Date » · « Thread »
Top « Date » · « Thread »
From Apache Jenkins Server <jenk...@builds.apache.org>
Subject Build failed in Jenkins: brooklyn-server-master #236
Date Mon, 29 Aug 2016 10:43:51 GMT
See <https://builds.apache.org/job/brooklyn-server-master/236/changes>

Changes:

[aled.sage] BROOKLYN-338: BrooklynApi fixes for karaf

------------------------------------------
[...truncated 23579 lines...]
2016-08-29 10:43:19,356 INFO  Rebinding from /tmp/RebindEnricherTest-PENc for master Jy9uZB0y...
2016-08-29 10:43:19,377 INFO  Rebind complete (MASTER) in 35ms: 1 app, 1 entity, 0 locations,
0 policies, 1 enricher, 0 feeds, 0 catalog items
2016-08-29 10:43:19,383 INFO  TESTNG PASSED: "Surefire test" - org.apache.brooklyn.policy.enricher.RebindEnricherTest.testTimeWeightedDeltaEnricher()
finished in 49 ms
2016-08-29 10:43:19,383 INFO  TESTNG INVOKING CONFIGURATION: "Surefire test" - @AfterMethod
org.apache.brooklyn.policy.enricher.RebindEnricherTest.tearDown()
2016-08-29 10:43:19,395 INFO  TESTNG PASSED CONFIGURATION: "Surefire test" - @AfterMethod
org.apache.brooklyn.policy.enricher.RebindEnricherTest.tearDown() finished in 12 ms
2016-08-29 10:43:19,396 INFO  TESTNG INVOKING CONFIGURATION: "Surefire test" - @BeforeMethod
org.apache.brooklyn.policy.ha.ServiceFailureDetectorTest.setUp()
2016-08-29 10:43:19,431 INFO  TESTNG PASSED CONFIGURATION: "Surefire test" - @BeforeMethod
org.apache.brooklyn.policy.ha.ServiceFailureDetectorTest.setUp() finished in 35 ms
2016-08-29 10:43:19,431 INFO  TESTNG INVOKING: "Surefire test" - org.apache.brooklyn.policy.ha.ServiceFailureDetectorTest.testDisablingOnFire()
2016-08-29 10:43:19,433 WARN  Setting TestEntityImpl{id=hy1t4x33ue} on-fire due to problems
when expected running, up=false, not-up-indicators: null
2016-08-29 10:43:19,433 INFO  TESTNG PASSED: "Surefire test" - org.apache.brooklyn.policy.ha.ServiceFailureDetectorTest.testDisablingOnFire()
finished in 2 ms
2016-08-29 10:43:19,433 INFO  TESTNG INVOKING CONFIGURATION: "Surefire test" - @AfterMethod
org.apache.brooklyn.policy.ha.ServiceFailureDetectorTest.tearDown()
2016-08-29 10:43:19,444 INFO  TESTNG PASSED CONFIGURATION: "Surefire test" - @AfterMethod
org.apache.brooklyn.policy.ha.ServiceFailureDetectorTest.tearDown() finished in 11 ms
2016-08-29 10:43:19,445 INFO  TESTNG INVOKING CONFIGURATION: "Surefire test" - @BeforeMethod
org.apache.brooklyn.policy.ha.ServiceFailureDetectorTest.setUp()
2016-08-29 10:43:19,480 INFO  TESTNG PASSED CONFIGURATION: "Surefire test" - @BeforeMethod
org.apache.brooklyn.policy.ha.ServiceFailureDetectorTest.setUp() finished in 35 ms
2016-08-29 10:43:19,480 INFO  TESTNG INVOKING: "Surefire test" - org.apache.brooklyn.policy.ha.ServiceFailureDetectorTest.testDisablingPreviouslyUpRequirementForEntityFailed()
2016-08-29 10:43:19,685 WARN  Service is not up when setting running on TestEntityImpl{id=h2zagxz2pb};
delayed 203ms but Sensor: service.isUp (java.lang.Boolean) did not recover from false; not-up-indicators=null
2016-08-29 10:43:19,685 WARN  Setting TestEntityImpl{id=h2zagxz2pb} on-fire due to problems
when expected running, up=false, not-up-indicators: null
2016-08-29 10:43:19,688 INFO  TESTNG PASSED: "Surefire test" - org.apache.brooklyn.policy.ha.ServiceFailureDetectorTest.testDisablingPreviouslyUpRequirementForEntityFailed()
finished in 208 ms
2016-08-29 10:43:19,688 INFO  TESTNG INVOKING CONFIGURATION: "Surefire test" - @AfterMethod
org.apache.brooklyn.policy.ha.ServiceFailureDetectorTest.tearDown()
2016-08-29 10:43:19,694 INFO  TESTNG PASSED CONFIGURATION: "Surefire test" - @AfterMethod
org.apache.brooklyn.policy.ha.ServiceFailureDetectorTest.tearDown() finished in 6 ms
2016-08-29 10:43:19,694 INFO  TESTNG INVOKING CONFIGURATION: "Surefire test" - @BeforeMethod
org.apache.brooklyn.policy.ha.ServiceFailureDetectorTest.setUp()
SUREFIRE-859: [GC 376812K->161494K(768000K), 0.0291900 secs]
2016-08-29 10:43:19,739 WARN  Task[org.apache.brooklyn.policy.ha.ServiceFailureDetector$1@6482b69f]@g7D8bopH
was never submitted; did the code create it and forget to run it? ('cancel' the task to suppress
this message)
2016-08-29 10:43:19,762 INFO  TESTNG PASSED CONFIGURATION: "Surefire test" - @BeforeMethod
org.apache.brooklyn.policy.ha.ServiceFailureDetectorTest.setUp() finished in 68 ms
2016-08-29 10:43:19,762 INFO  TESTNG INVOKING: "Surefire test" - org.apache.brooklyn.policy.ha.ServiceFailureDetectorTest.testNotifiedOfFailure()
2016-08-29 10:43:19,763 WARN  Setting TestEntityImpl{id=i273qdvi6v} on-fire due to problems
when expected running, up=false, not-up-indicators: null
2016-08-29 10:43:19,764 INFO  TESTNG PASSED: "Surefire test" - org.apache.brooklyn.policy.ha.ServiceFailureDetectorTest.testNotifiedOfFailure()
finished in 2 ms
2016-08-29 10:43:19,765 INFO  TESTNG INVOKING CONFIGURATION: "Surefire test" - @AfterMethod
org.apache.brooklyn.policy.ha.ServiceFailureDetectorTest.tearDown()
2016-08-29 10:43:19,770 INFO  TESTNG PASSED CONFIGURATION: "Surefire test" - @AfterMethod
org.apache.brooklyn.policy.ha.ServiceFailureDetectorTest.tearDown() finished in 5 ms
2016-08-29 10:43:19,771 INFO  TESTNG INVOKING CONFIGURATION: "Surefire test" - @BeforeMethod
org.apache.brooklyn.policy.ha.ServiceFailureDetectorTest.setUp()
2016-08-29 10:43:19,805 INFO  TESTNG PASSED CONFIGURATION: "Surefire test" - @BeforeMethod
org.apache.brooklyn.policy.ha.ServiceFailureDetectorTest.setUp() finished in 35 ms
2016-08-29 10:43:19,806 INFO  TESTNG INVOKING: "Surefire test" - org.apache.brooklyn.policy.ha.ServiceFailureDetectorTest.testNotifiedOfFailureOnProblem()
2016-08-29 10:43:19,807 WARN  Setting TestEntityImpl{id=i0ce8so3xx} on-fire due to problems
when expected running, up=true, problems: {test=foo}
2016-08-29 10:43:19,808 INFO  TESTNG PASSED: "Surefire test" - org.apache.brooklyn.policy.ha.ServiceFailureDetectorTest.testNotifiedOfFailureOnProblem()
finished in 2 ms
2016-08-29 10:43:19,809 INFO  TESTNG INVOKING CONFIGURATION: "Surefire test" - @AfterMethod
org.apache.brooklyn.policy.ha.ServiceFailureDetectorTest.tearDown()
2016-08-29 10:43:19,814 INFO  TESTNG PASSED CONFIGURATION: "Surefire test" - @AfterMethod
org.apache.brooklyn.policy.ha.ServiceFailureDetectorTest.tearDown() finished in 5 ms
2016-08-29 10:43:19,814 INFO  TESTNG INVOKING CONFIGURATION: "Surefire test" - @BeforeMethod
org.apache.brooklyn.policy.ha.ServiceFailureDetectorTest.setUp()
2016-08-29 10:43:19,851 INFO  TESTNG PASSED CONFIGURATION: "Surefire test" - @BeforeMethod
org.apache.brooklyn.policy.ha.ServiceFailureDetectorTest.setUp() finished in 37 ms
2016-08-29 10:43:19,851 INFO  TESTNG INVOKING: "Surefire test" - org.apache.brooklyn.policy.ha.ServiceFailureDetectorTest.testNotifiedOfFailureOnStateOnFire()
2016-08-29 10:43:19,853 INFO  TESTNG PASSED: "Surefire test" - org.apache.brooklyn.policy.ha.ServiceFailureDetectorTest.testNotifiedOfFailureOnStateOnFire()
finished in 2 ms
2016-08-29 10:43:19,853 INFO  TESTNG INVOKING CONFIGURATION: "Surefire test" - @AfterMethod
org.apache.brooklyn.policy.ha.ServiceFailureDetectorTest.tearDown()
2016-08-29 10:43:19,858 INFO  TESTNG PASSED CONFIGURATION: "Surefire test" - @AfterMethod
org.apache.brooklyn.policy.ha.ServiceFailureDetectorTest.tearDown() finished in 5 ms
2016-08-29 10:43:19,858 INFO  TESTNG INVOKING CONFIGURATION: "Surefire test" - @BeforeMethod
org.apache.brooklyn.policy.ha.ServiceFailureDetectorTest.setUp()
2016-08-29 10:43:19,889 INFO  TESTNG PASSED CONFIGURATION: "Surefire test" - @BeforeMethod
org.apache.brooklyn.policy.ha.ServiceFailureDetectorTest.setUp() finished in 31 ms
2016-08-29 10:43:19,890 INFO  TESTNG INVOKING: "Surefire test" - org.apache.brooklyn.policy.ha.ServiceFailureDetectorTest.testNotifiedOfRecovery()
2016-08-29 10:43:19,891 WARN  Setting TestEntityImpl{id=si7hgxrx4z} on-fire due to problems
when expected running, up=false, not-up-indicators: null
2016-08-29 10:43:19,893 INFO  TESTNG PASSED: "Surefire test" - org.apache.brooklyn.policy.ha.ServiceFailureDetectorTest.testNotifiedOfRecovery()
finished in 4 ms
2016-08-29 10:43:19,894 INFO  TESTNG INVOKING CONFIGURATION: "Surefire test" - @AfterMethod
org.apache.brooklyn.policy.ha.ServiceFailureDetectorTest.tearDown()
2016-08-29 10:43:19,899 INFO  TESTNG PASSED CONFIGURATION: "Surefire test" - @AfterMethod
org.apache.brooklyn.policy.ha.ServiceFailureDetectorTest.tearDown() finished in 5 ms
2016-08-29 10:43:19,900 INFO  TESTNG INVOKING CONFIGURATION: "Surefire test" - @BeforeMethod
org.apache.brooklyn.policy.ha.ServiceFailureDetectorTest.setUp()
2016-08-29 10:43:19,932 INFO  TESTNG PASSED CONFIGURATION: "Surefire test" - @BeforeMethod
org.apache.brooklyn.policy.ha.ServiceFailureDetectorTest.setUp() finished in 32 ms
2016-08-29 10:43:19,932 INFO  TESTNG INVOKING: "Surefire test" - org.apache.brooklyn.policy.ha.ServiceFailureDetectorTest.testNotifiedOfRecoveryFromProblems()
2016-08-29 10:43:19,934 WARN  Setting TestEntityImpl{id=i4mbvwuhjv} on-fire due to problems
when expected running, up=true, problems: {test=foo}
2016-08-29 10:43:19,936 INFO  TESTNG PASSED: "Surefire test" - org.apache.brooklyn.policy.ha.ServiceFailureDetectorTest.testNotifiedOfRecoveryFromProblems()
finished in 4 ms
2016-08-29 10:43:19,937 INFO  TESTNG INVOKING CONFIGURATION: "Surefire test" - @AfterMethod
org.apache.brooklyn.policy.ha.ServiceFailureDetectorTest.tearDown()
2016-08-29 10:43:19,941 INFO  TESTNG PASSED CONFIGURATION: "Surefire test" - @AfterMethod
org.apache.brooklyn.policy.ha.ServiceFailureDetectorTest.tearDown() finished in 5 ms
2016-08-29 10:43:19,941 INFO  TESTNG INVOKING CONFIGURATION: "Surefire test" - @BeforeMethod
org.apache.brooklyn.policy.ha.ServiceFailureDetectorTest.setUp()
2016-08-29 10:43:19,971 INFO  TESTNG PASSED CONFIGURATION: "Surefire test" - @BeforeMethod
org.apache.brooklyn.policy.ha.ServiceFailureDetectorTest.setUp() finished in 30 ms
2016-08-29 10:43:19,971 INFO  TESTNG INVOKING: "Surefire test" - org.apache.brooklyn.policy.ha.ServiceFailureDetectorTest.testReportsFailureWhenAlreadyDownOnRegisteringPolicy()
2016-08-29 10:43:20,175 WARN  Service is not up when setting running on TestEntityImpl{id=bnyfc5g80d};
delayed 203ms but Sensor: service.isUp (java.lang.Boolean) did not recover from null; not-up-indicators=null
2016-08-29 10:43:20,175 WARN  Setting TestEntityImpl{id=bnyfc5g80d} on-fire due to problems
when expected running, up=null, not-up-indicators: null
2016-08-29 10:43:20,180 INFO  TESTNG PASSED: "Surefire test" - org.apache.brooklyn.policy.ha.ServiceFailureDetectorTest.testReportsFailureWhenAlreadyDownOnRegisteringPolicy()
finished in 209 ms
2016-08-29 10:43:20,181 INFO  TESTNG INVOKING CONFIGURATION: "Surefire test" - @AfterMethod
org.apache.brooklyn.policy.ha.ServiceFailureDetectorTest.tearDown()
2016-08-29 10:43:20,190 INFO  TESTNG PASSED CONFIGURATION: "Surefire test" - @AfterMethod
org.apache.brooklyn.policy.ha.ServiceFailureDetectorTest.tearDown() finished in 10 ms
2016-08-29 10:43:20,191 INFO  TESTNG INVOKING CONFIGURATION: "Surefire test" - @BeforeMethod
org.apache.brooklyn.policy.ha.ServiceFailureDetectorTest.setUp()
2016-08-29 10:43:20,227 INFO  TESTNG PASSED CONFIGURATION: "Surefire test" - @BeforeMethod
org.apache.brooklyn.policy.ha.ServiceFailureDetectorTest.setUp() finished in 36 ms
2016-08-29 10:43:20,227 INFO  TESTNG INVOKING: "Surefire test" - org.apache.brooklyn.policy.ha.ServiceFailureDetectorTest.testReportsFailureWhenAlreadyOnFireOnRegisteringPolicy()
2016-08-29 10:43:20,229 INFO  TESTNG PASSED: "Surefire test" - org.apache.brooklyn.policy.ha.ServiceFailureDetectorTest.testReportsFailureWhenAlreadyOnFireOnRegisteringPolicy()
finished in 2 ms
2016-08-29 10:43:20,229 INFO  TESTNG INVOKING CONFIGURATION: "Surefire test" - @AfterMethod
org.apache.brooklyn.policy.ha.ServiceFailureDetectorTest.tearDown()
2016-08-29 10:43:20,234 INFO  TESTNG PASSED CONFIGURATION: "Surefire test" - @AfterMethod
org.apache.brooklyn.policy.ha.ServiceFailureDetectorTest.tearDown() finished in 5 ms
2016-08-29 10:43:20,324 INFO  TESTNG 
===============================================
    Surefire test
    Tests run: 226, Failures: 1, Skips: 0
===============================================
2016-08-29 10:43:20,324 INFO  BrooklynLeakListener.onFinish attempting to terminate all extant
ManagementContexts: name=Surefire test; includedGroups=[]; excludedGroups=[Integration, Live-sanity,
Acceptance, Live, Broken, WIP]; suiteName=Surefire suite; outDir=<https://builds.apache.org/job/brooklyn-server-master/ws/policy/target/surefire-reports/Surefire>
suite: no org.apache.brooklyn.core.management.internal.LocalManagementContext available, so
skipped
Tests run: 226, Failures: 1, Errors: 0, Skipped: 0, Time elapsed: 104.494 sec <<<
FAILURE! - in TestSuite
testLoadBalancingQuickTest(org.apache.brooklyn.policy.loadbalancing.LoadBalancingPolicySoakTest)
 Time elapsed: 40.21 sec  <<< FAILURE!
org.apache.brooklyn.util.exceptions.PropagatedRuntimeException: failed succeeds-eventually,
89 attempts, 40001ms elapsed: AssertionError: containers=[MockContainer[container-1], MockContainer[container-2],
MockContainer[container-3], MockContainer[container-4.1.1], MockContainer[container-5]]; containerRates=[850.0,
290.0, 0.0, 0.0, 285.0]; itemDistributionByContainer={MockContainer[container-1]=[MockItem[item-2],
MockItem[item-5], MockItem[item-3.1.1]], MockContainer[container-2]=[MockItem[item-1]], MockContainer[container-3]=[],
MockContainer[container-4.1.1]=[], MockContainer[container-5]=[MockItem[item-4]]}; itemDistributionByItem={MockItem[item-1]=MockContainer[container-2],
MockItem[item-2]=MockContainer[container-1], MockItem[item-3.1.1]=MockContainer[container-1],
MockItem[item-4]=MockContainer[container-5], MockItem[item-5]=MockContainer[container-1]};
model=Container 'MockContainer[container-5]': 
	Item 'MockItem[item-4]' (285.0)
Container 'MockContainer[container-2]': 
	Item 'MockItem[item-1]' (290.0)
Container 'MockContainer[container-1]': 
	Item 'MockItem[item-2]' (284.0)
	Item 'MockItem[item-3.1.1]' (282.0)
	Item 'MockItem[item-5]' (284.0)
Container 'MockContainer[container-4]': 
Container 'MockContainer[container-4.1.1]': 
Container 'MockContainer[container-3]': 
; totalMoves=20; lastMoveTime=2016-08-29 10:42:13.650; itemRates=[290, 284, 282, 285, 284]
expected [true] but found [false]
	at org.testng.Assert.fail(Assert.java:94)
	at org.testng.Assert.failNotEquals(Assert.java:494)
	at org.testng.Assert.assertTrue(Assert.java:42)
	at org.apache.brooklyn.policy.loadbalancing.LoadBalancingPolicySoakTest$1.run(LoadBalancingPolicySoakTest.java:210)
	at org.apache.brooklyn.test.Asserts$RunnableAdapter.call(Asserts.java:1285)
	at org.apache.brooklyn.test.Asserts.succeedsEventually(Asserts.java:934)
	at org.apache.brooklyn.test.Asserts.succeedsEventually(Asserts.java:858)
	at org.apache.brooklyn.policy.loadbalancing.LoadBalancingPolicySoakTest.runLoadBalancingSoakTest(LoadBalancingPolicySoakTest.java:178)
	at org.apache.brooklyn.policy.loadbalancing.LoadBalancingPolicySoakTest.testLoadBalancingQuickTest(LoadBalancingPolicySoakTest.java:57)


Results :

Failed tests: 
  LoadBalancingPolicySoakTest.testLoadBalancingQuickTest:57->runLoadBalancingSoakTest:178
ยป PropagatedRuntime

Tests run: 226, Failures: 1, Errors: 0, Skipped: 0

[JENKINS] Recording test results
[INFO] ------------------------------------------------------------------------
[INFO] Reactor Summary:
[INFO] 
[INFO] Brooklyn Server Root ............................... SUCCESS [  3.995 s]
[INFO] Brooklyn Parent Project ............................ SUCCESS [  8.082 s]
[INFO] Brooklyn Test Support Utilities .................... SUCCESS [  8.570 s]
[INFO] Brooklyn Logback Includable Configuration .......... SUCCESS [  2.655 s]
[INFO] Brooklyn Common Utilities .......................... SUCCESS [ 26.242 s]
[INFO] Brooklyn API ....................................... SUCCESS [  3.896 s]
[INFO] CAMP Server Parent Project ......................... SUCCESS [  1.078 s]
[INFO] CAMP Base .......................................... SUCCESS [  4.627 s]
[INFO] Brooklyn Test Support .............................. SUCCESS [  3.401 s]
[INFO] Brooklyn REST Swagger Apidoc Utilities ............. SUCCESS [  3.824 s]
[INFO] Brooklyn Logback Configuration ..................... SUCCESS [  2.386 s]
[INFO] CAMP Server ........................................ SUCCESS [  8.397 s]
[INFO] Brooklyn Felix Runtime ............................. SUCCESS [ 24.967 s]
[INFO] Brooklyn Groovy Utilities .......................... SUCCESS [  2.653 s]
[INFO] Brooklyn Core ...................................... SUCCESS [03:23 min]
[INFO] Brooklyn Policies .................................. FAILURE [01:50 min]
[INFO] Brooklyn WinRM Software Entities ................... SKIPPED
[INFO] Brooklyn Secure JMXMP Agent ........................ SKIPPED
[INFO] Brooklyn JMX RMI Agent ............................. SKIPPED
[INFO] Brooklyn Jclouds Location Targets .................. SKIPPED
[INFO] Brooklyn Software Base ............................. SKIPPED
[INFO] Brooklyn CAMP REST API ............................. SKIPPED
[INFO] Brooklyn Hazelcast Storage ......................... SKIPPED
[INFO] Brooklyn Launcher Common ........................... SKIPPED
[INFO] Brooklyn REST API .................................. SKIPPED
[INFO] Brooklyn REST Resources ............................ SKIPPED
[INFO] Brooklyn REST Server ............................... SKIPPED
[INFO] Brooklyn Launcher .................................. SKIPPED
[INFO] Brooklyn Command Line Interface .................... SKIPPED
[INFO] Brooklyn REST Client ............................... SKIPPED
[INFO] Brooklyn Test Framework ............................ SKIPPED
[INFO] Brooklyn OSGi init ................................. SKIPPED
[INFO] Brooklyn Karaf ..................................... SKIPPED
[INFO] Jetty config fragment .............................. SKIPPED
[INFO] Brooklyn Karaf Features ............................ SKIPPED
[INFO] Brooklyn Karaf Shell Commands ...................... SKIPPED
[INFO] ------------------------------------------------------------------------
[INFO] BUILD FAILURE
[INFO] ------------------------------------------------------------------------
[INFO] Total time: 07:25 min
[INFO] Finished at: 2016-08-29T10:43:28+00:00
[INFO] Final Memory: 95M/654M
[INFO] ------------------------------------------------------------------------
Waiting for Jenkins to finish collecting data
[ERROR] Failed to execute goal org.apache.maven.plugins:maven-surefire-plugin:2.18.1:test
(default-test) on project brooklyn-policy: There are test failures.
[ERROR] 
[ERROR] Please refer to <https://builds.apache.org/job/brooklyn-server-master/ws/policy/target/surefire-reports>
for the individual test results.
[ERROR] -> [Help 1]
[ERROR] 
[ERROR] To see the full stack trace of the errors, re-run Maven with the -e switch.
[ERROR] Re-run Maven using the -X switch to enable full debug logging.
[ERROR] 
[ERROR] For more information about the errors and possible solutions, please read the following
articles:
[ERROR] [Help 1] http://cwiki.apache.org/confluence/display/MAVEN/MojoFailureException
[ERROR] 
[ERROR] After correcting the problems, you can resume the build with the command
[ERROR]   mvn <goals> -rf :brooklyn-policy
[JENKINS] Archiving <https://builds.apache.org/job/brooklyn-server-master/ws/camp/pom.xml>
to org.apache.brooklyn.camp/camp-parent/0.10.0-SNAPSHOT/camp-parent-0.10.0-SNAPSHOT.pom
[JENKINS] Archiving <https://builds.apache.org/job/brooklyn-server-master/ws/utils/rt-felix/pom.xml>
to org.apache.brooklyn/brooklyn-rt-felix/0.10.0-SNAPSHOT/brooklyn-rt-felix-0.10.0-SNAPSHOT.pom
[JENKINS] Archiving <https://builds.apache.org/job/brooklyn-server-master/ws/utils/rt-felix/target/brooklyn-rt-felix-0.10.0-SNAPSHOT.jar>
to org.apache.brooklyn/brooklyn-rt-felix/0.10.0-SNAPSHOT/brooklyn-rt-felix-0.10.0-SNAPSHOT.jar
[JENKINS] Archiving <https://builds.apache.org/job/brooklyn-server-master/ws/utils/rt-felix/target/brooklyn-rt-felix-0.10.0-SNAPSHOT-tests.jar>
to org.apache.brooklyn/brooklyn-rt-felix/0.10.0-SNAPSHOT/brooklyn-rt-felix-0.10.0-SNAPSHOT-tests.jar
[JENKINS] Archiving <https://builds.apache.org/job/brooklyn-server-master/ws/utils/rt-felix/target/brooklyn-rt-felix-0.10.0-SNAPSHOT-sources.jar>
to org.apache.brooklyn/brooklyn-rt-felix/0.10.0-SNAPSHOT/brooklyn-rt-felix-0.10.0-SNAPSHOT-sources.jar
[JENKINS] Archiving <https://builds.apache.org/job/brooklyn-server-master/ws/utils/rt-felix/target/brooklyn-rt-felix-0.10.0-SNAPSHOT-test-sources.jar>
to org.apache.brooklyn/brooklyn-rt-felix/0.10.0-SNAPSHOT/brooklyn-rt-felix-0.10.0-SNAPSHOT-test-sources.jar
[JENKINS] Archiving <https://builds.apache.org/job/brooklyn-server-master/ws/test-framework/pom.xml>
to org.apache.brooklyn/brooklyn-test-framework/0.10.0-SNAPSHOT/brooklyn-test-framework-0.10.0-SNAPSHOT.pom
[JENKINS] Archiving <https://builds.apache.org/job/brooklyn-server-master/ws/core/pom.xml>
to org.apache.brooklyn/brooklyn-core/0.10.0-SNAPSHOT/brooklyn-core-0.10.0-SNAPSHOT.pom
[JENKINS] Archiving <https://builds.apache.org/job/brooklyn-server-master/ws/core/target/brooklyn-core-0.10.0-SNAPSHOT.jar>
to org.apache.brooklyn/brooklyn-core/0.10.0-SNAPSHOT/brooklyn-core-0.10.0-SNAPSHOT.jar
[JENKINS] Archiving <https://builds.apache.org/job/brooklyn-server-master/ws/core/target/brooklyn-core-0.10.0-SNAPSHOT-tests.jar>
to org.apache.brooklyn/brooklyn-core/0.10.0-SNAPSHOT/brooklyn-core-0.10.0-SNAPSHOT-tests.jar
[JENKINS] Archiving <https://builds.apache.org/job/brooklyn-server-master/ws/core/target/brooklyn-core-0.10.0-SNAPSHOT-sources.jar>
to org.apache.brooklyn/brooklyn-core/0.10.0-SNAPSHOT/brooklyn-core-0.10.0-SNAPSHOT-sources.jar
[JENKINS] Archiving <https://builds.apache.org/job/brooklyn-server-master/ws/core/target/brooklyn-core-0.10.0-SNAPSHOT-test-sources.jar>
to org.apache.brooklyn/brooklyn-core/0.10.0-SNAPSHOT/brooklyn-core-0.10.0-SNAPSHOT-test-sources.jar
[JENKINS] Archiving <https://builds.apache.org/job/brooklyn-server-master/ws/camp/camp-server/pom.xml>
to org.apache.brooklyn.camp/camp-server/0.10.0-SNAPSHOT/camp-server-0.10.0-SNAPSHOT.pom
[JENKINS] Archiving <https://builds.apache.org/job/brooklyn-server-master/ws/camp/camp-server/target/camp-server-0.10.0-SNAPSHOT.jar>
to org.apache.brooklyn.camp/camp-server/0.10.0-SNAPSHOT/camp-server-0.10.0-SNAPSHOT.jar
[JENKINS] Archiving <https://builds.apache.org/job/brooklyn-server-master/ws/camp/camp-server/target/camp-server-0.10.0-SNAPSHOT-tests.jar>
to org.apache.brooklyn.camp/camp-server/0.10.0-SNAPSHOT/camp-server-0.10.0-SNAPSHOT-tests.jar
[JENKINS] Archiving <https://builds.apache.org/job/brooklyn-server-master/ws/camp/camp-server/target/camp-server-0.10.0-SNAPSHOT-sources.jar>
to org.apache.brooklyn.camp/camp-server/0.10.0-SNAPSHOT/camp-server-0.10.0-SNAPSHOT-sources.jar
[JENKINS] Archiving <https://builds.apache.org/job/brooklyn-server-master/ws/camp/camp-server/target/camp-server-0.10.0-SNAPSHOT-test-sources.jar>
to org.apache.brooklyn.camp/camp-server/0.10.0-SNAPSHOT/camp-server-0.10.0-SNAPSHOT-test-sources.jar
[JENKINS] Archiving <https://builds.apache.org/job/brooklyn-server-master/ws/launcher/pom.xml>
to org.apache.brooklyn/brooklyn-launcher/0.10.0-SNAPSHOT/brooklyn-launcher-0.10.0-SNAPSHOT.pom
[JENKINS] Archiving <https://builds.apache.org/job/brooklyn-server-master/ws/karaf/pom.xml>
to org.apache.brooklyn/brooklyn-karaf/0.10.0-SNAPSHOT/brooklyn-karaf-0.10.0-SNAPSHOT.pom
[JENKINS] Archiving <https://builds.apache.org/job/brooklyn-server-master/ws/utils/test-support/pom.xml>
to org.apache.brooklyn/brooklyn-utils-test-support/0.10.0-SNAPSHOT/brooklyn-utils-test-support-0.10.0-SNAPSHOT.pom
[JENKINS] Archiving <https://builds.apache.org/job/brooklyn-server-master/ws/utils/test-support/target/brooklyn-utils-test-support-0.10.0-SNAPSHOT.jar>
to org.apache.brooklyn/brooklyn-utils-test-support/0.10.0-SNAPSHOT/brooklyn-utils-test-support-0.10.0-SNAPSHOT.jar
[JENKINS] Archiving <https://builds.apache.org/job/brooklyn-server-master/ws/utils/test-support/target/brooklyn-utils-test-support-0.10.0-SNAPSHOT-sources.jar>
to org.apache.brooklyn/brooklyn-utils-test-support/0.10.0-SNAPSHOT/brooklyn-utils-test-support-0.10.0-SNAPSHOT-sources.jar
[JENKINS] Archiving <https://builds.apache.org/job/brooklyn-server-master/ws/utils/test-support/target/brooklyn-utils-test-support-0.10.0-SNAPSHOT-test-sources.jar>
to org.apache.brooklyn/brooklyn-utils-test-support/0.10.0-SNAPSHOT/brooklyn-utils-test-support-0.10.0-SNAPSHOT-test-sources.jar
[JENKINS] Archiving <https://builds.apache.org/job/brooklyn-server-master/ws/software/base/pom.xml>
to org.apache.brooklyn/brooklyn-software-base/0.10.0-SNAPSHOT/brooklyn-software-base-0.10.0-SNAPSHOT.pom
[JENKINS] Archiving <https://builds.apache.org/job/brooklyn-server-master/ws/utils/groovy/pom.xml>
to org.apache.brooklyn/brooklyn-utils-groovy/0.10.0-SNAPSHOT/brooklyn-utils-groovy-0.10.0-SNAPSHOT.pom
[JENKINS] Archiving <https://builds.apache.org/job/brooklyn-server-master/ws/utils/groovy/target/brooklyn-utils-groovy-0.10.0-SNAPSHOT.jar>
to org.apache.brooklyn/brooklyn-utils-groovy/0.10.0-SNAPSHOT/brooklyn-utils-groovy-0.10.0-SNAPSHOT.jar
[JENKINS] Archiving <https://builds.apache.org/job/brooklyn-server-master/ws/utils/groovy/target/brooklyn-utils-groovy-0.10.0-SNAPSHOT-tests.jar>
to org.apache.brooklyn/brooklyn-utils-groovy/0.10.0-SNAPSHOT/brooklyn-utils-groovy-0.10.0-SNAPSHOT-tests.jar
[JENKINS] Archiving <https://builds.apache.org/job/brooklyn-server-master/ws/utils/groovy/target/brooklyn-utils-groovy-0.10.0-SNAPSHOT-sources.jar>
to org.apache.brooklyn/brooklyn-utils-groovy/0.10.0-SNAPSHOT/brooklyn-utils-groovy-0.10.0-SNAPSHOT-sources.jar
[JENKINS] Archiving <https://builds.apache.org/job/brooklyn-server-master/ws/utils/groovy/target/brooklyn-utils-groovy-0.10.0-SNAPSHOT-test-sources.jar>
to org.apache.brooklyn/brooklyn-utils-groovy/0.10.0-SNAPSHOT/brooklyn-utils-groovy-0.10.0-SNAPSHOT-test-sources.jar
[JENKINS] Archiving <https://builds.apache.org/job/brooklyn-server-master/ws/utils/rest-swagger/pom.xml>
to org.apache.brooklyn/brooklyn-utils-rest-swagger/0.10.0-SNAPSHOT/brooklyn-utils-rest-swagger-0.10.0-SNAPSHOT.pom
[JENKINS] Archiving <https://builds.apache.org/job/brooklyn-server-master/ws/utils/rest-swagger/target/brooklyn-utils-rest-swagger-0.10.0-SNAPSHOT.jar>
to org.apache.brooklyn/brooklyn-utils-rest-swagger/0.10.0-SNAPSHOT/brooklyn-utils-rest-swagger-0.10.0-SNAPSHOT.jar
[JENKINS] Archiving <https://builds.apache.org/job/brooklyn-server-master/ws/utils/rest-swagger/target/brooklyn-utils-rest-swagger-0.10.0-SNAPSHOT-sources.jar>
to org.apache.brooklyn/brooklyn-utils-rest-swagger/0.10.0-SNAPSHOT/brooklyn-utils-rest-swagger-0.10.0-SNAPSHOT-sources.jar
[JENKINS] Archiving <https://builds.apache.org/job/brooklyn-server-master/ws/utils/rest-swagger/target/brooklyn-utils-rest-swagger-0.10.0-SNAPSHOT-test-sources.jar>
to org.apache.brooklyn/brooklyn-utils-rest-swagger/0.10.0-SNAPSHOT/brooklyn-utils-rest-swagger-0.10.0-SNAPSHOT-test-sources.jar
[JENKINS] Archiving <https://builds.apache.org/job/brooklyn-server-master/ws/launcher-common/pom.xml>
to org.apache.brooklyn/brooklyn-launcher-common/0.10.0-SNAPSHOT/brooklyn-launcher-common-0.10.0-SNAPSHOT.pom
[JENKINS] Archiving <https://builds.apache.org/job/brooklyn-server-master/ws/camp/camp-base/pom.xml>
to org.apache.brooklyn.camp/camp-base/0.10.0-SNAPSHOT/camp-base-0.10.0-SNAPSHOT.pom
[JENKINS] Archiving <https://builds.apache.org/job/brooklyn-server-master/ws/camp/camp-base/target/camp-base-0.10.0-SNAPSHOT.jar>
to org.apache.brooklyn.camp/camp-base/0.10.0-SNAPSHOT/camp-base-0.10.0-SNAPSHOT.jar
[JENKINS] Archiving <https://builds.apache.org/job/brooklyn-server-master/ws/camp/camp-base/target/camp-base-0.10.0-SNAPSHOT-tests.jar>
to org.apache.brooklyn.camp/camp-base/0.10.0-SNAPSHOT/camp-base-0.10.0-SNAPSHOT-tests.jar
[JENKINS] Archiving <https://builds.apache.org/job/brooklyn-server-master/ws/camp/camp-base/target/camp-base-0.10.0-SNAPSHOT-sources.jar>
to org.apache.brooklyn.camp/camp-base/0.10.0-SNAPSHOT/camp-base-0.10.0-SNAPSHOT-sources.jar
[JENKINS] Archiving <https://builds.apache.org/job/brooklyn-server-master/ws/camp/camp-base/target/camp-base-0.10.0-SNAPSHOT-test-sources.jar>
to org.apache.brooklyn.camp/camp-base/0.10.0-SNAPSHOT/camp-base-0.10.0-SNAPSHOT-test-sources.jar
[JENKINS] Archiving <https://builds.apache.org/job/brooklyn-server-master/ws/rest/rest-client/pom.xml>
to org.apache.brooklyn/brooklyn-rest-client/0.10.0-SNAPSHOT/brooklyn-rest-client-0.10.0-SNAPSHOT.pom
[JENKINS] Archiving <https://builds.apache.org/job/brooklyn-server-master/ws/camp/camp-brooklyn/pom.xml>
to org.apache.brooklyn/brooklyn-camp/0.10.0-SNAPSHOT/brooklyn-camp-0.10.0-SNAPSHOT.pom
[JENKINS] Archiving <https://builds.apache.org/job/brooklyn-server-master/ws/karaf/jetty-config/pom.xml>
to org.apache.brooklyn/brooklyn-karaf-jetty-config/0.10.0-SNAPSHOT/brooklyn-karaf-jetty-config-0.10.0-SNAPSHOT.pom
[JENKINS] Archiving <https://builds.apache.org/job/brooklyn-server-master/ws/server-cli/pom.xml>
to org.apache.brooklyn/brooklyn-cli/0.10.0-SNAPSHOT/brooklyn-cli-0.10.0-SNAPSHOT.pom
[JENKINS] Archiving <https://builds.apache.org/job/brooklyn-server-master/ws/logging/logback-xml/pom.xml>
to org.apache.brooklyn/brooklyn-logback-xml/0.10.0-SNAPSHOT/brooklyn-logback-xml-0.10.0-SNAPSHOT.pom
[JENKINS] Archiving <https://builds.apache.org/job/brooklyn-server-master/ws/logging/logback-xml/target/brooklyn-logback-xml-0.10.0-SNAPSHOT.jar>
to org.apache.brooklyn/brooklyn-logback-xml/0.10.0-SNAPSHOT/brooklyn-logback-xml-0.10.0-SNAPSHOT.jar
[JENKINS] Archiving <https://builds.apache.org/job/brooklyn-server-master/ws/logging/logback-xml/target/brooklyn-logback-xml-0.10.0-SNAPSHOT-sources.jar>
to org.apache.brooklyn/brooklyn-logback-xml/0.10.0-SNAPSHOT/brooklyn-logback-xml-0.10.0-SNAPSHOT-sources.jar
[JENKINS] Archiving <https://builds.apache.org/job/brooklyn-server-master/ws/logging/logback-xml/target/brooklyn-logback-xml-0.10.0-SNAPSHOT-test-sources.jar>
to org.apache.brooklyn/brooklyn-logback-xml/0.10.0-SNAPSHOT/brooklyn-logback-xml-0.10.0-SNAPSHOT-test-sources.jar
[JENKINS] Archiving <https://builds.apache.org/job/brooklyn-server-master/ws/test-support/pom.xml>
to org.apache.brooklyn/brooklyn-test-support/0.10.0-SNAPSHOT/brooklyn-test-support-0.10.0-SNAPSHOT.pom
[JENKINS] Archiving <https://builds.apache.org/job/brooklyn-server-master/ws/test-support/target/brooklyn-test-support-0.10.0-SNAPSHOT.jar>
to org.apache.brooklyn/brooklyn-test-support/0.10.0-SNAPSHOT/brooklyn-test-support-0.10.0-SNAPSHOT.jar
[JENKINS] Archiving <https://builds.apache.org/job/brooklyn-server-master/ws/test-support/target/brooklyn-test-support-0.10.0-SNAPSHOT-sources.jar>
to org.apache.brooklyn/brooklyn-test-support/0.10.0-SNAPSHOT/brooklyn-test-support-0.10.0-SNAPSHOT-sources.jar
[JENKINS] Archiving <https://builds.apache.org/job/brooklyn-server-master/ws/test-support/target/brooklyn-test-support-0.10.0-SNAPSHOT-test-sources.jar>
to org.apache.brooklyn/brooklyn-test-support/0.10.0-SNAPSHOT/brooklyn-test-support-0.10.0-SNAPSHOT-test-sources.jar
[JENKINS] Archiving <https://builds.apache.org/job/brooklyn-server-master/ws/rest/rest-server/pom.xml>
to org.apache.brooklyn/brooklyn-rest-server/0.10.0-SNAPSHOT/brooklyn-rest-server-0.10.0-SNAPSHOT.pom
[JENKINS] Archiving <https://builds.apache.org/job/brooklyn-server-master/ws/api/pom.xml>
to org.apache.brooklyn/brooklyn-api/0.10.0-SNAPSHOT/brooklyn-api-0.10.0-SNAPSHOT.pom
[JENKINS] Archiving <https://builds.apache.org/job/brooklyn-server-master/ws/api/target/brooklyn-api-0.10.0-SNAPSHOT.jar>
to org.apache.brooklyn/brooklyn-api/0.10.0-SNAPSHOT/brooklyn-api-0.10.0-SNAPSHOT.jar
[JENKINS] Archiving <https://builds.apache.org/job/brooklyn-server-master/ws/api/target/brooklyn-api-0.10.0-SNAPSHOT-sources.jar>
to org.apache.brooklyn/brooklyn-api/0.10.0-SNAPSHOT/brooklyn-api-0.10.0-SNAPSHOT-sources.jar
[JENKINS] Archiving <https://builds.apache.org/job/brooklyn-server-master/ws/api/target/brooklyn-api-0.10.0-SNAPSHOT-test-sources.jar>
to org.apache.brooklyn/brooklyn-api/0.10.0-SNAPSHOT/brooklyn-api-0.10.0-SNAPSHOT-test-sources.jar
[JENKINS] Archiving <https://builds.apache.org/job/brooklyn-server-master/ws/pom.xml>
to org.apache.brooklyn/brooklyn-server/0.10.0-SNAPSHOT/brooklyn-server-0.10.0-SNAPSHOT.pom
[JENKINS] Archiving <https://builds.apache.org/job/brooklyn-server-master/ws/locations/jclouds/pom.xml>
to org.apache.brooklyn/brooklyn-locations-jclouds/0.10.0-SNAPSHOT/brooklyn-locations-jclouds-0.10.0-SNAPSHOT.pom
[JENKINS] Archiving <https://builds.apache.org/job/brooklyn-server-master/ws/utils/common/pom.xml>
to org.apache.brooklyn/brooklyn-utils-common/0.10.0-SNAPSHOT/brooklyn-utils-common-0.10.0-SNAPSHOT.pom
[JENKINS] Archiving <https://builds.apache.org/job/brooklyn-server-master/ws/utils/common/target/brooklyn-utils-common-0.10.0-SNAPSHOT.jar>
to org.apache.brooklyn/brooklyn-utils-common/0.10.0-SNAPSHOT/brooklyn-utils-common-0.10.0-SNAPSHOT.jar
[JENKINS] Archiving <https://builds.apache.org/job/brooklyn-server-master/ws/utils/common/target/brooklyn-utils-common-0.10.0-SNAPSHOT-tests.jar>
to org.apache.brooklyn/brooklyn-utils-common/0.10.0-SNAPSHOT/brooklyn-utils-common-0.10.0-SNAPSHOT-tests.jar
[JENKINS] Archiving <https://builds.apache.org/job/brooklyn-server-master/ws/utils/common/target/brooklyn-utils-common-0.10.0-SNAPSHOT-sources.jar>
to org.apache.brooklyn/brooklyn-utils-common/0.10.0-SNAPSHOT/brooklyn-utils-common-0.10.0-SNAPSHOT-sources.jar
[JENKINS] Archiving <https://builds.apache.org/job/brooklyn-server-master/ws/utils/common/target/brooklyn-utils-common-0.10.0-SNAPSHOT-test-sources.jar>
to org.apache.brooklyn/brooklyn-utils-common/0.10.0-SNAPSHOT/brooklyn-utils-common-0.10.0-SNAPSHOT-test-sources.jar
[JENKINS] Archiving <https://builds.apache.org/job/brooklyn-server-master/ws/karaf/features/pom.xml>
to org.apache.brooklyn/brooklyn-features/0.10.0-SNAPSHOT/brooklyn-features-0.10.0-SNAPSHOT.pom
[JENKINS] Archiving <https://builds.apache.org/job/brooklyn-server-master/ws/rest/rest-api/pom.xml>
to org.apache.brooklyn/brooklyn-rest-api/0.10.0-SNAPSHOT/brooklyn-rest-api-0.10.0-SNAPSHOT.pom
[JENKINS] Archiving <https://builds.apache.org/job/brooklyn-server-master/ws/utils/jmx/jmxrmi-agent/pom.xml>
to org.apache.brooklyn/brooklyn-jmxrmi-agent/0.10.0-SNAPSHOT/brooklyn-jmxrmi-agent-0.10.0-SNAPSHOT.pom
[JENKINS] Archiving <https://builds.apache.org/job/brooklyn-server-master/ws/policy/pom.xml>
to org.apache.brooklyn/brooklyn-policy/0.10.0-SNAPSHOT/brooklyn-policy-0.10.0-SNAPSHOT.pom
[JENKINS] Archiving <https://builds.apache.org/job/brooklyn-server-master/ws/karaf/init/pom.xml>
to org.apache.brooklyn/brooklyn-karaf-init/0.10.0-SNAPSHOT/brooklyn-karaf-init-0.10.0-SNAPSHOT.pom
[JENKINS] Archiving <https://builds.apache.org/job/brooklyn-server-master/ws/karaf/commands/pom.xml>
to org.apache.brooklyn/brooklyn-commands/0.10.0-SNAPSHOT/brooklyn-commands-0.10.0-SNAPSHOT.pom
[JENKINS] Archiving <https://builds.apache.org/job/brooklyn-server-master/ws/storage/hazelcast/pom.xml>
to org.apache.brooklyn/brooklyn-storage-hazelcast/0.10.0-SNAPSHOT/brooklyn-storage-hazelcast-0.10.0-SNAPSHOT.pom
[JENKINS] Archiving <https://builds.apache.org/job/brooklyn-server-master/ws/logging/logback-includes/pom.xml>
to org.apache.brooklyn/brooklyn-logback-includes/0.10.0-SNAPSHOT/brooklyn-logback-includes-0.10.0-SNAPSHOT.pom
[JENKINS] Archiving <https://builds.apache.org/job/brooklyn-server-master/ws/logging/logback-includes/target/brooklyn-logback-includes-0.10.0-SNAPSHOT.jar>
to org.apache.brooklyn/brooklyn-logback-includes/0.10.0-SNAPSHOT/brooklyn-logback-includes-0.10.0-SNAPSHOT.jar
[JENKINS] Archiving <https://builds.apache.org/job/brooklyn-server-master/ws/logging/logback-includes/target/brooklyn-logback-includes-0.10.0-SNAPSHOT-sources.jar>
to org.apache.brooklyn/brooklyn-logback-includes/0.10.0-SNAPSHOT/brooklyn-logback-includes-0.10.0-SNAPSHOT-sources.jar
[JENKINS] Archiving <https://builds.apache.org/job/brooklyn-server-master/ws/logging/logback-includes/target/brooklyn-logback-includes-0.10.0-SNAPSHOT-test-sources.jar>
to org.apache.brooklyn/brooklyn-logback-includes/0.10.0-SNAPSHOT/brooklyn-logback-includes-0.10.0-SNAPSHOT-test-sources.jar
[JENKINS] Archiving <https://builds.apache.org/job/brooklyn-server-master/ws/rest/rest-resources/pom.xml>
to org.apache.brooklyn/brooklyn-rest-resources/0.10.0-SNAPSHOT/brooklyn-rest-resources-0.10.0-SNAPSHOT.pom
[JENKINS] Archiving <https://builds.apache.org/job/brooklyn-server-master/ws/utils/jmx/jmxmp-ssl-agent/pom.xml>
to org.apache.brooklyn/brooklyn-jmxmp-agent/0.10.0-SNAPSHOT/brooklyn-jmxmp-agent-0.10.0-SNAPSHOT.pom
[JENKINS] Archiving <https://builds.apache.org/job/brooklyn-server-master/ws/parent/pom.xml>
to org.apache.brooklyn/brooklyn-parent/0.10.0-SNAPSHOT/brooklyn-parent-0.10.0-SNAPSHOT.pom
Compressed 80.70 KB of artifacts by 79.3% relative to #235
[JENKINS] Archiving <https://builds.apache.org/job/brooklyn-server-master/ws/software/winrm/pom.xml>
to org.apache.brooklyn/brooklyn-software-winrm/0.10.0-SNAPSHOT/brooklyn-software-winrm-0.10.0-SNAPSHOT.pom
channel stopped

Mime
View raw message