brooklyn-dev mailing list archives

Site index · List index
Message view « Date » · « Thread »
Top « Date » · « Thread »
From Apache Jenkins Server <jenk...@builds.apache.org>
Subject Build failed in Jenkins: brooklyn-server-master #202
Date Wed, 27 Jul 2016 14:49:34 GMT
See <https://builds.apache.org/job/brooklyn-server-master/202/>

------------------------------------------
[...truncated 19836 lines...]
2016-07-27 14:49:12,780 INFO  TESTNG PASSED: "Surefire test" - org.apache.brooklyn.core.typereg.BasicBrooklynTypeRegistryTest.testGettingBestVersion()
finished in 2 ms
2016-07-27 14:49:12,780 INFO  TESTNG INVOKING CONFIGURATION: "Surefire test" - @AfterMethod
org.apache.brooklyn.core.test.BrooklynMgmtUnitTestSupport.tearDown()
2016-07-27 14:49:12,780 INFO  TESTNG PASSED CONFIGURATION: "Surefire test" - @AfterMethod
org.apache.brooklyn.core.test.BrooklynMgmtUnitTestSupport.tearDown() finished in 0 ms
2016-07-27 14:49:12,780 INFO  TESTNG INVOKING CONFIGURATION: "Surefire test" - @BeforeMethod
org.apache.brooklyn.core.test.BrooklynMgmtUnitTestSupport.setUp()
2016-07-27 14:49:12,781 INFO  TESTNG PASSED CONFIGURATION: "Surefire test" - @BeforeMethod
org.apache.brooklyn.core.test.BrooklynMgmtUnitTestSupport.setUp() finished in 1 ms
2016-07-27 14:49:12,781 INFO  TESTNG INVOKING: "Surefire test" - org.apache.brooklyn.core.typereg.BasicBrooklynTypeRegistryTest.testTags()
2016-07-27 14:49:12,782 INFO  No Camp-YAML parser registered for parsing catalog item DSL;
skipping DSL-parsing
2016-07-27 14:49:12,783 INFO  TESTNG PASSED: "Surefire test" - org.apache.brooklyn.core.typereg.BasicBrooklynTypeRegistryTest.testTags()
finished in 2 ms
2016-07-27 14:49:12,784 INFO  TESTNG INVOKING CONFIGURATION: "Surefire test" - @AfterMethod
org.apache.brooklyn.core.test.BrooklynMgmtUnitTestSupport.tearDown()
2016-07-27 14:49:12,784 INFO  TESTNG PASSED CONFIGURATION: "Surefire test" - @AfterMethod
org.apache.brooklyn.core.test.BrooklynMgmtUnitTestSupport.tearDown() finished in 0 ms
2016-07-27 14:49:12,784 INFO  TESTNG INVOKING CONFIGURATION: "Surefire test" - @BeforeMethod
org.apache.brooklyn.core.plan.XmlPlanToSpecTransformerTest.setUp()
2016-07-27 14:49:12,785 INFO  TESTNG PASSED CONFIGURATION: "Surefire test" - @BeforeMethod
org.apache.brooklyn.core.plan.XmlPlanToSpecTransformerTest.setUp() finished in 1 ms
2016-07-27 14:49:12,785 INFO  TESTNG INVOKING: "Surefire test" - org.apache.brooklyn.core.plan.XmlPlanToSpecTransformerTest.testSimpleXmlPlanParse()
2016-07-27 14:49:12,814 WARN  Unsupported flags when configuring BasicEntityImpl{id=nxooaqi86r};
storing: {foo=bar}
BasicApplicationImpl{id=ytferrj8f2} ytferrj8f2
    displayName = root
    locations = []
    service.isUp: false
    service.notUp.indicators: {service.state=Application created but not yet started, at 2016-07-27
14:49:12.817}
    Enrichers:
      Transformer{uniqueTag=service.isUp if no service.notUp.indicators, running=true, entity=BasicApplicationImpl{id=ytferrj8f2},
id=aew55ot9jq}
          enricher.sourceSensor[ConfigKey:org.apache.brooklyn.api.sensor.Sensor] = Sensor:
service.notUp.indicators (java.util.Map)
          enricher.suppressDuplicates[ConfigKey:java.lang.Boolean] = true
          enricher.targetSensor[ConfigKey:org.apache.brooklyn.api.sensor.Sensor] = Sensor:
service.isUp (java.lang.Boolean)
          enricher.transformation[ConfigKey:com.google.common.base.Function] = if[{Not(IS_NULL)=forPredicate(IsEqualTo(0)(sizeFunction(keys)))}]-else[UNCHANGED]
      ComputeServiceState{uniqueTag=service.state.actual, running=true, entity=BasicApplicationImpl{id=ytferrj8f2},
id=go7gtw1z3i}
      ComputeServiceIndicatorsFromChildrenAndMembers{uniqueTag=service-lifecycle-indicators-from-children-and-members,
running=true, entity=BasicApplicationImpl{id=ytferrj8f2}, id=jwrxzmhj41}
          enricher.aggregating.fromChildren[ConfigKey:java.lang.Boolean] = true
          enricher.aggregating.fromMembers[ConfigKey:java.lang.Boolean] = true
  BasicEntityImpl{id=nxooaqi86r} nxooaqi86r
      displayName = a_kid
      locations = []
      foo = bar
      Enrichers:
        Transformer{uniqueTag=service.isUp if no service.notUp.indicators, running=true, entity=BasicEntityImpl{id=nxooaqi86r},
id=oxh339pvsr}
            enricher.sourceSensor[ConfigKey:org.apache.brooklyn.api.sensor.Sensor] = Sensor:
service.notUp.indicators (java.util.Map)
            enricher.suppressDuplicates[ConfigKey:java.lang.Boolean] = true
            enricher.targetSensor[ConfigKey:org.apache.brooklyn.api.sensor.Sensor] = Sensor:
service.isUp (java.lang.Boolean)
            enricher.transformation[ConfigKey:com.google.common.base.Function] = if[{Not(IS_NULL)=forPredicate(IsEqualTo(0)(sizeFunction(keys)))}]-else[UNCHANGED]
        ComputeServiceState{uniqueTag=service.state.actual, running=true, entity=BasicEntityImpl{id=nxooaqi86r},
id=a0udrsjtg6}
2016-07-27 14:49:12,821 INFO  TESTNG PASSED: "Surefire test" - org.apache.brooklyn.core.plan.XmlPlanToSpecTransformerTest.testSimpleXmlPlanParse()
finished in 36 ms
2016-07-27 14:49:12,822 INFO  TESTNG INVOKING CONFIGURATION: "Surefire test" - @AfterMethod
org.apache.brooklyn.core.plan.XmlPlanToSpecTransformerTest.tearDown()
2016-07-27 14:49:12,823 INFO  Stopping application BasicApplicationImpl{id=ytferrj8f2}
2016-07-27 14:49:12,823 INFO  No Camp-YAML parser registered for parsing catalog item DSL;
skipping DSL-parsing
2016-07-27 14:49:12,823 INFO  Stopped application BasicApplicationImpl{id=ytferrj8f2}
2016-07-27 14:49:12,824 WARN  Error invoking start at BasicApplicationImpl{id=ytferrj8f2}:
RuntimeInterruptedException: java.lang.InterruptedException: sleep interrupted
2016-07-27 14:49:12,825 INFO  TESTNG PASSED CONFIGURATION: "Surefire test" - @AfterMethod
org.apache.brooklyn.core.plan.XmlPlanToSpecTransformerTest.tearDown() finished in 3 ms
2016-07-27 14:49:12,825 INFO  TESTNG INVOKING CONFIGURATION: "Surefire test" - @BeforeMethod
org.apache.brooklyn.core.internal.storage.impl.BrooklynStorageImplTest.setUp()
2016-07-27 14:49:12,825 INFO  TESTNG PASSED CONFIGURATION: "Surefire test" - @BeforeMethod
org.apache.brooklyn.core.internal.storage.impl.BrooklynStorageImplTest.setUp() finished in
0 ms
2016-07-27 14:49:12,826 INFO  TESTNG INVOKING: "Surefire test" - org.apache.brooklyn.core.internal.storage.impl.BrooklynStorageImplTest.testCreateMapReturnsSameEachTime()
2016-07-27 14:49:12,826 INFO  TESTNG PASSED: "Surefire test" - org.apache.brooklyn.core.internal.storage.impl.BrooklynStorageImplTest.testCreateMapReturnsSameEachTime()
finished in 1 ms
2016-07-27 14:49:12,827 INFO  TESTNG INVOKING CONFIGURATION: "Surefire test" - @BeforeMethod
org.apache.brooklyn.core.internal.storage.impl.BrooklynStorageImplTest.setUp()
2016-07-27 14:49:12,827 INFO  TESTNG PASSED CONFIGURATION: "Surefire test" - @BeforeMethod
org.apache.brooklyn.core.internal.storage.impl.BrooklynStorageImplTest.setUp() finished in
0 ms
2016-07-27 14:49:12,827 INFO  TESTNG INVOKING: "Surefire test" - org.apache.brooklyn.core.internal.storage.impl.BrooklynStorageImplTest.testMapKeySetIterator()
2016-07-27 14:49:12,827 INFO  TESTNG PASSED: "Surefire test" - org.apache.brooklyn.core.internal.storage.impl.BrooklynStorageImplTest.testMapKeySetIterator()
finished in 0 ms
2016-07-27 14:49:12,827 INFO  TESTNG INVOKING CONFIGURATION: "Surefire test" - @BeforeMethod
org.apache.brooklyn.core.internal.storage.impl.BrooklynStorageImplTest.setUp()
2016-07-27 14:49:12,827 INFO  TESTNG PASSED CONFIGURATION: "Surefire test" - @BeforeMethod
org.apache.brooklyn.core.internal.storage.impl.BrooklynStorageImplTest.setUp() finished in
0 ms
2016-07-27 14:49:12,828 INFO  TESTNG INVOKING: "Surefire test" - org.apache.brooklyn.core.internal.storage.impl.BrooklynStorageImplTest.testMapOperations()
2016-07-27 14:49:12,828 INFO  TESTNG PASSED: "Surefire test" - org.apache.brooklyn.core.internal.storage.impl.BrooklynStorageImplTest.testMapOperations()
finished in 0 ms
2016-07-27 14:49:12,828 INFO  TESTNG INVOKING CONFIGURATION: "Surefire test" - @BeforeMethod
org.apache.brooklyn.core.internal.storage.impl.BrooklynStorageImplTest.setUp()
2016-07-27 14:49:12,828 INFO  TESTNG PASSED CONFIGURATION: "Surefire test" - @BeforeMethod
org.apache.brooklyn.core.internal.storage.impl.BrooklynStorageImplTest.setUp() finished in
0 ms
2016-07-27 14:49:12,829 INFO  TESTNG INVOKING: "Surefire test" - org.apache.brooklyn.core.internal.storage.impl.BrooklynStorageImplTest.testReferenceAcceptsNullValue()
2016-07-27 14:49:12,830 INFO  TESTNG PASSED: "Surefire test" - org.apache.brooklyn.core.internal.storage.impl.BrooklynStorageImplTest.testReferenceAcceptsNullValue()
finished in 1 ms
2016-07-27 14:49:12,830 INFO  TESTNG INVOKING CONFIGURATION: "Surefire test" - @BeforeMethod
org.apache.brooklyn.core.internal.storage.impl.BrooklynStorageImplTest.setUp()
2016-07-27 14:49:12,830 INFO  TESTNG PASSED CONFIGURATION: "Surefire test" - @BeforeMethod
org.apache.brooklyn.core.internal.storage.impl.BrooklynStorageImplTest.setUp() finished in
0 ms
2016-07-27 14:49:12,830 INFO  TESTNG INVOKING: "Surefire test" - org.apache.brooklyn.core.internal.storage.impl.BrooklynStorageImplTest.testReferenceGetAndSet()
2016-07-27 14:49:12,830 INFO  TESTNG PASSED: "Surefire test" - org.apache.brooklyn.core.internal.storage.impl.BrooklynStorageImplTest.testReferenceGetAndSet()
finished in 0 ms
2016-07-27 14:49:12,831 INFO  TESTNG INVOKING CONFIGURATION: "Surefire test" - @BeforeMethod
org.apache.brooklyn.core.internal.storage.impl.ConcurrentMapAcceptingNullValsTest.setUp()
2016-07-27 14:49:12,831 INFO  TESTNG PASSED CONFIGURATION: "Surefire test" - @BeforeMethod
org.apache.brooklyn.core.internal.storage.impl.ConcurrentMapAcceptingNullValsTest.setUp()
finished in 0 ms
2016-07-27 14:49:12,831 INFO  TESTNG INVOKING: "Surefire test" - org.apache.brooklyn.core.internal.storage.impl.ConcurrentMapAcceptingNullValsTest.testAcceptsNullValue()
2016-07-27 14:49:12,831 INFO  TESTNG PASSED: "Surefire test" - org.apache.brooklyn.core.internal.storage.impl.ConcurrentMapAcceptingNullValsTest.testAcceptsNullValue()
finished in 0 ms
2016-07-27 14:49:12,832 INFO  TESTNG INVOKING CONFIGURATION: "Surefire test" - @BeforeMethod
org.apache.brooklyn.core.internal.storage.impl.ConcurrentMapAcceptingNullValsTest.setUp()
2016-07-27 14:49:12,832 INFO  TESTNG PASSED CONFIGURATION: "Surefire test" - @BeforeMethod
org.apache.brooklyn.core.internal.storage.impl.ConcurrentMapAcceptingNullValsTest.setUp()
finished in 0 ms
2016-07-27 14:49:12,832 INFO  TESTNG INVOKING: "Surefire test" - org.apache.brooklyn.core.internal.storage.impl.ConcurrentMapAcceptingNullValsTest.testSimpleOperations()
2016-07-27 14:49:12,832 INFO  TESTNG PASSED: "Surefire test" - org.apache.brooklyn.core.internal.storage.impl.ConcurrentMapAcceptingNullValsTest.testSimpleOperations()
finished in 0 ms
SUREFIRE-859: [GC 609905K->395377K(765440K), 0.0729110 secs]
2016-07-27 14:49:12,961 WARN  Task Task[LSM.publish(Application[014tzapr].Sensor: entity.children.removed
(org.apache.brooklyn.api.entity.Entity)=TestEntityImpl{id=i2ttugl1ap} @ 1469630950881);[subscription-delivery-entity-yk014tzapr[Application[014tzapr]]]]@oul2uADR
is being finalized before completion
2016-07-27 14:49:12,961 WARN  Task Task[LSM.publish(Application[014tzapr].Sensor: service.state.expected
(org.apache.brooklyn.core.entity.lifecycle.Lifecycle$Transition)=stopped @ 1469630950881 /
Wed Jul 27 14:49:10 UTC 2016 @ 1469630950881);[subscription-delivery-entity-yk014tzapr[Application[014tzapr]]]]@pfhhPF88
is being finalized before completion
2016-07-27 14:49:12,961 WARN  Task Task[LSM.publish(Application[ir4n9qhe].Sensor: entity.children.removed
(org.apache.brooklyn.api.entity.Entity)=MyOtherEntityImpl{id=c06zmq710q} @ 1469630952339);[subscription-delivery-entity-oair4n9qhe[Application[ir4n9qhe]]]]@n6Dv8pWc
is being finalized before completion
2016-07-27 14:49:13,097 INFO  TESTNG 
===============================================
    Surefire test
    Tests run: 1859, Failures: 1, Skips: 0
===============================================
2016-07-27 14:49:13,097 INFO  BrooklynLeakListener.onFinish attempting to terminate all extant
ManagementContexts: name=Surefire test; includedGroups=[]; excludedGroups=[Integration, Live-sanity,
Acceptance, Live, Broken, WIP]; suiteName=Surefire suite; outDir=<https://builds.apache.org/job/brooklyn-server-master/ws/core/target/surefire-reports/Surefire>
suite: no org.apache.brooklyn.core.management.internal.LocalManagementContext available, so
skipped
SUREFIRE-859: [GC 614513K->395640K(764416K), 0.0361720 secs]
SUREFIRE-859: [GC 614776K->395032K(766464K), 0.0272920 secs]
Tests run: 1859, Failures: 1, Errors: 0, Skipped: 0, Time elapsed: 199.829 sec <<<
FAILURE! - in TestSuite
testDoesNotAddsConditionalWhenNotConfigured(org.apache.brooklyn.entity.stock.ConditionalEntityTest)
 Time elapsed: 0.08 sec  <<< FAILURE!
java.lang.AssertionError: expected [0] but found [1]
	at org.testng.Assert.fail(Assert.java:94)
	at org.testng.Assert.failNotEquals(Assert.java:494)
	at org.testng.Assert.assertEquals(Assert.java:123)
	at org.testng.Assert.assertEquals(Assert.java:370)
	at org.testng.Assert.assertEquals(Assert.java:380)
	at org.apache.brooklyn.entity.stock.ConditionalEntityTest.testDoesNotAddsConditionalWhenNotConfigured(ConditionalEntityTest.java:92)

2016-07-27 14:49:15,027 INFO  Brooklyn shutdown: stopping entities [TestEntityImpl{id=xhy438pvqo},
TestEntityImpl{id=pq84il5mo6}, BlockingEntityImpl{id=r7zzjd5hds}]

Results :

Failed tests: 
  ConditionalEntityTest.testDoesNotAddsConditionalWhenNotConfigured:92 expected [0] but found
[1]

Tests run: 1859, Failures: 1, Errors: 0, Skipped: 0

[JENKINS] Recording test results
[INFO] ------------------------------------------------------------------------
[INFO] Reactor Summary:
[INFO] 
[INFO] Brooklyn Server Root ............................... SUCCESS [  1.657 s]
[INFO] Brooklyn Parent Project ............................ SUCCESS [  3.220 s]
[INFO] Brooklyn Test Support Utilities .................... SUCCESS [  8.568 s]
[INFO] Brooklyn Logback Includable Configuration .......... SUCCESS [  3.640 s]
[INFO] Brooklyn Common Utilities .......................... SUCCESS [ 22.439 s]
[INFO] Brooklyn API ....................................... SUCCESS [  4.031 s]
[INFO] CAMP Server Parent Project ......................... SUCCESS [  1.825 s]
[INFO] CAMP Base .......................................... SUCCESS [  4.625 s]
[INFO] Brooklyn Test Support .............................. SUCCESS [  2.838 s]
[INFO] Brooklyn REST Swagger Apidoc Utilities ............. SUCCESS [  2.964 s]
[INFO] Brooklyn Logback Configuration ..................... SUCCESS [  1.584 s]
[INFO] CAMP Server ........................................ SUCCESS [  6.817 s]
[INFO] Brooklyn Felix Runtime ............................. SUCCESS [  4.966 s]
[INFO] Brooklyn Groovy Utilities .......................... SUCCESS [  5.477 s]
[INFO] Brooklyn Core ...................................... FAILURE [03:55 min]
[INFO] Brooklyn Policies .................................. SKIPPED
[INFO] Brooklyn WinRM Software Entities ................... SKIPPED
[INFO] Brooklyn Secure JMXMP Agent ........................ SKIPPED
[INFO] Brooklyn JMX RMI Agent ............................. SKIPPED
[INFO] Brooklyn Jclouds Location Targets .................. SKIPPED
[INFO] Brooklyn Software Base ............................. SKIPPED
[INFO] Brooklyn CAMP REST API ............................. SKIPPED
[INFO] Brooklyn Hazelcast Storage ......................... SKIPPED
[INFO] Brooklyn Launcher Common ........................... SKIPPED
[INFO] Brooklyn REST API .................................. SKIPPED
[INFO] Brooklyn REST Resources ............................ SKIPPED
[INFO] Brooklyn REST Server ............................... SKIPPED
[INFO] Brooklyn Launcher .................................. SKIPPED
[INFO] Brooklyn Command Line Interface .................... SKIPPED
[INFO] Brooklyn REST Client ............................... SKIPPED
[INFO] Brooklyn Test Framework ............................ SKIPPED
[INFO] Brooklyn OSGi init ................................. SKIPPED
[INFO] Brooklyn Karaf ..................................... SKIPPED
[INFO] Jetty config fragment .............................. SKIPPED
[INFO] Brooklyn Karaf Features ............................ SKIPPED
[INFO] Brooklyn Karaf Shell Commands ...................... SKIPPED
[INFO] Brooklyn Karaf Distro .............................. SKIPPED
[INFO] Brooklyn Karaf pax-exam itest ...................... SKIPPED
[INFO] ------------------------------------------------------------------------
[INFO] BUILD FAILURE
[INFO] ------------------------------------------------------------------------
[INFO] Total time: 05:27 min
[INFO] Finished at: 2016-07-27T14:49:20+00:00
[INFO] Final Memory: 107M/603M
[INFO] ------------------------------------------------------------------------
Waiting for Jenkins to finish collecting data
[ERROR] Failed to execute goal org.apache.maven.plugins:maven-surefire-plugin:2.18.1:test
(default-test) on project brooklyn-core: There are test failures.
[ERROR] 
[ERROR] Please refer to <https://builds.apache.org/job/brooklyn-server-master/ws/core/target/surefire-reports>
for the individual test results.
[ERROR] -> [Help 1]
[ERROR] 
[ERROR] To see the full stack trace of the errors, re-run Maven with the -e switch.
[ERROR] Re-run Maven using the -X switch to enable full debug logging.
[ERROR] 
[ERROR] For more information about the errors and possible solutions, please read the following
articles:
[ERROR] [Help 1] http://cwiki.apache.org/confluence/display/MAVEN/MojoFailureException
[ERROR] 
[ERROR] After correcting the problems, you can resume the build with the command
[ERROR]   mvn <goals> -rf :brooklyn-core
[JENKINS] Archiving <https://builds.apache.org/job/brooklyn-server-master/ws/policy/pom.xml>
to org.apache.brooklyn/brooklyn-policy/0.10.0-SNAPSHOT/brooklyn-policy-0.10.0-SNAPSHOT.pom
[JENKINS] Archiving <https://builds.apache.org/job/brooklyn-server-master/ws/storage/hazelcast/pom.xml>
to org.apache.brooklyn/brooklyn-storage-hazelcast/0.10.0-SNAPSHOT/brooklyn-storage-hazelcast-0.10.0-SNAPSHOT.pom
[JENKINS] Archiving <https://builds.apache.org/job/brooklyn-server-master/ws/test-framework/pom.xml>
to org.apache.brooklyn/brooklyn-test-framework/0.10.0-SNAPSHOT/brooklyn-test-framework-0.10.0-SNAPSHOT.pom
[JENKINS] Archiving <https://builds.apache.org/job/brooklyn-server-master/ws/karaf/init/pom.xml>
to org.apache.brooklyn/brooklyn-karaf-init/0.10.0-SNAPSHOT/brooklyn-karaf-init-0.10.0-SNAPSHOT.pom
[JENKINS] Archiving <https://builds.apache.org/job/brooklyn-server-master/ws/pom.xml>
to org.apache.brooklyn/brooklyn-server/0.10.0-SNAPSHOT/brooklyn-server-0.10.0-SNAPSHOT.pom
[JENKINS] Archiving <https://builds.apache.org/job/brooklyn-server-master/ws/karaf/commands/pom.xml>
to org.apache.brooklyn/brooklyn-commands/0.10.0-SNAPSHOT/brooklyn-commands-0.10.0-SNAPSHOT.pom
[JENKINS] Archiving <https://builds.apache.org/job/brooklyn-server-master/ws/rest/rest-api/pom.xml>
to org.apache.brooklyn/brooklyn-rest-api/0.10.0-SNAPSHOT/brooklyn-rest-api-0.10.0-SNAPSHOT.pom
[JENKINS] Archiving <https://builds.apache.org/job/brooklyn-server-master/ws/core/pom.xml>
to org.apache.brooklyn/brooklyn-core/0.10.0-SNAPSHOT/brooklyn-core-0.10.0-SNAPSHOT.pom
[JENKINS] Archiving <https://builds.apache.org/job/brooklyn-server-master/ws/logging/logback-xml/pom.xml>
to org.apache.brooklyn/brooklyn-logback-xml/0.10.0-SNAPSHOT/brooklyn-logback-xml-0.10.0-SNAPSHOT.pom
[JENKINS] Archiving <https://builds.apache.org/job/brooklyn-server-master/ws/logging/logback-xml/target/brooklyn-logback-xml-0.10.0-SNAPSHOT.jar>
to org.apache.brooklyn/brooklyn-logback-xml/0.10.0-SNAPSHOT/brooklyn-logback-xml-0.10.0-SNAPSHOT.jar
[JENKINS] Archiving <https://builds.apache.org/job/brooklyn-server-master/ws/logging/logback-xml/target/brooklyn-logback-xml-0.10.0-SNAPSHOT-sources.jar>
to org.apache.brooklyn/brooklyn-logback-xml/0.10.0-SNAPSHOT/brooklyn-logback-xml-0.10.0-SNAPSHOT-sources.jar
[JENKINS] Archiving <https://builds.apache.org/job/brooklyn-server-master/ws/logging/logback-xml/target/brooklyn-logback-xml-0.10.0-SNAPSHOT-test-sources.jar>
to org.apache.brooklyn/brooklyn-logback-xml/0.10.0-SNAPSHOT/brooklyn-logback-xml-0.10.0-SNAPSHOT-test-sources.jar
[JENKINS] Archiving <https://builds.apache.org/job/brooklyn-server-master/ws/karaf/features/pom.xml>
to org.apache.brooklyn/brooklyn-features/0.10.0-SNAPSHOT/brooklyn-features-0.10.0-SNAPSHOT.pom
[JENKINS] Archiving <https://builds.apache.org/job/brooklyn-server-master/ws/rest/rest-resources/pom.xml>
to org.apache.brooklyn/brooklyn-rest-resources/0.10.0-SNAPSHOT/brooklyn-rest-resources-0.10.0-SNAPSHOT.pom
[JENKINS] Archiving <https://builds.apache.org/job/brooklyn-server-master/ws/camp/camp-server/pom.xml>
to org.apache.brooklyn.camp/camp-server/0.10.0-SNAPSHOT/camp-server-0.10.0-SNAPSHOT.pom
[JENKINS] Archiving <https://builds.apache.org/job/brooklyn-server-master/ws/camp/camp-server/target/camp-server-0.10.0-SNAPSHOT.jar>
to org.apache.brooklyn.camp/camp-server/0.10.0-SNAPSHOT/camp-server-0.10.0-SNAPSHOT.jar
[JENKINS] Archiving <https://builds.apache.org/job/brooklyn-server-master/ws/camp/camp-server/target/camp-server-0.10.0-SNAPSHOT-tests.jar>
to org.apache.brooklyn.camp/camp-server/0.10.0-SNAPSHOT/camp-server-0.10.0-SNAPSHOT-tests.jar
[JENKINS] Archiving <https://builds.apache.org/job/brooklyn-server-master/ws/camp/camp-server/target/camp-server-0.10.0-SNAPSHOT-sources.jar>
to org.apache.brooklyn.camp/camp-server/0.10.0-SNAPSHOT/camp-server-0.10.0-SNAPSHOT-sources.jar
[JENKINS] Archiving <https://builds.apache.org/job/brooklyn-server-master/ws/camp/camp-server/target/camp-server-0.10.0-SNAPSHOT-test-sources.jar>
to org.apache.brooklyn.camp/camp-server/0.10.0-SNAPSHOT/camp-server-0.10.0-SNAPSHOT-test-sources.jar
[JENKINS] Archiving <https://builds.apache.org/job/brooklyn-server-master/ws/launcher-common/pom.xml>
to org.apache.brooklyn/brooklyn-launcher-common/0.10.0-SNAPSHOT/brooklyn-launcher-common-0.10.0-SNAPSHOT.pom
[JENKINS] Archiving <https://builds.apache.org/job/brooklyn-server-master/ws/utils/groovy/pom.xml>
to org.apache.brooklyn/brooklyn-utils-groovy/0.10.0-SNAPSHOT/brooklyn-utils-groovy-0.10.0-SNAPSHOT.pom
[JENKINS] Archiving <https://builds.apache.org/job/brooklyn-server-master/ws/utils/groovy/target/brooklyn-utils-groovy-0.10.0-SNAPSHOT.jar>
to org.apache.brooklyn/brooklyn-utils-groovy/0.10.0-SNAPSHOT/brooklyn-utils-groovy-0.10.0-SNAPSHOT.jar
[JENKINS] Archiving <https://builds.apache.org/job/brooklyn-server-master/ws/utils/groovy/target/brooklyn-utils-groovy-0.10.0-SNAPSHOT-tests.jar>
to org.apache.brooklyn/brooklyn-utils-groovy/0.10.0-SNAPSHOT/brooklyn-utils-groovy-0.10.0-SNAPSHOT-tests.jar
[JENKINS] Archiving <https://builds.apache.org/job/brooklyn-server-master/ws/utils/groovy/target/brooklyn-utils-groovy-0.10.0-SNAPSHOT-sources.jar>
to org.apache.brooklyn/brooklyn-utils-groovy/0.10.0-SNAPSHOT/brooklyn-utils-groovy-0.10.0-SNAPSHOT-sources.jar
[JENKINS] Archiving <https://builds.apache.org/job/brooklyn-server-master/ws/utils/groovy/target/brooklyn-utils-groovy-0.10.0-SNAPSHOT-test-sources.jar>
to org.apache.brooklyn/brooklyn-utils-groovy/0.10.0-SNAPSHOT/brooklyn-utils-groovy-0.10.0-SNAPSHOT-test-sources.jar
[JENKINS] Archiving <https://builds.apache.org/job/brooklyn-server-master/ws/utils/common/pom.xml>
to org.apache.brooklyn/brooklyn-utils-common/0.10.0-SNAPSHOT/brooklyn-utils-common-0.10.0-SNAPSHOT.pom
[JENKINS] Archiving <https://builds.apache.org/job/brooklyn-server-master/ws/utils/common/target/brooklyn-utils-common-0.10.0-SNAPSHOT.jar>
to org.apache.brooklyn/brooklyn-utils-common/0.10.0-SNAPSHOT/brooklyn-utils-common-0.10.0-SNAPSHOT.jar
[JENKINS] Archiving <https://builds.apache.org/job/brooklyn-server-master/ws/utils/common/target/brooklyn-utils-common-0.10.0-SNAPSHOT-tests.jar>
to org.apache.brooklyn/brooklyn-utils-common/0.10.0-SNAPSHOT/brooklyn-utils-common-0.10.0-SNAPSHOT-tests.jar
[JENKINS] Archiving <https://builds.apache.org/job/brooklyn-server-master/ws/utils/common/target/brooklyn-utils-common-0.10.0-SNAPSHOT-sources.jar>
to org.apache.brooklyn/brooklyn-utils-common/0.10.0-SNAPSHOT/brooklyn-utils-common-0.10.0-SNAPSHOT-sources.jar
[JENKINS] Archiving <https://builds.apache.org/job/brooklyn-server-master/ws/utils/common/target/brooklyn-utils-common-0.10.0-SNAPSHOT-test-sources.jar>
to org.apache.brooklyn/brooklyn-utils-common/0.10.0-SNAPSHOT/brooklyn-utils-common-0.10.0-SNAPSHOT-test-sources.jar
Compressed 1.30 MB of artifacts by 28.9% relative to #201
[JENKINS] Archiving <https://builds.apache.org/job/brooklyn-server-master/ws/locations/jclouds/pom.xml>
to org.apache.brooklyn/brooklyn-locations-jclouds/0.10.0-SNAPSHOT/brooklyn-locations-jclouds-0.10.0-SNAPSHOT.pom
[JENKINS] Archiving <https://builds.apache.org/job/brooklyn-server-master/ws/test-support/pom.xml>
to org.apache.brooklyn/brooklyn-test-support/0.10.0-SNAPSHOT/brooklyn-test-support-0.10.0-SNAPSHOT.pom
[JENKINS] Archiving <https://builds.apache.org/job/brooklyn-server-master/ws/test-support/target/brooklyn-test-support-0.10.0-SNAPSHOT.jar>
to org.apache.brooklyn/brooklyn-test-support/0.10.0-SNAPSHOT/brooklyn-test-support-0.10.0-SNAPSHOT.jar
[JENKINS] Archiving <https://builds.apache.org/job/brooklyn-server-master/ws/test-support/target/brooklyn-test-support-0.10.0-SNAPSHOT-sources.jar>
to org.apache.brooklyn/brooklyn-test-support/0.10.0-SNAPSHOT/brooklyn-test-support-0.10.0-SNAPSHOT-sources.jar
[JENKINS] Archiving <https://builds.apache.org/job/brooklyn-server-master/ws/test-support/target/brooklyn-test-support-0.10.0-SNAPSHOT-test-sources.jar>
to org.apache.brooklyn/brooklyn-test-support/0.10.0-SNAPSHOT/brooklyn-test-support-0.10.0-SNAPSHOT-test-sources.jar
[JENKINS] Archiving <https://builds.apache.org/job/brooklyn-server-master/ws/karaf/pom.xml>
to org.apache.brooklyn/brooklyn-karaf/0.10.0-SNAPSHOT/brooklyn-karaf-0.10.0-SNAPSHOT.pom
[JENKINS] Archiving <https://builds.apache.org/job/brooklyn-server-master/ws/utils/rt-felix/pom.xml>
to org.apache.brooklyn/brooklyn-rt-felix/0.10.0-SNAPSHOT/brooklyn-rt-felix-0.10.0-SNAPSHOT.pom
[JENKINS] Archiving <https://builds.apache.org/job/brooklyn-server-master/ws/utils/rt-felix/target/brooklyn-rt-felix-0.10.0-SNAPSHOT.jar>
to org.apache.brooklyn/brooklyn-rt-felix/0.10.0-SNAPSHOT/brooklyn-rt-felix-0.10.0-SNAPSHOT.jar
[JENKINS] Archiving <https://builds.apache.org/job/brooklyn-server-master/ws/utils/rt-felix/target/brooklyn-rt-felix-0.10.0-SNAPSHOT-tests.jar>
to org.apache.brooklyn/brooklyn-rt-felix/0.10.0-SNAPSHOT/brooklyn-rt-felix-0.10.0-SNAPSHOT-tests.jar
[JENKINS] Archiving <https://builds.apache.org/job/brooklyn-server-master/ws/utils/rt-felix/target/brooklyn-rt-felix-0.10.0-SNAPSHOT-sources.jar>
to org.apache.brooklyn/brooklyn-rt-felix/0.10.0-SNAPSHOT/brooklyn-rt-felix-0.10.0-SNAPSHOT-sources.jar
[JENKINS] Archiving <https://builds.apache.org/job/brooklyn-server-master/ws/utils/rt-felix/target/brooklyn-rt-felix-0.10.0-SNAPSHOT-test-sources.jar>
to org.apache.brooklyn/brooklyn-rt-felix/0.10.0-SNAPSHOT/brooklyn-rt-felix-0.10.0-SNAPSHOT-test-sources.jar
[JENKINS] Archiving <https://builds.apache.org/job/brooklyn-server-master/ws/karaf/itest/pom.xml>
to org.apache.brooklyn/brooklyn-itest/0.10.0-SNAPSHOT/brooklyn-itest-0.10.0-SNAPSHOT.pom
[JENKINS] Archiving <https://builds.apache.org/job/brooklyn-server-master/ws/software/winrm/pom.xml>
to org.apache.brooklyn/brooklyn-software-winrm/0.10.0-SNAPSHOT/brooklyn-software-winrm-0.10.0-SNAPSHOT.pom
[JENKINS] Archiving <https://builds.apache.org/job/brooklyn-server-master/ws/rest/rest-server/pom.xml>
to org.apache.brooklyn/brooklyn-rest-server/0.10.0-SNAPSHOT/brooklyn-rest-server-0.10.0-SNAPSHOT.pom
[JENKINS] Archiving <https://builds.apache.org/job/brooklyn-server-master/ws/camp/camp-base/pom.xml>
to org.apache.brooklyn.camp/camp-base/0.10.0-SNAPSHOT/camp-base-0.10.0-SNAPSHOT.pom
[JENKINS] Archiving <https://builds.apache.org/job/brooklyn-server-master/ws/camp/camp-base/target/camp-base-0.10.0-SNAPSHOT.jar>
to org.apache.brooklyn.camp/camp-base/0.10.0-SNAPSHOT/camp-base-0.10.0-SNAPSHOT.jar
[JENKINS] Archiving <https://builds.apache.org/job/brooklyn-server-master/ws/camp/camp-base/target/camp-base-0.10.0-SNAPSHOT-tests.jar>
to org.apache.brooklyn.camp/camp-base/0.10.0-SNAPSHOT/camp-base-0.10.0-SNAPSHOT-tests.jar
[JENKINS] Archiving <https://builds.apache.org/job/brooklyn-server-master/ws/camp/camp-base/target/camp-base-0.10.0-SNAPSHOT-sources.jar>
to org.apache.brooklyn.camp/camp-base/0.10.0-SNAPSHOT/camp-base-0.10.0-SNAPSHOT-sources.jar
[JENKINS] Archiving <https://builds.apache.org/job/brooklyn-server-master/ws/camp/camp-base/target/camp-base-0.10.0-SNAPSHOT-test-sources.jar>
to org.apache.brooklyn.camp/camp-base/0.10.0-SNAPSHOT/camp-base-0.10.0-SNAPSHOT-test-sources.jar
[JENKINS] Archiving <https://builds.apache.org/job/brooklyn-server-master/ws/rest/rest-client/pom.xml>
to org.apache.brooklyn/brooklyn-rest-client/0.10.0-SNAPSHOT/brooklyn-rest-client-0.10.0-SNAPSHOT.pom
[JENKINS] Archiving <https://builds.apache.org/job/brooklyn-server-master/ws/karaf/apache-brooklyn/pom.xml>
to org.apache.brooklyn/apache-brooklyn/0.10.0-SNAPSHOT/apache-brooklyn-0.10.0-SNAPSHOT.pom
[JENKINS] Archiving <https://builds.apache.org/job/brooklyn-server-master/ws/utils/jmx/jmxmp-ssl-agent/pom.xml>
to org.apache.brooklyn/brooklyn-jmxmp-agent/0.10.0-SNAPSHOT/brooklyn-jmxmp-agent-0.10.0-SNAPSHOT.pom
[JENKINS] Archiving <https://builds.apache.org/job/brooklyn-server-master/ws/utils/jmx/jmxrmi-agent/pom.xml>
to org.apache.brooklyn/brooklyn-jmxrmi-agent/0.10.0-SNAPSHOT/brooklyn-jmxrmi-agent-0.10.0-SNAPSHOT.pom
[JENKINS] Archiving <https://builds.apache.org/job/brooklyn-server-master/ws/camp/camp-brooklyn/pom.xml>
to org.apache.brooklyn/brooklyn-camp/0.10.0-SNAPSHOT/brooklyn-camp-0.10.0-SNAPSHOT.pom
[JENKINS] Archiving <https://builds.apache.org/job/brooklyn-server-master/ws/parent/pom.xml>
to org.apache.brooklyn/brooklyn-parent/0.10.0-SNAPSHOT/brooklyn-parent-0.10.0-SNAPSHOT.pom
Compressed 80.70 KB of artifacts by 79.3% relative to #201
[JENKINS] Archiving <https://builds.apache.org/job/brooklyn-server-master/ws/server-cli/pom.xml>
to org.apache.brooklyn/brooklyn-cli/0.10.0-SNAPSHOT/brooklyn-cli-0.10.0-SNAPSHOT.pom
[JENKINS] Archiving <https://builds.apache.org/job/brooklyn-server-master/ws/software/base/pom.xml>
to org.apache.brooklyn/brooklyn-software-base/0.10.0-SNAPSHOT/brooklyn-software-base-0.10.0-SNAPSHOT.pom
[JENKINS] Archiving <https://builds.apache.org/job/brooklyn-server-master/ws/logging/logback-includes/pom.xml>
to org.apache.brooklyn/brooklyn-logback-includes/0.10.0-SNAPSHOT/brooklyn-logback-includes-0.10.0-SNAPSHOT.pom
[JENKINS] Archiving <https://builds.apache.org/job/brooklyn-server-master/ws/logging/logback-includes/target/brooklyn-logback-includes-0.10.0-SNAPSHOT.jar>
to org.apache.brooklyn/brooklyn-logback-includes/0.10.0-SNAPSHOT/brooklyn-logback-includes-0.10.0-SNAPSHOT.jar
[JENKINS] Archiving <https://builds.apache.org/job/brooklyn-server-master/ws/logging/logback-includes/target/brooklyn-logback-includes-0.10.0-SNAPSHOT-sources.jar>
to org.apache.brooklyn/brooklyn-logback-includes/0.10.0-SNAPSHOT/brooklyn-logback-includes-0.10.0-SNAPSHOT-sources.jar
[JENKINS] Archiving <https://builds.apache.org/job/brooklyn-server-master/ws/logging/logback-includes/target/brooklyn-logback-includes-0.10.0-SNAPSHOT-test-sources.jar>
to org.apache.brooklyn/brooklyn-logback-includes/0.10.0-SNAPSHOT/brooklyn-logback-includes-0.10.0-SNAPSHOT-test-sources.jar
[JENKINS] Archiving <https://builds.apache.org/job/brooklyn-server-master/ws/launcher/pom.xml>
to org.apache.brooklyn/brooklyn-launcher/0.10.0-SNAPSHOT/brooklyn-launcher-0.10.0-SNAPSHOT.pom
[JENKINS] Archiving <https://builds.apache.org/job/brooklyn-server-master/ws/karaf/jetty-config/pom.xml>
to org.apache.brooklyn/brooklyn-karaf-jetty-config/0.10.0-SNAPSHOT/brooklyn-karaf-jetty-config-0.10.0-SNAPSHOT.pom
[JENKINS] Archiving <https://builds.apache.org/job/brooklyn-server-master/ws/utils/rest-swagger/pom.xml>
to org.apache.brooklyn/brooklyn-utils-rest-swagger/0.10.0-SNAPSHOT/brooklyn-utils-rest-swagger-0.10.0-SNAPSHOT.pom
[JENKINS] Archiving <https://builds.apache.org/job/brooklyn-server-master/ws/utils/rest-swagger/target/brooklyn-utils-rest-swagger-0.10.0-SNAPSHOT.jar>
to org.apache.brooklyn/brooklyn-utils-rest-swagger/0.10.0-SNAPSHOT/brooklyn-utils-rest-swagger-0.10.0-SNAPSHOT.jar
[JENKINS] Archiving <https://builds.apache.org/job/brooklyn-server-master/ws/utils/rest-swagger/target/brooklyn-utils-rest-swagger-0.10.0-SNAPSHOT-sources.jar>
to org.apache.brooklyn/brooklyn-utils-rest-swagger/0.10.0-SNAPSHOT/brooklyn-utils-rest-swagger-0.10.0-SNAPSHOT-sources.jar
[JENKINS] Archiving <https://builds.apache.org/job/brooklyn-server-master/ws/utils/rest-swagger/target/brooklyn-utils-rest-swagger-0.10.0-SNAPSHOT-test-sources.jar>
to org.apache.brooklyn/brooklyn-utils-rest-swagger/0.10.0-SNAPSHOT/brooklyn-utils-rest-swagger-0.10.0-SNAPSHOT-test-sources.jar
[JENKINS] Archiving <https://builds.apache.org/job/brooklyn-server-master/ws/utils/test-support/pom.xml>
to org.apache.brooklyn/brooklyn-utils-test-support/0.10.0-SNAPSHOT/brooklyn-utils-test-support-0.10.0-SNAPSHOT.pom
[JENKINS] Archiving <https://builds.apache.org/job/brooklyn-server-master/ws/utils/test-support/target/brooklyn-utils-test-support-0.10.0-SNAPSHOT.jar>
to org.apache.brooklyn/brooklyn-utils-test-support/0.10.0-SNAPSHOT/brooklyn-utils-test-support-0.10.0-SNAPSHOT.jar
[JENKINS] Archiving <https://builds.apache.org/job/brooklyn-server-master/ws/utils/test-support/target/brooklyn-utils-test-support-0.10.0-SNAPSHOT-sources.jar>
to org.apache.brooklyn/brooklyn-utils-test-support/0.10.0-SNAPSHOT/brooklyn-utils-test-support-0.10.0-SNAPSHOT-sources.jar
[JENKINS] Archiving <https://builds.apache.org/job/brooklyn-server-master/ws/utils/test-support/target/brooklyn-utils-test-support-0.10.0-SNAPSHOT-test-sources.jar>
to org.apache.brooklyn/brooklyn-utils-test-support/0.10.0-SNAPSHOT/brooklyn-utils-test-support-0.10.0-SNAPSHOT-test-sources.jar
[JENKINS] Archiving <https://builds.apache.org/job/brooklyn-server-master/ws/camp/pom.xml>
to org.apache.brooklyn.camp/camp-parent/0.10.0-SNAPSHOT/camp-parent-0.10.0-SNAPSHOT.pom
[JENKINS] Archiving <https://builds.apache.org/job/brooklyn-server-master/ws/api/pom.xml>
to org.apache.brooklyn/brooklyn-api/0.10.0-SNAPSHOT/brooklyn-api-0.10.0-SNAPSHOT.pom
[JENKINS] Archiving <https://builds.apache.org/job/brooklyn-server-master/ws/api/target/brooklyn-api-0.10.0-SNAPSHOT.jar>
to org.apache.brooklyn/brooklyn-api/0.10.0-SNAPSHOT/brooklyn-api-0.10.0-SNAPSHOT.jar
[JENKINS] Archiving <https://builds.apache.org/job/brooklyn-server-master/ws/api/target/brooklyn-api-0.10.0-SNAPSHOT-sources.jar>
to org.apache.brooklyn/brooklyn-api/0.10.0-SNAPSHOT/brooklyn-api-0.10.0-SNAPSHOT-sources.jar
[JENKINS] Archiving <https://builds.apache.org/job/brooklyn-server-master/ws/api/target/brooklyn-api-0.10.0-SNAPSHOT-test-sources.jar>
to org.apache.brooklyn/brooklyn-api/0.10.0-SNAPSHOT/brooklyn-api-0.10.0-SNAPSHOT-test-sources.jar
Compressed 287.89 KB of artifacts by 33.3% relative to #201
channel stopped

Mime
View raw message