brooklyn-dev mailing list archives

Site index · List index
Message view « Date » · « Thread »
Top « Date » · « Thread »
From Apache Jenkins Server <jenk...@builds.apache.org>
Subject Build failed in Jenkins: brooklyn-dist-master #27
Date Fri, 29 Jul 2016 18:51:46 GMT
See <https://builds.apache.org/job/brooklyn-dist-master/27/changes>

Changes:

[github] Generate ssh keys for the brooklyn host

[github] Update servers.yaml

------------------------------------------
[...truncated 257 lines...]
[INFO] --- maven-enforcer-plugin:1.4.1:enforce (brooklyn-build-req) @ brooklyn-dist ---
[INFO] 
[INFO] --- maven-remote-resources-plugin:1.5:process (default) @ brooklyn-dist ---
[INFO] 
[INFO] --- maven-resources-plugin:2.7:resources (default-resources) @ brooklyn-dist ---
[INFO] Using 'UTF-8' encoding to copy filtered resources.
[INFO] skip non existing resourceDirectory <https://builds.apache.org/job/brooklyn-dist-master/ws/dist/src/main/resources>
[INFO] Copying 3 resources
[INFO] 
[INFO] --- maven-compiler-plugin:3.3:compile (default-compile) @ brooklyn-dist ---
[INFO] No sources to compile
[INFO] 
[INFO] --- maven-checkstyle-plugin:2.13:check (verify-style) @ brooklyn-dist ---
[INFO] 
[INFO] 
[INFO] --- maven-dependency-plugin:2.8:copy (copy) @ brooklyn-dist ---
[INFO] Configured Artifact: org.apache.brooklyn:brooklyn-cli:dist:0.10.0-SNAPSHOT:bom
[INFO] Copying brooklyn-cli-0.10.0-SNAPSHOT-dist.bom to <https://builds.apache.org/job/brooklyn-dist-master/ws/dist/target/default.catalog.bom>
[INFO] 
[INFO] >>> maven-bundle-plugin:2.5.4:manifest (bundle-manifest) > process-classes
@ brooklyn-dist >>>
[INFO] 
[INFO] --- buildnumber-maven-plugin:1.3:create (default) @ brooklyn-dist ---
[INFO] 
[INFO] --- maven-enforcer-plugin:1.4.1:enforce (brooklyn-build-req) @ brooklyn-dist ---
[INFO] 
[INFO] --- maven-remote-resources-plugin:1.5:process (default) @ brooklyn-dist ---
[INFO] 
[INFO] --- maven-resources-plugin:2.7:resources (default-resources) @ brooklyn-dist ---
[INFO] Using 'UTF-8' encoding to copy filtered resources.
[INFO] skip non existing resourceDirectory <https://builds.apache.org/job/brooklyn-dist-master/ws/dist/src/main/resources>
[INFO] Copying 3 resources
[INFO] Copying 3 resources
[INFO] 
[INFO] --- maven-compiler-plugin:3.3:compile (default-compile) @ brooklyn-dist ---
[INFO] No sources to compile
[INFO] 
[INFO] --- maven-checkstyle-plugin:2.13:check (verify-style) @ brooklyn-dist ---
[INFO] 
[INFO] 
[INFO] --- maven-dependency-plugin:2.8:copy (copy) @ brooklyn-dist ---
[INFO] Configured Artifact: org.apache.brooklyn:brooklyn-cli:dist:0.10.0-SNAPSHOT:bom
[INFO] Copying brooklyn-cli-0.10.0-SNAPSHOT-dist.bom to <https://builds.apache.org/job/brooklyn-dist-master/ws/dist/target/default.catalog.bom>
[WARNING] Failed to getClass for org.apache.felix.bundleplugin.ManifestPlugin
[INFO] 
[INFO] <<< maven-bundle-plugin:2.5.4:manifest (bundle-manifest) < process-classes
@ brooklyn-dist <<<
[INFO] 
[INFO] --- maven-bundle-plugin:2.5.4:manifest (bundle-manifest) @ brooklyn-dist ---
[WARNING] Manifest org.apache.brooklyn:brooklyn-dist:jar:0.10.0-SNAPSHOT : Unused Export-Package
instructions: [brooklyn.*, org.apache.brooklyn.*] 
[INFO] 
[INFO] --- maven-resources-plugin:2.7:testResources (default-testResources) @ brooklyn-dist
---
[INFO] Using 'UTF-8' encoding to copy filtered resources.
[INFO] skip non existing resourceDirectory <https://builds.apache.org/job/brooklyn-dist-master/ws/dist/src/test/resources>
[INFO] Copying 3 resources
[INFO] 
[INFO] --- maven-compiler-plugin:3.3:testCompile (default-testCompile) @ brooklyn-dist ---
[INFO] Changes detected - recompiling the module!
[INFO] Compiling 2 source files to <https://builds.apache.org/job/brooklyn-dist-master/ws/dist/target/test-classes>
[INFO] <https://builds.apache.org/job/brooklyn-dist-master/ws/dist/src/test/java/org/apache/brooklyn/cli/BaseCliIntegrationTest.java>:
<https://builds.apache.org/job/brooklyn-dist-master/ws/dist/src/test/java/org/apache/brooklyn/cli/BaseCliIntegrationTest.java>
uses or overrides a deprecated API.
[INFO] <https://builds.apache.org/job/brooklyn-dist-master/ws/dist/src/test/java/org/apache/brooklyn/cli/BaseCliIntegrationTest.java>:
Recompile with -Xlint:deprecation for details.
[INFO] 
[INFO] --- maven-surefire-plugin:2.18.1:test (default-test) @ brooklyn-dist ---
[INFO] Surefire report directory: <https://builds.apache.org/job/brooklyn-dist-master/ws/dist/target/surefire-reports>

-------------------------------------------------------
 T E S T S
-------------------------------------------------------
Running TestSuite
Configuring TestNG with: TestNG652Configurator
2016-07-29 18:50:39,384 INFO  TESTNG RUNNING: Suite: "Surefire test" containing "0" Tests
(config: null)
2016-07-29 18:50:40,021 INFO  BrooklynLeakListener.onStart attempting to terminate all extant
ManagementContexts: name=Surefire test; includedGroups=[]; excludedGroups=[Integration, Live-sanity,
Acceptance, Live, Broken, WIP]; suiteName=Surefire suite; outDir=<https://builds.apache.org/job/brooklyn-dist-master/ws/dist/target/surefire-reports/Surefire>
suite: no org.apache.brooklyn.core.management.internal.LocalManagementContext available, so
skipped
2016-07-29 18:50:40,167 INFO  TESTNG 
===============================================
    Surefire test
    Tests run: 0, Failures: 0, Skips: 0
===============================================
2016-07-29 18:50:40,168 INFO  BrooklynLeakListener.onFinish attempting to terminate all extant
ManagementContexts: name=Surefire test; includedGroups=[]; excludedGroups=[Integration, Live-sanity,
Acceptance, Live, Broken, WIP]; suiteName=Surefire suite; outDir=<https://builds.apache.org/job/brooklyn-dist-master/ws/dist/target/surefire-reports/Surefire>
suite: no org.apache.brooklyn.core.management.internal.LocalManagementContext available, so
skipped
Tests run: 0, Failures: 0, Errors: 0, Skipped: 0, Time elapsed: 1.692 sec - in TestSuite

Results :

Tests run: 0, Failures: 0, Errors: 0, Skipped: 0

[JENKINS] Recording test results
[INFO] 
[INFO] --- maven-dependency-plugin:2.8:unpack (unpack-client-cli) @ brooklyn-dist ---
[INFO] Configured Artifact: org.apache.brooklyn:brooklyn-client-cli:bin:0.10.0-SNAPSHOT:zip
[INFO] Unpacking /home/jenkins/jenkins-slave/maven-repositories/1/org/apache/brooklyn/brooklyn-client-cli/0.10.0-SNAPSHOT/brooklyn-client-cli-0.10.0-SNAPSHOT-bin.zip
to <https://builds.apache.org/job/brooklyn-dist-master/ws/dist/target/brooklyn-client-cli-unpacked>
with includes "" and excludes ""
[INFO] 
[INFO] --- maven-jar-plugin:2.6:jar (default-jar) @ brooklyn-dist ---
[INFO] Building jar: <https://builds.apache.org/job/brooklyn-dist-master/ws/dist/target/brooklyn-dist-0.10.0-SNAPSHOT.jar>
[INFO] 
[INFO] --- maven-site-plugin:3.4:attach-descriptor (attach-descriptor) @ brooklyn-dist ---
[INFO] 
[INFO] --- maven-jar-plugin:2.6:test-jar (test-jar-creation) @ brooklyn-dist ---
[INFO] Building jar: <https://builds.apache.org/job/brooklyn-dist-master/ws/dist/target/brooklyn-dist-0.10.0-SNAPSHOT-tests.jar>
[INFO] 
[INFO] --- maven-assembly-plugin:2.5.4:single (build-distribution-dir) @ brooklyn-dist ---
[INFO] Reading assembly descriptor: src/main/config/build-distribution.xml
[INFO] Copying files to <https://builds.apache.org/job/brooklyn-dist-master/ws/dist/target/brooklyn-dist>
[INFO] 
[INFO] --- maven-assembly-plugin:2.5.4:single (build-distribution-archive) @ brooklyn-dist
---
[INFO] Reading assembly descriptor: src/main/config/build-distribution.xml
[INFO] Building tar: <https://builds.apache.org/job/brooklyn-dist-master/ws/dist/target/brooklyn-dist-0.10.0-SNAPSHOT-dist.tar.gz>
[INFO] Building zip: <https://builds.apache.org/job/brooklyn-dist-master/ws/dist/target/brooklyn-dist-0.10.0-SNAPSHOT-dist.zip>
[INFO] 
[INFO] --- apache-rat-plugin:0.11:check (default) @ brooklyn-dist ---
[INFO] 51 implicit excludes (use -debug for more details).
[INFO] Exclude: sandbox/**
[INFO] Exclude: release/**
[INFO] Exclude: README.md
[INFO] Exclude: **/nbactions.xml
[INFO] Exclude: **/nb-configuration.xml
[INFO] Exclude: **/.git/**
[INFO] Exclude: **/.gitignore
[INFO] Exclude: **/.repository/**
[INFO] Exclude: **/.idea/**
[INFO] Exclude: **/*.iml
[INFO] Exclude: **/.classpath/**
[INFO] Exclude: **/.project
[INFO] Exclude: **/.settings/**
[INFO] Exclude: **/*.log
[INFO] Exclude: **/brooklyn*.log.*
[INFO] Exclude: **/target/**
[INFO] Exclude: ignored/**
[INFO] Exclude: LICENSE.md
[INFO] Exclude: **/src/main/license/**
[INFO] Exclude: **/src/test/license/**
[INFO] Exclude: **/MANIFEST.MF
[INFO] Exclude: **/test-output/**
[INFO] Exclude: **/*.pem.pub
[INFO] Exclude: **/*.pem
[INFO] Exclude: **/*_rsa.pub
[INFO] Exclude: **/*_rsa
[INFO] Exclude: **/*.svg
[INFO] Exclude: **/*.crt
[INFO] Exclude: **/*.csr
[INFO] Exclude: **/*.key
[INFO] Exclude: **/*.key.org
[INFO] Exclude: **/*.psd
[INFO] Exclude: **/*.json
[INFO] Exclude: **/*.plxarc
[INFO] Exclude: **/src/test/resources/org/apache/brooklyn/entity/software/base/template_with_extra_substitutions.txt
[INFO] Exclude: **/src/main/resources/banner.txt
[INFO] Exclude: **/src/test/resources/ssl/certs/localhost/info.txt
[INFO] Exclude: **/src/main/history/dependencies.xml
[INFO] Exclude: **/sandbox/examples/src/main/scripts/amis.txt
[INFO] Exclude: docs/**
[INFO] Exclude: scripts/README.md
[INFO] Exclude: src/main/dist/conf/**
[INFO] Exclude: src/main/dist/README.md
[INFO] Exclude: licensing/licenses/**
[INFO] Exclude: licensing/README.md
[INFO] Exclude: licensing/*LICENSE*
[INFO] Exclude: licensing/*.autogenerated
[INFO] Exclude: licensing/projects-with-custom-licenses
[INFO] Exclude: licensing/extras-files
[INFO] 10 resources included (use -debug for more details)
[INFO] Rat check: Summary of files. Unapproved: 0 unknown: 0 generated: 0 approved: 10 licence.
[INFO] 
[INFO] --- maven-source-plugin:2.4:jar-no-fork (attach-sources) @ brooklyn-dist ---
[INFO] Building jar: <https://builds.apache.org/job/brooklyn-dist-master/ws/dist/target/brooklyn-dist-0.10.0-SNAPSHOT-sources.jar>
[INFO] 
[INFO] --- maven-source-plugin:2.4:test-jar-no-fork (attach-sources) @ brooklyn-dist ---
[INFO] Building jar: <https://builds.apache.org/job/brooklyn-dist-master/ws/dist/target/brooklyn-dist-0.10.0-SNAPSHOT-test-sources.jar>
[INFO] 
[INFO] --- maven-install-plugin:2.5.2:install (default-install) @ brooklyn-dist ---
[INFO] Installing <https://builds.apache.org/job/brooklyn-dist-master/ws/dist/target/brooklyn-dist-0.10.0-SNAPSHOT.jar>
to /home/jenkins/jenkins-slave/maven-repositories/1/org/apache/brooklyn/brooklyn-dist/0.10.0-SNAPSHOT/brooklyn-dist-0.10.0-SNAPSHOT.jar
[INFO] Installing <https://builds.apache.org/job/brooklyn-dist-master/ws/dist/pom.xml>
to /home/jenkins/jenkins-slave/maven-repositories/1/org/apache/brooklyn/brooklyn-dist/0.10.0-SNAPSHOT/brooklyn-dist-0.10.0-SNAPSHOT.pom
[INFO] Installing <https://builds.apache.org/job/brooklyn-dist-master/ws/dist/target/brooklyn-dist-0.10.0-SNAPSHOT-tests.jar>
to /home/jenkins/jenkins-slave/maven-repositories/1/org/apache/brooklyn/brooklyn-dist/0.10.0-SNAPSHOT/brooklyn-dist-0.10.0-SNAPSHOT-tests.jar
[INFO] Installing <https://builds.apache.org/job/brooklyn-dist-master/ws/dist/target/brooklyn-dist-0.10.0-SNAPSHOT-dist.tar.gz>
to /home/jenkins/jenkins-slave/maven-repositories/1/org/apache/brooklyn/brooklyn-dist/0.10.0-SNAPSHOT/brooklyn-dist-0.10.0-SNAPSHOT-dist.tar.gz
[INFO] Installing <https://builds.apache.org/job/brooklyn-dist-master/ws/dist/target/brooklyn-dist-0.10.0-SNAPSHOT-dist.zip>
to /home/jenkins/jenkins-slave/maven-repositories/1/org/apache/brooklyn/brooklyn-dist/0.10.0-SNAPSHOT/brooklyn-dist-0.10.0-SNAPSHOT-dist.zip
[INFO] Installing <https://builds.apache.org/job/brooklyn-dist-master/ws/dist/target/brooklyn-dist-0.10.0-SNAPSHOT-sources.jar>
to /home/jenkins/jenkins-slave/maven-repositories/1/org/apache/brooklyn/brooklyn-dist/0.10.0-SNAPSHOT/brooklyn-dist-0.10.0-SNAPSHOT-sources.jar
[INFO] Installing <https://builds.apache.org/job/brooklyn-dist-master/ws/dist/target/brooklyn-dist-0.10.0-SNAPSHOT-test-sources.jar>
to /home/jenkins/jenkins-slave/maven-repositories/1/org/apache/brooklyn/brooklyn-dist/0.10.0-SNAPSHOT/brooklyn-dist-0.10.0-SNAPSHOT-test-sources.jar
[INFO]                                                                         
[INFO] ------------------------------------------------------------------------
[INFO] Building Brooklyn Karaf Distribution 0.10.0-SNAPSHOT
[INFO] ------------------------------------------------------------------------
[INFO] 
[INFO] --- maven-clean-plugin:2.5:clean (default-clean) @ brooklyn-dist-karaf ---
[INFO] 
[INFO] --- maven-remote-resources-plugin:1.5:process (default) @ brooklyn-dist-karaf ---
[INFO] 
[INFO] --- maven-site-plugin:3.4:attach-descriptor (attach-descriptor) @ brooklyn-dist-karaf
---
[INFO] 
[INFO] --- maven-install-plugin:2.5.2:install (default-install) @ brooklyn-dist-karaf ---
[INFO] Installing <https://builds.apache.org/job/brooklyn-dist-master/ws/dist-karaf/pom.xml>
to /home/jenkins/jenkins-slave/maven-repositories/1/org/apache/brooklyn/brooklyn-dist-karaf/0.10.0-SNAPSHOT/brooklyn-dist-karaf-0.10.0-SNAPSHOT.pom
[INFO]                                                                         
[INFO] ------------------------------------------------------------------------
[INFO] Building Brooklyn Karaf Distro 0.10.0-SNAPSHOT
[INFO] ------------------------------------------------------------------------
[WARNING] The POM for org.apache.brooklyn:brooklyn-library-features:xml:features:0.10.0-SNAPSHOT
is missing, no dependency information available
[WARNING] The POM for org.apache.brooklyn:brooklyn-library-catalog:jar:0.10.0-SNAPSHOT is
missing, no dependency information available
[INFO] ------------------------------------------------------------------------
[INFO] Reactor Summary:
[INFO] 
[INFO] Brooklyn Downstream Project Parent ................. SUCCESS [  2.610 s]
[INFO] Brooklyn Dist Root ................................. SUCCESS [  3.711 s]
[INFO] Brooklyn All Things ................................ SUCCESS [  8.542 s]
[INFO] Brooklyn Distribution .............................. SUCCESS [ 38.436 s]
[INFO] Brooklyn Karaf Distribution ........................ SUCCESS [  0.334 s]
[INFO] Brooklyn Karaf Distro .............................. FAILURE [  0.132 s]
[INFO] Brooklyn Karaf pax-exam itest ...................... SKIPPED
[INFO] Brooklyn Vagrant Getting Started Environment ....... SKIPPED
[INFO] Brooklyn Quick-Start Project Archetype ............. SKIPPED
[INFO] Brooklyn Shared Package Files ...................... SKIPPED
[INFO] Brooklyn DEB Package ............................... SKIPPED
[INFO] ------------------------------------------------------------------------
[INFO] BUILD FAILURE
[INFO] ------------------------------------------------------------------------
[INFO] Total time: 01:03 min
[INFO] Finished at: 2016-07-29T18:51:11+00:00
[INFO] Final Memory: 73M/618M
[INFO] ------------------------------------------------------------------------
Waiting for Jenkins to finish collecting data
[ERROR] Failed to execute goal on project apache-brooklyn: Could not resolve dependencies
for project org.apache.brooklyn:apache-brooklyn:karaf-assembly:0.10.0-SNAPSHOT: The following
artifacts could not be resolved: org.apache.brooklyn:brooklyn-library-features:xml:features:0.10.0-SNAPSHOT,
org.apache.brooklyn:brooklyn-library-catalog:jar:0.10.0-SNAPSHOT: Failure to find org.apache.brooklyn:brooklyn-library-features:xml:features:0.10.0-SNAPSHOT
in http://repository.apache.org/snapshots was cached in the local repository, resolution will
not be reattempted until the update interval of Nexus has elapsed or updates are forced ->
[Help 1]
[ERROR] 
[ERROR] To see the full stack trace of the errors, re-run Maven with the -e switch.
[ERROR] Re-run Maven using the -X switch to enable full debug logging.
[ERROR] 
[ERROR] For more information about the errors and possible solutions, please read the following
articles:
[ERROR] [Help 1] http://cwiki.apache.org/confluence/display/MAVEN/DependencyResolutionException
[ERROR] 
[ERROR] After correcting the problems, you can resume the build with the command
[ERROR]   mvn <goals> -rf :apache-brooklyn
[JENKINS] Archiving <https://builds.apache.org/job/brooklyn-dist-master/ws/deb-packaging/pom.xml>
to org.apache.brooklyn/deb-packaging/0.10.0-SNAPSHOT/deb-packaging-0.10.0-SNAPSHOT.pom
[JENKINS] Archiving <https://builds.apache.org/job/brooklyn-dist-master/ws/dist/pom.xml>
to org.apache.brooklyn/brooklyn-dist/0.10.0-SNAPSHOT/brooklyn-dist-0.10.0-SNAPSHOT.pom
[JENKINS] Archiving <https://builds.apache.org/job/brooklyn-dist-master/ws/dist/target/brooklyn-dist-0.10.0-SNAPSHOT.jar>
to org.apache.brooklyn/brooklyn-dist/0.10.0-SNAPSHOT/brooklyn-dist-0.10.0-SNAPSHOT.jar
[JENKINS] Archiving <https://builds.apache.org/job/brooklyn-dist-master/ws/dist/target/brooklyn-dist-0.10.0-SNAPSHOT-tests.jar>
to org.apache.brooklyn/brooklyn-dist/0.10.0-SNAPSHOT/brooklyn-dist-0.10.0-SNAPSHOT-tests.jar
[JENKINS] Archiving <https://builds.apache.org/job/brooklyn-dist-master/ws/dist/target/brooklyn-dist-0.10.0-SNAPSHOT-dist.tar.gz>
to org.apache.brooklyn/brooklyn-dist/0.10.0-SNAPSHOT/brooklyn-dist-0.10.0-SNAPSHOT-dist.tar.gz
[JENKINS] Archiving <https://builds.apache.org/job/brooklyn-dist-master/ws/dist/target/brooklyn-dist-0.10.0-SNAPSHOT-dist.zip>
to org.apache.brooklyn/brooklyn-dist/0.10.0-SNAPSHOT/brooklyn-dist-0.10.0-SNAPSHOT-dist.zip
[JENKINS] Archiving <https://builds.apache.org/job/brooklyn-dist-master/ws/dist/target/brooklyn-dist-0.10.0-SNAPSHOT-sources.jar>
to org.apache.brooklyn/brooklyn-dist/0.10.0-SNAPSHOT/brooklyn-dist-0.10.0-SNAPSHOT-sources.jar
[JENKINS] Archiving <https://builds.apache.org/job/brooklyn-dist-master/ws/dist/target/brooklyn-dist-0.10.0-SNAPSHOT-test-sources.jar>
to org.apache.brooklyn/brooklyn-dist/0.10.0-SNAPSHOT/brooklyn-dist-0.10.0-SNAPSHOT-test-sources.jar
Compressed 110.34 MB of artifacts by 35.9% relative to #25
[JENKINS] Archiving <https://builds.apache.org/job/brooklyn-dist-master/ws/shared-packaging/pom.xml>
to org.apache.brooklyn/shared-packaging/0.10.0-SNAPSHOT/shared-packaging-0.10.0-SNAPSHOT.pom
[JENKINS] Archiving <https://builds.apache.org/job/brooklyn-dist-master/ws/archetypes/quickstart/pom.xml>
to org.apache.brooklyn/brooklyn-archetype-quickstart/0.10.0-SNAPSHOT/brooklyn-archetype-quickstart-0.10.0-SNAPSHOT.pom
[JENKINS] Archiving <https://builds.apache.org/job/brooklyn-dist-master/ws/dist-karaf/itest/pom.xml>
to org.apache.brooklyn/brooklyn-itest/0.10.0-SNAPSHOT/brooklyn-itest-0.10.0-SNAPSHOT.pom
No prior successful build to compare, so performing full copy of artifacts
[JENKINS] Archiving <https://builds.apache.org/job/brooklyn-dist-master/ws/vagrant/pom.xml>
to org.apache.brooklyn/brooklyn-vagrant/0.10.0-SNAPSHOT/brooklyn-vagrant-0.10.0-SNAPSHOT.pom
[JENKINS] Archiving <https://builds.apache.org/job/brooklyn-dist-master/ws/dist-karaf/pom.xml>
to org.apache.brooklyn/brooklyn-dist-karaf/0.10.0-SNAPSHOT/brooklyn-dist-karaf-0.10.0-SNAPSHOT.pom
No prior successful build to compare, so performing full copy of artifacts
[JENKINS] Archiving <https://builds.apache.org/job/brooklyn-dist-master/ws/dist-karaf/apache-brooklyn/pom.xml>
to org.apache.brooklyn/apache-brooklyn/0.10.0-SNAPSHOT/apache-brooklyn-0.10.0-SNAPSHOT.pom
No prior successful build to compare, so performing full copy of artifacts
[JENKINS] Archiving <https://builds.apache.org/job/brooklyn-dist-master/ws/pom.xml>
to org.apache.brooklyn/brooklyn-dist-root/0.10.0-SNAPSHOT/brooklyn-dist-root-0.10.0-SNAPSHOT.pom
[JENKINS] Archiving <https://builds.apache.org/job/brooklyn-dist-master/ws/downstream-parent/pom.xml>
to org.apache.brooklyn/brooklyn-downstream-parent/0.10.0-SNAPSHOT/brooklyn-downstream-parent-0.10.0-SNAPSHOT.pom
[JENKINS] Archiving <https://builds.apache.org/job/brooklyn-dist-master/ws/all/pom.xml>
to org.apache.brooklyn/brooklyn-all/0.10.0-SNAPSHOT/brooklyn-all-0.10.0-SNAPSHOT.pom
[JENKINS] Archiving <https://builds.apache.org/job/brooklyn-dist-master/ws/all/target/brooklyn-all-0.10.0-SNAPSHOT.jar>
to org.apache.brooklyn/brooklyn-all/0.10.0-SNAPSHOT/brooklyn-all-0.10.0-SNAPSHOT.jar
[JENKINS] Archiving <https://builds.apache.org/job/brooklyn-dist-master/ws/all/target/brooklyn-all-0.10.0-SNAPSHOT-sources.jar>
to org.apache.brooklyn/brooklyn-all/0.10.0-SNAPSHOT/brooklyn-all-0.10.0-SNAPSHOT-sources.jar
[JENKINS] Archiving <https://builds.apache.org/job/brooklyn-dist-master/ws/all/target/brooklyn-all-0.10.0-SNAPSHOT-test-sources.jar>
to org.apache.brooklyn/brooklyn-all/0.10.0-SNAPSHOT/brooklyn-all-0.10.0-SNAPSHOT-test-sources.jar
channel stopped

Mime
View raw message