brooklyn-dev mailing list archives

Site index · List index
Message view « Date » · « Thread »
Top « Date » · « Thread »
From Apache Jenkins Server <jenk...@builds.apache.org>
Subject Build failed in Jenkins: brooklyn-server-master #187
Date Mon, 18 Jul 2016 21:17:47 GMT
See <https://builds.apache.org/job/brooklyn-server-master/187/changes>

Changes:

[bostko] BROOKLYN-264: Stop app while VM still being provisioned

------------------------------------------
[...truncated 25920 lines...]
2016-07-18 21:08:51,923 WARN  Task Task[LSM.publish(Application[77x2fy89].Sensor: entity.children.removed
(org.apache.brooklyn.api.entity.Entity)=DynamicGroupImpl{id=y8ncirmfrl} @ 1468876131561);[subscription-delivery-entity-qx77x2fy89[Application[77x2fy89]]]]@Rnqggfts
is being finalized before completion
2016-07-18 21:08:51,923 WARN  Task Task[LSM.publish(Application[77x2fy89].Sensor: entity.children.removed
(org.apache.brooklyn.api.entity.Entity)=FollowTheSunPoolImpl{id=jm0d8qt4wt} @ 1468876131561);[subscription-delivery-entity-qx77x2fy89[Application[77x2fy89]]]]@dEnQW3MS
is being finalized before completion
2016-07-18 21:08:51,923 WARN  Task Task[LSM.publish(Application[77x2fy89].Sensor: entity.children.removed
(org.apache.brooklyn.api.entity.Entity)=MockContainer[A] @ 1468876131561);[subscription-delivery-entity-qx77x2fy89[Application[77x2fy89]]]]@t1pONxWp
is being finalized before completion
2016-07-18 21:08:52,007 WARN  Deprecated use of unmanaged location (SimulatedLocation{id=g64hp37fgr,
name=loc3}); will be managed automatically now but not supported in future versions
2016-07-18 21:08:52,234 INFO  FollowTheSunPolicySoakTest: cycle 1
2016-07-18 21:08:52,254 INFO  POLICY pool-model detected MockItem[item-movable10] should be
in location SimulatedLocation{id=g64hp37fgr, name=loc3} on MockContainer[container-loc3-2]
(1987.5970021237722 of 2402.9722183157483 msgs/sec), migrating
2016-07-18 21:08:52,256 INFO  POLICY pool-model detected MockItem[item-movable4] should be
in location SimulatedLocation{id=g64hp37fgr, name=loc3} on MockContainer[container-loc3-2]
(2013.6848353020291 of 2428.029081933302 msgs/sec), migrating
2016-07-18 21:08:52,258 INFO  POLICY pool-model detected MockItem[item-movable2] should be
in location SimulatedLocation{id=g64hp37fgr, name=loc3} on MockContainer[container-loc3-2]
(2010.8083037818749 of 2411.7401559916134 msgs/sec), migrating
2016-07-18 21:08:52,260 INFO  POLICY pool-model detected MockItem[item-movable3] should be
in location SimulatedLocation{id=g64hp37fgr, name=loc3} on MockContainer[container-loc3-2]
(2015.1053735430942 of 2382.665483320155 msgs/sec), migrating
2016-07-18 21:08:52,262 INFO  POLICY pool-model detected MockItem[item-movable1] should be
in location SimulatedLocation{id=g64hp37fgr, name=loc3} on MockContainer[container-loc3-2]
(1996.7991042841477 of 2409.046823557281 msgs/sec), migrating
2016-07-18 21:08:52,264 INFO  TESTNG PASSED: "Surefire test" - org.apache.brooklyn.policy.followthesun.FollowTheSunPolicySoakTest.testFollowTheSunQuickTest()
finished in 496 ms
2016-07-18 21:08:52,264 INFO  TESTNG INVOKING CONFIGURATION: "Surefire test" - @AfterMethod
org.apache.brooklyn.policy.followthesun.AbstractFollowTheSunPolicyTest.tearDown()
2016-07-18 21:08:52,301 INFO  TESTNG PASSED CONFIGURATION: "Surefire test" - @AfterMethod
org.apache.brooklyn.policy.followthesun.AbstractFollowTheSunPolicyTest.tearDown() finished
in 37 ms
2016-07-18 21:08:52,301 INFO  TESTNG INVOKING CONFIGURATION: "Surefire test" - @BeforeMethod
org.apache.brooklyn.policy.followthesun.AbstractFollowTheSunPolicyTest.setUp()
2016-07-18 21:08:52,363 INFO  No Camp-YAML parser registered for parsing catalog item DSL;
skipping DSL-parsing
2016-07-18 21:08:52,375 INFO  TESTNG PASSED CONFIGURATION: "Surefire test" - @BeforeMethod
org.apache.brooklyn.policy.followthesun.AbstractFollowTheSunPolicyTest.setUp() finished in
74 ms
2016-07-18 21:08:52,375 INFO  TESTNG INVOKING: "Surefire test" - org.apache.brooklyn.policy.followthesun.FollowTheSunPolicySoakTest.testLoadBalancingManyItemsQuickTest()
2016-07-18 21:08:52,390 WARN  Deprecated use of unmanaged location (SimulatedLocation{id=q9jwmokx2e,
name=loc1}); will be managed automatically now but not supported in future versions
2016-07-18 21:08:52,465 WARN  Deprecated use of unmanaged location (SimulatedLocation{id=n23ythnuic,
name=loc2}); will be managed automatically now but not supported in future versions
2016-07-18 21:08:52,655 INFO  FollowTheSunPolicySoakTest: cycle 1
2016-07-18 21:08:52,761 INFO  POLICY pool-model detected MockItem[item-movable7] should be
in location SimulatedLocation{id=n23ythnuic, name=loc2} on MockContainer[container-loc2-1]
(2007.209400926426 of 2215.3878383348206 msgs/sec), migrating
2016-07-18 21:08:52,763 INFO  POLICY pool-model detected MockItem[item-movable6] should be
in location SimulatedLocation{id=n23ythnuic, name=loc2} on MockContainer[container-loc2-1]
(1996.730750190017 of 2190.269033675048 msgs/sec), migrating
2016-07-18 21:08:52,765 INFO  POLICY pool-model detected MockItem[item-movable2] should be
in location SimulatedLocation{id=n23ythnuic, name=loc2} on MockContainer[container-loc2-1]
(1993.500539778587 of 2185.3642428478443 msgs/sec), migrating
2016-07-18 21:08:52,767 INFO  POLICY pool-model detected MockItem[item-movable8] should be
in location SimulatedLocation{id=n23ythnuic, name=loc2} on MockContainer[container-loc2-1]
(1996.8007204015926 of 2193.354208340766 msgs/sec), migrating
2016-07-18 21:08:52,768 INFO  POLICY pool-model detected MockItem[item-movable3] should be
in location SimulatedLocation{id=n23ythnuic, name=loc2} on MockContainer[container-loc2-1]
(2012.464936710628 of 2218.817380980121 msgs/sec), migrating
2016-07-18 21:08:52,770 INFO  POLICY pool-model detected MockItem[item-movable1] should be
in location SimulatedLocation{id=n23ythnuic, name=loc2} on MockContainer[container-loc2-1]
(1995.784955557215 of 2199.843425486513 msgs/sec), migrating
2016-07-18 21:08:52,837 INFO  TESTNG PASSED: "Surefire test" - org.apache.brooklyn.policy.followthesun.FollowTheSunPolicySoakTest.testLoadBalancingManyItemsQuickTest()
finished in 462 ms
2016-07-18 21:08:52,838 INFO  TESTNG INVOKING CONFIGURATION: "Surefire test" - @AfterMethod
org.apache.brooklyn.policy.followthesun.AbstractFollowTheSunPolicyTest.tearDown()
2016-07-18 21:08:52,863 INFO  TESTNG PASSED CONFIGURATION: "Surefire test" - @AfterMethod
org.apache.brooklyn.policy.followthesun.AbstractFollowTheSunPolicyTest.tearDown() finished
in 26 ms
2016-07-18 21:08:52,919 INFO  TESTNG 
===============================================
    Surefire test
    Tests run: 226, Failures: 1, Skips: 0
===============================================
2016-07-18 21:08:52,920 INFO  BrooklynLeakListener.onFinish attempting to terminate all extant
ManagementContexts: name=Surefire test; includedGroups=[]; excludedGroups=[Integration, Live-sanity,
Acceptance, Live, Broken, WIP]; suiteName=Surefire suite; outDir=<https://builds.apache.org/job/brooklyn-server-master/ws/policy/target/surefire-reports/Surefire>
suite: no org.apache.brooklyn.core.management.internal.LocalManagementContext available, so
skipped
SUREFIRE-859: [GC 315548K->128572K(753152K), 0.0138660 secs]
Tests run: 226, Failures: 1, Errors: 0, Skipped: 0, Time elapsed: 101.548 sec <<<
FAILURE! - in TestSuite
testLoadBalancingManyItemsQuickTest(org.apache.brooklyn.policy.loadbalancing.LoadBalancingPolicySoakTest)
 Time elapsed: 40.582 sec  <<< FAILURE!
org.apache.brooklyn.util.exceptions.PropagatedRuntimeException: failed succeeds-eventually,
89 attempts, 40003ms elapsed: AssertionError: extras=[]; missing=[MockItem[item-3]]; duplicates=[];
actualSize=29; expectedSize=30; actual=[MockItem[item-11], MockItem[item-24], MockItem[item-28],
MockItem[item-27], MockItem[item-25], MockItem[item-10], MockItem[item-19], MockItem[item-22],
MockItem[item-12], MockItem[item-18], MockItem[item-15], MockItem[item-26], MockItem[item-30],
MockItem[item-4], MockItem[item-9], MockItem[item-14], MockItem[item-29], MockItem[item-21],
MockItem[item-8], MockItem[item-5.1.1], MockItem[item-6], MockItem[item-20], MockItem[item-13],
MockItem[item-1], MockItem[item-7], MockItem[item-17], MockItem[item-23], MockItem[item-2],
MockItem[item-16]]; expected=[MockItem[item-1], MockItem[item-2], MockItem[item-3], MockItem[item-4],
MockItem[item-5.1.1], MockItem[item-6], MockItem[item-7], MockItem[item-8], MockItem[item-9],
MockItem[item-10], MockItem[item-11], MockItem[item-12], MockItem[item-13], MockItem[item-14],
MockItem[item-15], MockItem[item-16], MockItem[item-17], MockItem[item-18], MockItem[item-19],
MockItem[item-20], MockItem[item-21], MockItem[item-22], MockItem[item-23], MockItem[item-24],
MockItem[item-25], MockItem[item-26], MockItem[item-27], MockItem[item-28], MockItem[item-29],
MockItem[item-30]]; containers=[MockContainer[container-1], MockContainer[container-2], MockContainer[container-3],
MockContainer[container-4.1.1], MockContainer[container-5]]; containerRates=[269.0, 291.0,
248.0, 287.0, 328.0]; itemDistributionByContainer={MockContainer[container-1]=[MockItem[item-1],
MockItem[item-2], MockItem[item-7], MockItem[item-16], MockItem[item-17], MockItem[item-23]],
MockContainer[container-2]=[MockItem[item-15], MockItem[item-18], MockItem[item-12], MockItem[item-19],
MockItem[item-22], MockItem[item-10]], MockContainer[container-3]=[MockItem[item-28], MockItem[item-24],
MockItem[item-25], MockItem[item-11], MockItem[item-27]], MockContainer[container-4.1.1]=[MockItem[item-9],
MockItem[item-29], MockItem[item-14], MockItem[item-4], MockItem[item-30], MockItem[item-26]],
MockContainer[container-5]=[MockItem[item-3], MockItem[item-20], MockItem[item-21], MockItem[item-6],
MockItem[item-8], MockItem[item-5.1.1], MockItem[item-13]]}; itemDistributionByItem={MockItem[item-1]=MockContainer[container-1],
MockItem[item-2]=MockContainer[container-1], MockItem[item-3]=MockContainer[container-5],
MockItem[item-4]=MockContainer[container-4.1.1], MockItem[item-5.1.1]=MockContainer[container-5],
MockItem[item-6]=MockContainer[container-5], MockItem[item-7]=MockContainer[container-1],
MockItem[item-8]=MockContainer[container-5], MockItem[item-9]=MockContainer[container-4.1.1],
MockItem[item-10]=MockContainer[container-2], MockItem[item-11]=MockContainer[container-3],
MockItem[item-12]=MockContainer[container-2], MockItem[item-13]=MockContainer[container-5],
MockItem[item-14]=MockContainer[container-4.1.1], MockItem[item-15]=MockContainer[container-2],
MockItem[item-16]=MockContainer[container-1], MockItem[item-17]=MockContainer[container-1],
MockItem[item-18]=MockContainer[container-2], MockItem[item-19]=MockContainer[container-2],
MockItem[item-20]=MockContainer[container-5], MockItem[item-21]=MockContainer[container-5],
MockItem[item-22]=MockContainer[container-2], MockItem[item-23]=MockContainer[container-1],
MockItem[item-24]=MockContainer[container-3], MockItem[item-25]=MockContainer[container-3],
MockItem[item-26]=MockContainer[container-4.1.1], MockItem[item-27]=MockContainer[container-3],
MockItem[item-28]=MockContainer[container-3], MockItem[item-29]=MockContainer[container-4.1.1],
MockItem[item-30]=MockContainer[container-4.1.1]}; model=Container 'MockContainer[container-3]':

	Item 'MockItem[item-11]' (50.0)
	Item 'MockItem[item-24]' (51.0)
	Item 'MockItem[item-28]' (51.0)
	Item 'MockItem[item-27]' (46.0)
	Item 'MockItem[item-25]' (50.0)
Container 'MockContainer[container-2]': 
	Item 'MockItem[item-10]' (44.0)
	Item 'MockItem[item-19]' (49.0)
	Item 'MockItem[item-22]' (49.0)
	Item 'MockItem[item-12]' (49.0)
	Item 'MockItem[item-18]' (50.0)
	Item 'MockItem[item-15]' (50.0)
Container 'MockContainer[container-4.1.1]': 
	Item 'MockItem[item-26]' (46.0)
	Item 'MockItem[item-30]' (48.0)
	Item 'MockItem[item-4]' (48.0)
	Item 'MockItem[item-9]' (49.0)
	Item 'MockItem[item-14]' (48.0)
	Item 'MockItem[item-29]' (48.0)
Container 'MockContainer[container-5]': 
	Item 'MockItem[item-21]' (47.0)
	Item 'MockItem[item-8]' (46.0)
	Item 'MockItem[item-5.1.1]' (46.0)
	Item 'MockItem[item-6]' (47.0)
	Item 'MockItem[item-20]' (47.0)
	Item 'MockItem[item-13]' (46.0)
Container 'MockContainer[container-1]': 
	Item 'MockItem[item-1]' (45.0)
	Item 'MockItem[item-7]' (45.0)
	Item 'MockItem[item-17]' (45.0)
	Item 'MockItem[item-23]' (45.0)
	Item 'MockItem[item-2]' (44.0)
	Item 'MockItem[item-16]' (45.0)
; totalMoves=56; lastMoveTime=2016-07-18 21:07:47.016; itemRates=[45, 44, 49, 48, 46, 47,
45, 46, 49, 44, 50, 49, 46, 48, 50, 45, 45, 50, 49, 47, 47, 49, 45, 51, 50, 46, 46, 51, 48,
48]
	at org.apache.brooklyn.test.Asserts.fail(Asserts.java:724)
	at org.apache.brooklyn.test.Asserts.assertTrue(Asserts.java:703)
	at org.apache.brooklyn.test.Asserts.assertEqualsIgnoringOrder(Asserts.java:746)
	at org.apache.brooklyn.policy.loadbalancing.LoadBalancingPolicySoakTest$1.run(LoadBalancingPolicySoakTest.java:203)
	at org.apache.brooklyn.test.Asserts$RunnableAdapter.call(Asserts.java:1285)
	at org.apache.brooklyn.test.Asserts.succeedsEventually(Asserts.java:934)
	at org.apache.brooklyn.test.Asserts.succeedsEventually(Asserts.java:858)
	at org.apache.brooklyn.policy.loadbalancing.LoadBalancingPolicySoakTest.runLoadBalancingSoakTest(LoadBalancingPolicySoakTest.java:178)
	at org.apache.brooklyn.policy.loadbalancing.LoadBalancingPolicySoakTest.testLoadBalancingManyItemsQuickTest(LoadBalancingPolicySoakTest.java:72)


Results :

Failed tests: 
  LoadBalancingPolicySoakTest.testLoadBalancingManyItemsQuickTest:72->runLoadBalancingSoakTest:178
» PropagatedRuntime

Tests run: 226, Failures: 1, Errors: 0, Skipped: 0

[JENKINS] Recording test results
[INFO] ------------------------------------------------------------------------
[INFO] Reactor Summary:
[INFO] 
[INFO] Brooklyn Server Root ............................... SUCCESS [ 24.490 s]
[INFO] Brooklyn Parent Project ............................ SUCCESS [ 32.183 s]
[INFO] Brooklyn Test Support Utilities .................... SUCCESS [ 48.588 s]
[INFO] Brooklyn Logback Includable Configuration .......... SUCCESS [ 10.138 s]
[INFO] Brooklyn Common Utilities .......................... SUCCESS [02:40 min]
[INFO] Brooklyn API ....................................... SUCCESS [ 28.329 s]
[INFO] CAMP Server Parent Project ......................... SUCCESS [  2.241 s]
[INFO] CAMP Base .......................................... SUCCESS [ 24.153 s]
[INFO] Brooklyn Test Support .............................. SUCCESS [ 20.356 s]
[INFO] Brooklyn REST Swagger Apidoc Utilities ............. SUCCESS [ 15.985 s]
[INFO] Brooklyn Logback Configuration ..................... SUCCESS [  9.266 s]
[INFO] CAMP Server ........................................ SUCCESS [ 39.354 s]
[INFO] Brooklyn Felix Runtime ............................. SUCCESS [ 14.479 s]
[INFO] Brooklyn Groovy Utilities .......................... SUCCESS [ 28.599 s]
[INFO] Brooklyn Core ...................................... SUCCESS [03:46 min]
[INFO] Brooklyn Policies .................................. FAILURE [01:54 min]
[INFO] Brooklyn WinRM Software Entities ................... SKIPPED
[INFO] Brooklyn Secure JMXMP Agent ........................ SKIPPED
[INFO] Brooklyn JMX RMI Agent ............................. SKIPPED
[INFO] Brooklyn Jclouds Location Targets .................. SKIPPED
[INFO] Brooklyn Software Base ............................. SKIPPED
[INFO] Brooklyn CAMP REST API ............................. SKIPPED
[INFO] Brooklyn Hazelcast Storage ......................... SKIPPED
[INFO] Brooklyn Launcher Common ........................... SKIPPED
[INFO] Brooklyn REST API .................................. SKIPPED
[INFO] Brooklyn REST Resources ............................ SKIPPED
[INFO] Brooklyn REST Server ............................... SKIPPED
[INFO] Brooklyn Launcher .................................. SKIPPED
[INFO] Brooklyn Command Line Interface .................... SKIPPED
[INFO] Brooklyn REST Client ............................... SKIPPED
[INFO] Brooklyn Test Framework ............................ SKIPPED
[INFO] Brooklyn OSGi init ................................. SKIPPED
[INFO] Brooklyn Karaf ..................................... SKIPPED
[INFO] Jetty config fragment .............................. SKIPPED
[INFO] Brooklyn Karaf Features ............................ SKIPPED
[INFO] Brooklyn Karaf Shell Commands ...................... SKIPPED
[INFO] Brooklyn Karaf Distro .............................. SKIPPED
[INFO] Brooklyn Karaf pax-exam itest ...................... SKIPPED
[INFO] ------------------------------------------------------------------------
[INFO] BUILD FAILURE
[INFO] ------------------------------------------------------------------------
[INFO] Total time: 16:38 min
[INFO] Finished at: 2016-07-18T21:10:17+00:00
[INFO] Final Memory: 96M/488M
[INFO] ------------------------------------------------------------------------
Waiting for Jenkins to finish collecting data
[ERROR] Failed to execute goal org.apache.maven.plugins:maven-surefire-plugin:2.18.1:test
(default-test) on project brooklyn-policy: There are test failures.
[ERROR] 
[ERROR] Please refer to <https://builds.apache.org/job/brooklyn-server-master/ws/policy/target/surefire-reports>
for the individual test results.
[ERROR] -> [Help 1]
[ERROR] 
[ERROR] To see the full stack trace of the errors, re-run Maven with the -e switch.
[ERROR] Re-run Maven using the -X switch to enable full debug logging.
[ERROR] 
[ERROR] For more information about the errors and possible solutions, please read the following
articles:
[ERROR] [Help 1] http://cwiki.apache.org/confluence/display/MAVEN/MojoFailureException
[ERROR] 
[ERROR] After correcting the problems, you can resume the build with the command
[ERROR]   mvn <goals> -rf :brooklyn-policy
[JENKINS] Archiving <https://builds.apache.org/job/brooklyn-server-master/ws/policy/pom.xml>
to org.apache.brooklyn/brooklyn-policy/0.10.0-SNAPSHOT/brooklyn-policy-0.10.0-SNAPSHOT.pom
[JENKINS] Archiving <https://builds.apache.org/job/brooklyn-server-master/ws/storage/hazelcast/pom.xml>
to org.apache.brooklyn/brooklyn-storage-hazelcast/0.10.0-SNAPSHOT/brooklyn-storage-hazelcast-0.10.0-SNAPSHOT.pom
[JENKINS] Archiving <https://builds.apache.org/job/brooklyn-server-master/ws/test-framework/pom.xml>
to org.apache.brooklyn/brooklyn-test-framework/0.10.0-SNAPSHOT/brooklyn-test-framework-0.10.0-SNAPSHOT.pom
[JENKINS] Archiving <https://builds.apache.org/job/brooklyn-server-master/ws/karaf/init/pom.xml>
to org.apache.brooklyn/brooklyn-karaf-init/0.10.0-SNAPSHOT/brooklyn-karaf-init-0.10.0-SNAPSHOT.pom
[JENKINS] Archiving <https://builds.apache.org/job/brooklyn-server-master/ws/pom.xml>
to org.apache.brooklyn/brooklyn-server/0.10.0-SNAPSHOT/brooklyn-server-0.10.0-SNAPSHOT.pom
No artifacts from brooklyn-server-master » Brooklyn Server Root #188 to compare, so performing
full copy of artifacts
[JENKINS] Archiving <https://builds.apache.org/job/brooklyn-server-master/ws/karaf/commands/pom.xml>
to org.apache.brooklyn/brooklyn-commands/0.10.0-SNAPSHOT/brooklyn-commands-0.10.0-SNAPSHOT.pom
[JENKINS] Archiving <https://builds.apache.org/job/brooklyn-server-master/ws/rest/rest-api/pom.xml>
to org.apache.brooklyn/brooklyn-rest-api/0.10.0-SNAPSHOT/brooklyn-rest-api-0.10.0-SNAPSHOT.pom
[JENKINS] Archiving <https://builds.apache.org/job/brooklyn-server-master/ws/core/pom.xml>
to org.apache.brooklyn/brooklyn-core/0.10.0-SNAPSHOT/brooklyn-core-0.10.0-SNAPSHOT.pom
[JENKINS] Archiving <https://builds.apache.org/job/brooklyn-server-master/ws/core/target/brooklyn-core-0.10.0-SNAPSHOT.jar>
to org.apache.brooklyn/brooklyn-core/0.10.0-SNAPSHOT/brooklyn-core-0.10.0-SNAPSHOT.jar
[JENKINS] Archiving <https://builds.apache.org/job/brooklyn-server-master/ws/core/target/brooklyn-core-0.10.0-SNAPSHOT-tests.jar>
to org.apache.brooklyn/brooklyn-core/0.10.0-SNAPSHOT/brooklyn-core-0.10.0-SNAPSHOT-tests.jar
[JENKINS] Archiving <https://builds.apache.org/job/brooklyn-server-master/ws/core/target/brooklyn-core-0.10.0-SNAPSHOT-sources.jar>
to org.apache.brooklyn/brooklyn-core/0.10.0-SNAPSHOT/brooklyn-core-0.10.0-SNAPSHOT-sources.jar
[JENKINS] Archiving <https://builds.apache.org/job/brooklyn-server-master/ws/core/target/brooklyn-core-0.10.0-SNAPSHOT-test-sources.jar>
to org.apache.brooklyn/brooklyn-core/0.10.0-SNAPSHOT/brooklyn-core-0.10.0-SNAPSHOT-test-sources.jar
[JENKINS] Archiving <https://builds.apache.org/job/brooklyn-server-master/ws/logging/logback-xml/pom.xml>
to org.apache.brooklyn/brooklyn-logback-xml/0.10.0-SNAPSHOT/brooklyn-logback-xml-0.10.0-SNAPSHOT.pom
[JENKINS] Archiving <https://builds.apache.org/job/brooklyn-server-master/ws/logging/logback-xml/target/brooklyn-logback-xml-0.10.0-SNAPSHOT.jar>
to org.apache.brooklyn/brooklyn-logback-xml/0.10.0-SNAPSHOT/brooklyn-logback-xml-0.10.0-SNAPSHOT.jar
[JENKINS] Archiving <https://builds.apache.org/job/brooklyn-server-master/ws/logging/logback-xml/target/brooklyn-logback-xml-0.10.0-SNAPSHOT-sources.jar>
to org.apache.brooklyn/brooklyn-logback-xml/0.10.0-SNAPSHOT/brooklyn-logback-xml-0.10.0-SNAPSHOT-sources.jar
[JENKINS] Archiving <https://builds.apache.org/job/brooklyn-server-master/ws/logging/logback-xml/target/brooklyn-logback-xml-0.10.0-SNAPSHOT-test-sources.jar>
to org.apache.brooklyn/brooklyn-logback-xml/0.10.0-SNAPSHOT/brooklyn-logback-xml-0.10.0-SNAPSHOT-test-sources.jar
No artifacts from brooklyn-server-master » Brooklyn Logback Configuration #188 to compare,
so performing full copy of artifacts
[JENKINS] Archiving <https://builds.apache.org/job/brooklyn-server-master/ws/karaf/features/pom.xml>
to org.apache.brooklyn/brooklyn-features/0.10.0-SNAPSHOT/brooklyn-features-0.10.0-SNAPSHOT.pom
[JENKINS] Archiving <https://builds.apache.org/job/brooklyn-server-master/ws/rest/rest-resources/pom.xml>
to org.apache.brooklyn/brooklyn-rest-resources/0.10.0-SNAPSHOT/brooklyn-rest-resources-0.10.0-SNAPSHOT.pom
[JENKINS] Archiving <https://builds.apache.org/job/brooklyn-server-master/ws/camp/camp-server/pom.xml>
to org.apache.brooklyn.camp/camp-server/0.10.0-SNAPSHOT/camp-server-0.10.0-SNAPSHOT.pom
[JENKINS] Archiving <https://builds.apache.org/job/brooklyn-server-master/ws/camp/camp-server/target/camp-server-0.10.0-SNAPSHOT.jar>
to org.apache.brooklyn.camp/camp-server/0.10.0-SNAPSHOT/camp-server-0.10.0-SNAPSHOT.jar
[JENKINS] Archiving <https://builds.apache.org/job/brooklyn-server-master/ws/camp/camp-server/target/camp-server-0.10.0-SNAPSHOT-tests.jar>
to org.apache.brooklyn.camp/camp-server/0.10.0-SNAPSHOT/camp-server-0.10.0-SNAPSHOT-tests.jar
[JENKINS] Archiving <https://builds.apache.org/job/brooklyn-server-master/ws/camp/camp-server/target/camp-server-0.10.0-SNAPSHOT-sources.jar>
to org.apache.brooklyn.camp/camp-server/0.10.0-SNAPSHOT/camp-server-0.10.0-SNAPSHOT-sources.jar
[JENKINS] Archiving <https://builds.apache.org/job/brooklyn-server-master/ws/camp/camp-server/target/camp-server-0.10.0-SNAPSHOT-test-sources.jar>
to org.apache.brooklyn.camp/camp-server/0.10.0-SNAPSHOT/camp-server-0.10.0-SNAPSHOT-test-sources.jar
No artifacts from brooklyn-server-master » CAMP Server #188 to compare, so performing full
copy of artifacts
[JENKINS] Archiving <https://builds.apache.org/job/brooklyn-server-master/ws/launcher-common/pom.xml>
to org.apache.brooklyn/brooklyn-launcher-common/0.10.0-SNAPSHOT/brooklyn-launcher-common-0.10.0-SNAPSHOT.pom
[JENKINS] Archiving <https://builds.apache.org/job/brooklyn-server-master/ws/utils/groovy/pom.xml>
to org.apache.brooklyn/brooklyn-utils-groovy/0.10.0-SNAPSHOT/brooklyn-utils-groovy-0.10.0-SNAPSHOT.pom
[JENKINS] Archiving <https://builds.apache.org/job/brooklyn-server-master/ws/utils/groovy/target/brooklyn-utils-groovy-0.10.0-SNAPSHOT.jar>
to org.apache.brooklyn/brooklyn-utils-groovy/0.10.0-SNAPSHOT/brooklyn-utils-groovy-0.10.0-SNAPSHOT.jar
[JENKINS] Archiving <https://builds.apache.org/job/brooklyn-server-master/ws/utils/groovy/target/brooklyn-utils-groovy-0.10.0-SNAPSHOT-tests.jar>
to org.apache.brooklyn/brooklyn-utils-groovy/0.10.0-SNAPSHOT/brooklyn-utils-groovy-0.10.0-SNAPSHOT-tests.jar
[JENKINS] Archiving <https://builds.apache.org/job/brooklyn-server-master/ws/utils/groovy/target/brooklyn-utils-groovy-0.10.0-SNAPSHOT-sources.jar>
to org.apache.brooklyn/brooklyn-utils-groovy/0.10.0-SNAPSHOT/brooklyn-utils-groovy-0.10.0-SNAPSHOT-sources.jar
[JENKINS] Archiving <https://builds.apache.org/job/brooklyn-server-master/ws/utils/groovy/target/brooklyn-utils-groovy-0.10.0-SNAPSHOT-test-sources.jar>
to org.apache.brooklyn/brooklyn-utils-groovy/0.10.0-SNAPSHOT/brooklyn-utils-groovy-0.10.0-SNAPSHOT-test-sources.jar
No artifacts from brooklyn-server-master » Brooklyn Groovy Utilities #188 to compare, so
performing full copy of artifacts
[JENKINS] Archiving <https://builds.apache.org/job/brooklyn-server-master/ws/utils/common/pom.xml>
to org.apache.brooklyn/brooklyn-utils-common/0.10.0-SNAPSHOT/brooklyn-utils-common-0.10.0-SNAPSHOT.pom
[JENKINS] Archiving <https://builds.apache.org/job/brooklyn-server-master/ws/utils/common/target/brooklyn-utils-common-0.10.0-SNAPSHOT.jar>
to org.apache.brooklyn/brooklyn-utils-common/0.10.0-SNAPSHOT/brooklyn-utils-common-0.10.0-SNAPSHOT.jar
[JENKINS] Archiving <https://builds.apache.org/job/brooklyn-server-master/ws/utils/common/target/brooklyn-utils-common-0.10.0-SNAPSHOT-tests.jar>
to org.apache.brooklyn/brooklyn-utils-common/0.10.0-SNAPSHOT/brooklyn-utils-common-0.10.0-SNAPSHOT-tests.jar
[JENKINS] Archiving <https://builds.apache.org/job/brooklyn-server-master/ws/utils/common/target/brooklyn-utils-common-0.10.0-SNAPSHOT-sources.jar>
to org.apache.brooklyn/brooklyn-utils-common/0.10.0-SNAPSHOT/brooklyn-utils-common-0.10.0-SNAPSHOT-sources.jar
[JENKINS] Archiving <https://builds.apache.org/job/brooklyn-server-master/ws/utils/common/target/brooklyn-utils-common-0.10.0-SNAPSHOT-test-sources.jar>
to org.apache.brooklyn/brooklyn-utils-common/0.10.0-SNAPSHOT/brooklyn-utils-common-0.10.0-SNAPSHOT-test-sources.jar
No artifacts from brooklyn-server-master » Brooklyn Common Utilities #188 to compare, so
performing full copy of artifacts
[JENKINS] Archiving <https://builds.apache.org/job/brooklyn-server-master/ws/locations/jclouds/pom.xml>
to org.apache.brooklyn/brooklyn-locations-jclouds/0.10.0-SNAPSHOT/brooklyn-locations-jclouds-0.10.0-SNAPSHOT.pom
[JENKINS] Archiving <https://builds.apache.org/job/brooklyn-server-master/ws/test-support/pom.xml>
to org.apache.brooklyn/brooklyn-test-support/0.10.0-SNAPSHOT/brooklyn-test-support-0.10.0-SNAPSHOT.pom
[JENKINS] Archiving <https://builds.apache.org/job/brooklyn-server-master/ws/test-support/target/brooklyn-test-support-0.10.0-SNAPSHOT.jar>
to org.apache.brooklyn/brooklyn-test-support/0.10.0-SNAPSHOT/brooklyn-test-support-0.10.0-SNAPSHOT.jar
[JENKINS] Archiving <https://builds.apache.org/job/brooklyn-server-master/ws/test-support/target/brooklyn-test-support-0.10.0-SNAPSHOT-sources.jar>
to org.apache.brooklyn/brooklyn-test-support/0.10.0-SNAPSHOT/brooklyn-test-support-0.10.0-SNAPSHOT-sources.jar
[JENKINS] Archiving <https://builds.apache.org/job/brooklyn-server-master/ws/test-support/target/brooklyn-test-support-0.10.0-SNAPSHOT-test-sources.jar>
to org.apache.brooklyn/brooklyn-test-support/0.10.0-SNAPSHOT/brooklyn-test-support-0.10.0-SNAPSHOT-test-sources.jar
No artifacts from brooklyn-server-master » Brooklyn Test Support #188 to compare, so performing
full copy of artifacts
[JENKINS] Archiving <https://builds.apache.org/job/brooklyn-server-master/ws/karaf/pom.xml>
to org.apache.brooklyn/brooklyn-karaf/0.10.0-SNAPSHOT/brooklyn-karaf-0.10.0-SNAPSHOT.pom
[JENKINS] Archiving <https://builds.apache.org/job/brooklyn-server-master/ws/utils/rt-felix/pom.xml>
to org.apache.brooklyn/brooklyn-rt-felix/0.10.0-SNAPSHOT/brooklyn-rt-felix-0.10.0-SNAPSHOT.pom
[JENKINS] Archiving <https://builds.apache.org/job/brooklyn-server-master/ws/utils/rt-felix/target/brooklyn-rt-felix-0.10.0-SNAPSHOT.jar>
to org.apache.brooklyn/brooklyn-rt-felix/0.10.0-SNAPSHOT/brooklyn-rt-felix-0.10.0-SNAPSHOT.jar
[JENKINS] Archiving <https://builds.apache.org/job/brooklyn-server-master/ws/utils/rt-felix/target/brooklyn-rt-felix-0.10.0-SNAPSHOT-tests.jar>
to org.apache.brooklyn/brooklyn-rt-felix/0.10.0-SNAPSHOT/brooklyn-rt-felix-0.10.0-SNAPSHOT-tests.jar
[JENKINS] Archiving <https://builds.apache.org/job/brooklyn-server-master/ws/utils/rt-felix/target/brooklyn-rt-felix-0.10.0-SNAPSHOT-sources.jar>
to org.apache.brooklyn/brooklyn-rt-felix/0.10.0-SNAPSHOT/brooklyn-rt-felix-0.10.0-SNAPSHOT-sources.jar
[JENKINS] Archiving <https://builds.apache.org/job/brooklyn-server-master/ws/utils/rt-felix/target/brooklyn-rt-felix-0.10.0-SNAPSHOT-test-sources.jar>
to org.apache.brooklyn/brooklyn-rt-felix/0.10.0-SNAPSHOT/brooklyn-rt-felix-0.10.0-SNAPSHOT-test-sources.jar
No artifacts from brooklyn-server-master » Brooklyn Felix Runtime #188 to compare, so performing
full copy of artifacts
[JENKINS] Archiving <https://builds.apache.org/job/brooklyn-server-master/ws/karaf/itest/pom.xml>
to org.apache.brooklyn/brooklyn-itest/0.10.0-SNAPSHOT/brooklyn-itest-0.10.0-SNAPSHOT.pom
[JENKINS] Archiving <https://builds.apache.org/job/brooklyn-server-master/ws/software/winrm/pom.xml>
to org.apache.brooklyn/brooklyn-software-winrm/0.10.0-SNAPSHOT/brooklyn-software-winrm-0.10.0-SNAPSHOT.pom
[JENKINS] Archiving <https://builds.apache.org/job/brooklyn-server-master/ws/rest/rest-server/pom.xml>
to org.apache.brooklyn/brooklyn-rest-server/0.10.0-SNAPSHOT/brooklyn-rest-server-0.10.0-SNAPSHOT.pom
[JENKINS] Archiving <https://builds.apache.org/job/brooklyn-server-master/ws/camp/camp-base/pom.xml>
to org.apache.brooklyn.camp/camp-base/0.10.0-SNAPSHOT/camp-base-0.10.0-SNAPSHOT.pom
[JENKINS] Archiving <https://builds.apache.org/job/brooklyn-server-master/ws/camp/camp-base/target/camp-base-0.10.0-SNAPSHOT.jar>
to org.apache.brooklyn.camp/camp-base/0.10.0-SNAPSHOT/camp-base-0.10.0-SNAPSHOT.jar
[JENKINS] Archiving <https://builds.apache.org/job/brooklyn-server-master/ws/camp/camp-base/target/camp-base-0.10.0-SNAPSHOT-tests.jar>
to org.apache.brooklyn.camp/camp-base/0.10.0-SNAPSHOT/camp-base-0.10.0-SNAPSHOT-tests.jar
[JENKINS] Archiving <https://builds.apache.org/job/brooklyn-server-master/ws/camp/camp-base/target/camp-base-0.10.0-SNAPSHOT-sources.jar>
to org.apache.brooklyn.camp/camp-base/0.10.0-SNAPSHOT/camp-base-0.10.0-SNAPSHOT-sources.jar
[JENKINS] Archiving <https://builds.apache.org/job/brooklyn-server-master/ws/camp/camp-base/target/camp-base-0.10.0-SNAPSHOT-test-sources.jar>
to org.apache.brooklyn.camp/camp-base/0.10.0-SNAPSHOT/camp-base-0.10.0-SNAPSHOT-test-sources.jar
No artifacts from brooklyn-server-master » CAMP Base #188 to compare, so performing full
copy of artifacts
[JENKINS] Archiving <https://builds.apache.org/job/brooklyn-server-master/ws/rest/rest-client/pom.xml>
to org.apache.brooklyn/brooklyn-rest-client/0.10.0-SNAPSHOT/brooklyn-rest-client-0.10.0-SNAPSHOT.pom
[JENKINS] Archiving <https://builds.apache.org/job/brooklyn-server-master/ws/karaf/apache-brooklyn/pom.xml>
to org.apache.brooklyn/apache-brooklyn/0.10.0-SNAPSHOT/apache-brooklyn-0.10.0-SNAPSHOT.pom
[JENKINS] Archiving <https://builds.apache.org/job/brooklyn-server-master/ws/utils/jmx/jmxmp-ssl-agent/pom.xml>
to org.apache.brooklyn/brooklyn-jmxmp-agent/0.10.0-SNAPSHOT/brooklyn-jmxmp-agent-0.10.0-SNAPSHOT.pom
[JENKINS] Archiving <https://builds.apache.org/job/brooklyn-server-master/ws/utils/jmx/jmxrmi-agent/pom.xml>
to org.apache.brooklyn/brooklyn-jmxrmi-agent/0.10.0-SNAPSHOT/brooklyn-jmxrmi-agent-0.10.0-SNAPSHOT.pom
[JENKINS] Archiving <https://builds.apache.org/job/brooklyn-server-master/ws/camp/camp-brooklyn/pom.xml>
to org.apache.brooklyn/brooklyn-camp/0.10.0-SNAPSHOT/brooklyn-camp-0.10.0-SNAPSHOT.pom
[JENKINS] Archiving <https://builds.apache.org/job/brooklyn-server-master/ws/parent/pom.xml>
to org.apache.brooklyn/brooklyn-parent/0.10.0-SNAPSHOT/brooklyn-parent-0.10.0-SNAPSHOT.pom
No artifacts from brooklyn-server-master » Brooklyn Parent Project #188 to compare, so performing
full copy of artifacts
[JENKINS] Archiving <https://builds.apache.org/job/brooklyn-server-master/ws/server-cli/pom.xml>
to org.apache.brooklyn/brooklyn-cli/0.10.0-SNAPSHOT/brooklyn-cli-0.10.0-SNAPSHOT.pom
[JENKINS] Archiving <https://builds.apache.org/job/brooklyn-server-master/ws/software/base/pom.xml>
to org.apache.brooklyn/brooklyn-software-base/0.10.0-SNAPSHOT/brooklyn-software-base-0.10.0-SNAPSHOT.pom
[JENKINS] Archiving <https://builds.apache.org/job/brooklyn-server-master/ws/logging/logback-includes/pom.xml>
to org.apache.brooklyn/brooklyn-logback-includes/0.10.0-SNAPSHOT/brooklyn-logback-includes-0.10.0-SNAPSHOT.pom
[JENKINS] Archiving <https://builds.apache.org/job/brooklyn-server-master/ws/logging/logback-includes/target/brooklyn-logback-includes-0.10.0-SNAPSHOT.jar>
to org.apache.brooklyn/brooklyn-logback-includes/0.10.0-SNAPSHOT/brooklyn-logback-includes-0.10.0-SNAPSHOT.jar
[JENKINS] Archiving <https://builds.apache.org/job/brooklyn-server-master/ws/logging/logback-includes/target/brooklyn-logback-includes-0.10.0-SNAPSHOT-sources.jar>
to org.apache.brooklyn/brooklyn-logback-includes/0.10.0-SNAPSHOT/brooklyn-logback-includes-0.10.0-SNAPSHOT-sources.jar
[JENKINS] Archiving <https://builds.apache.org/job/brooklyn-server-master/ws/logging/logback-includes/target/brooklyn-logback-includes-0.10.0-SNAPSHOT-test-sources.jar>
to org.apache.brooklyn/brooklyn-logback-includes/0.10.0-SNAPSHOT/brooklyn-logback-includes-0.10.0-SNAPSHOT-test-sources.jar
No artifacts from brooklyn-server-master » Brooklyn Logback Includable Configuration #188
to compare, so performing full copy of artifacts
[JENKINS] Archiving <https://builds.apache.org/job/brooklyn-server-master/ws/launcher/pom.xml>
to org.apache.brooklyn/brooklyn-launcher/0.10.0-SNAPSHOT/brooklyn-launcher-0.10.0-SNAPSHOT.pom
[JENKINS] Archiving <https://builds.apache.org/job/brooklyn-server-master/ws/karaf/jetty-config/pom.xml>
to org.apache.brooklyn/brooklyn-karaf-jetty-config/0.10.0-SNAPSHOT/brooklyn-karaf-jetty-config-0.10.0-SNAPSHOT.pom
[JENKINS] Archiving <https://builds.apache.org/job/brooklyn-server-master/ws/utils/rest-swagger/pom.xml>
to org.apache.brooklyn/brooklyn-utils-rest-swagger/0.10.0-SNAPSHOT/brooklyn-utils-rest-swagger-0.10.0-SNAPSHOT.pom
[JENKINS] Archiving <https://builds.apache.org/job/brooklyn-server-master/ws/utils/rest-swagger/target/brooklyn-utils-rest-swagger-0.10.0-SNAPSHOT.jar>
to org.apache.brooklyn/brooklyn-utils-rest-swagger/0.10.0-SNAPSHOT/brooklyn-utils-rest-swagger-0.10.0-SNAPSHOT.jar
[JENKINS] Archiving <https://builds.apache.org/job/brooklyn-server-master/ws/utils/rest-swagger/target/brooklyn-utils-rest-swagger-0.10.0-SNAPSHOT-sources.jar>
to org.apache.brooklyn/brooklyn-utils-rest-swagger/0.10.0-SNAPSHOT/brooklyn-utils-rest-swagger-0.10.0-SNAPSHOT-sources.jar
[JENKINS] Archiving <https://builds.apache.org/job/brooklyn-server-master/ws/utils/rest-swagger/target/brooklyn-utils-rest-swagger-0.10.0-SNAPSHOT-test-sources.jar>
to org.apache.brooklyn/brooklyn-utils-rest-swagger/0.10.0-SNAPSHOT/brooklyn-utils-rest-swagger-0.10.0-SNAPSHOT-test-sources.jar
No artifacts from brooklyn-server-master » Brooklyn REST Swagger Apidoc Utilities #188 to
compare, so performing full copy of artifacts
[JENKINS] Archiving <https://builds.apache.org/job/brooklyn-server-master/ws/utils/test-support/pom.xml>
to org.apache.brooklyn/brooklyn-utils-test-support/0.10.0-SNAPSHOT/brooklyn-utils-test-support-0.10.0-SNAPSHOT.pom
[JENKINS] Archiving <https://builds.apache.org/job/brooklyn-server-master/ws/utils/test-support/target/brooklyn-utils-test-support-0.10.0-SNAPSHOT.jar>
to org.apache.brooklyn/brooklyn-utils-test-support/0.10.0-SNAPSHOT/brooklyn-utils-test-support-0.10.0-SNAPSHOT.jar
[JENKINS] Archiving <https://builds.apache.org/job/brooklyn-server-master/ws/utils/test-support/target/brooklyn-utils-test-support-0.10.0-SNAPSHOT-sources.jar>
to org.apache.brooklyn/brooklyn-utils-test-support/0.10.0-SNAPSHOT/brooklyn-utils-test-support-0.10.0-SNAPSHOT-sources.jar
[JENKINS] Archiving <https://builds.apache.org/job/brooklyn-server-master/ws/utils/test-support/target/brooklyn-utils-test-support-0.10.0-SNAPSHOT-test-sources.jar>
to org.apache.brooklyn/brooklyn-utils-test-support/0.10.0-SNAPSHOT/brooklyn-utils-test-support-0.10.0-SNAPSHOT-test-sources.jar
No artifacts from brooklyn-server-master » Brooklyn Test Support Utilities #188 to compare,
so performing full copy of artifacts
[JENKINS] Archiving <https://builds.apache.org/job/brooklyn-server-master/ws/camp/pom.xml>
to org.apache.brooklyn.camp/camp-parent/0.10.0-SNAPSHOT/camp-parent-0.10.0-SNAPSHOT.pom
No artifacts from brooklyn-server-master » CAMP Server Parent Project #188 to compare, so
performing full copy of artifacts
[JENKINS] Archiving <https://builds.apache.org/job/brooklyn-server-master/ws/api/pom.xml>
to org.apache.brooklyn/brooklyn-api/0.10.0-SNAPSHOT/brooklyn-api-0.10.0-SNAPSHOT.pom
[JENKINS] Archiving <https://builds.apache.org/job/brooklyn-server-master/ws/api/target/brooklyn-api-0.10.0-SNAPSHOT.jar>
to org.apache.brooklyn/brooklyn-api/0.10.0-SNAPSHOT/brooklyn-api-0.10.0-SNAPSHOT.jar
[JENKINS] Archiving <https://builds.apache.org/job/brooklyn-server-master/ws/api/target/brooklyn-api-0.10.0-SNAPSHOT-sources.jar>
to org.apache.brooklyn/brooklyn-api/0.10.0-SNAPSHOT/brooklyn-api-0.10.0-SNAPSHOT-sources.jar
[JENKINS] Archiving <https://builds.apache.org/job/brooklyn-server-master/ws/api/target/brooklyn-api-0.10.0-SNAPSHOT-test-sources.jar>
to org.apache.brooklyn/brooklyn-api/0.10.0-SNAPSHOT/brooklyn-api-0.10.0-SNAPSHOT-test-sources.jar
No artifacts from brooklyn-server-master » Brooklyn API #188 to compare, so performing full
copy of artifacts
channel stopped

Mime
View raw message