brooklyn-dev mailing list archives

Site index · List index
Message view « Date » · « Thread »
Top « Date » · « Thread »
From Apache Jenkins Server <jenk...@builds.apache.org>
Subject Build failed in Jenkins: brooklyn-server-master #134
Date Wed, 15 Jun 2016 23:02:26 GMT
See <https://builds.apache.org/job/brooklyn-server-master/134/changes>

Changes:

[kiuby88.programming] Check the required open port for BrooklynNode

[kiuby88.programming] Inferring required open ports depending on config key value type

[kiuby88.programming] Solving concurrency issues

[kiuby88.programming] Minor fix.

[kiuby88.programming] Addressing comments.

------------------------------------------
[...truncated 19202 lines...]
            enricher.suppressDuplicates[ConfigKey:java.lang.Boolean] = true
            enricher.targetSensor[ConfigKey:org.apache.brooklyn.api.sensor.Sensor] = Sensor:
service.isUp (java.lang.Boolean)
            enricher.transformation[ConfigKey:com.google.common.base.Function] = if[{Not(IS_NULL)=forPredicate(IsEqualTo(0)(sizeFunction(keys)))}]-else[java.lang.Object@60eee643]
        ComputeServiceState{uniqueTag=service.state.actual, running=true, entity=BasicEntityImpl{id=g7vo0q5fzt},
id=m79svqnajm}
2016-06-15 23:02:01,303 INFO  TESTNG PASSED: "Surefire test" - org.apache.brooklyn.core.plan.XmlPlanToSpecTransformerTest.testSimpleXmlPlanParse()
finished in 48 ms
2016-06-15 23:02:01,303 INFO  TESTNG INVOKING CONFIGURATION: "Surefire test" - @AfterMethod
org.apache.brooklyn.core.plan.XmlPlanToSpecTransformerTest.tearDown()
2016-06-15 23:02:01,304 INFO  No Camp-YAML parser registered for parsing catalog item DSL;
skipping DSL-parsing
2016-06-15 23:02:01,304 INFO  Stopping application BasicApplicationImpl{id=ao9gb3u5ua}
2016-06-15 23:02:01,305 INFO  Stopped application BasicApplicationImpl{id=ao9gb3u5ua}
2016-06-15 23:02:01,306 WARN  Error invoking start at BasicApplicationImpl{id=ao9gb3u5ua}:
RuntimeInterruptedException: java.lang.InterruptedException: sleep interrupted
2016-06-15 23:02:01,308 INFO  TESTNG PASSED CONFIGURATION: "Surefire test" - @AfterMethod
org.apache.brooklyn.core.plan.XmlPlanToSpecTransformerTest.tearDown() finished in 5 ms
2016-06-15 23:02:01,308 INFO  TESTNG INVOKING CONFIGURATION: "Surefire test" - @BeforeMethod
org.apache.brooklyn.core.internal.storage.impl.BrooklynStorageImplTest.setUp()
2016-06-15 23:02:01,308 INFO  TESTNG PASSED CONFIGURATION: "Surefire test" - @BeforeMethod
org.apache.brooklyn.core.internal.storage.impl.BrooklynStorageImplTest.setUp() finished in
0 ms
2016-06-15 23:02:01,308 INFO  TESTNG INVOKING: "Surefire test" - org.apache.brooklyn.core.internal.storage.impl.BrooklynStorageImplTest.testCreateMapReturnsSameEachTime()
2016-06-15 23:02:01,309 INFO  TESTNG PASSED: "Surefire test" - org.apache.brooklyn.core.internal.storage.impl.BrooklynStorageImplTest.testCreateMapReturnsSameEachTime()
finished in 1 ms
2016-06-15 23:02:01,309 INFO  TESTNG INVOKING CONFIGURATION: "Surefire test" - @BeforeMethod
org.apache.brooklyn.core.internal.storage.impl.BrooklynStorageImplTest.setUp()
2016-06-15 23:02:01,309 INFO  TESTNG PASSED CONFIGURATION: "Surefire test" - @BeforeMethod
org.apache.brooklyn.core.internal.storage.impl.BrooklynStorageImplTest.setUp() finished in
0 ms
2016-06-15 23:02:01,309 INFO  TESTNG INVOKING: "Surefire test" - org.apache.brooklyn.core.internal.storage.impl.BrooklynStorageImplTest.testMapKeySetIterator()
2016-06-15 23:02:01,309 INFO  TESTNG PASSED: "Surefire test" - org.apache.brooklyn.core.internal.storage.impl.BrooklynStorageImplTest.testMapKeySetIterator()
finished in 0 ms
2016-06-15 23:02:01,310 INFO  TESTNG INVOKING CONFIGURATION: "Surefire test" - @BeforeMethod
org.apache.brooklyn.core.internal.storage.impl.BrooklynStorageImplTest.setUp()
2016-06-15 23:02:01,310 INFO  TESTNG PASSED CONFIGURATION: "Surefire test" - @BeforeMethod
org.apache.brooklyn.core.internal.storage.impl.BrooklynStorageImplTest.setUp() finished in
0 ms
2016-06-15 23:02:01,310 INFO  TESTNG INVOKING: "Surefire test" - org.apache.brooklyn.core.internal.storage.impl.BrooklynStorageImplTest.testMapOperations()
2016-06-15 23:02:01,311 INFO  TESTNG PASSED: "Surefire test" - org.apache.brooklyn.core.internal.storage.impl.BrooklynStorageImplTest.testMapOperations()
finished in 1 ms
2016-06-15 23:02:01,311 INFO  TESTNG INVOKING CONFIGURATION: "Surefire test" - @BeforeMethod
org.apache.brooklyn.core.internal.storage.impl.BrooklynStorageImplTest.setUp()
2016-06-15 23:02:01,311 INFO  TESTNG PASSED CONFIGURATION: "Surefire test" - @BeforeMethod
org.apache.brooklyn.core.internal.storage.impl.BrooklynStorageImplTest.setUp() finished in
0 ms
2016-06-15 23:02:01,311 INFO  TESTNG INVOKING: "Surefire test" - org.apache.brooklyn.core.internal.storage.impl.BrooklynStorageImplTest.testReferenceAcceptsNullValue()
2016-06-15 23:02:01,313 INFO  TESTNG PASSED: "Surefire test" - org.apache.brooklyn.core.internal.storage.impl.BrooklynStorageImplTest.testReferenceAcceptsNullValue()
finished in 2 ms
2016-06-15 23:02:01,313 INFO  TESTNG INVOKING CONFIGURATION: "Surefire test" - @BeforeMethod
org.apache.brooklyn.core.internal.storage.impl.BrooklynStorageImplTest.setUp()
2016-06-15 23:02:01,313 INFO  TESTNG PASSED CONFIGURATION: "Surefire test" - @BeforeMethod
org.apache.brooklyn.core.internal.storage.impl.BrooklynStorageImplTest.setUp() finished in
0 ms
2016-06-15 23:02:01,314 INFO  TESTNG INVOKING: "Surefire test" - org.apache.brooklyn.core.internal.storage.impl.BrooklynStorageImplTest.testReferenceGetAndSet()
2016-06-15 23:02:01,314 INFO  TESTNG PASSED: "Surefire test" - org.apache.brooklyn.core.internal.storage.impl.BrooklynStorageImplTest.testReferenceGetAndSet()
finished in 1 ms
2016-06-15 23:02:01,314 INFO  TESTNG INVOKING CONFIGURATION: "Surefire test" - @BeforeMethod
org.apache.brooklyn.core.internal.storage.impl.ConcurrentMapAcceptingNullValsTest.setUp()
2016-06-15 23:02:01,314 INFO  TESTNG PASSED CONFIGURATION: "Surefire test" - @BeforeMethod
org.apache.brooklyn.core.internal.storage.impl.ConcurrentMapAcceptingNullValsTest.setUp()
finished in 0 ms
2016-06-15 23:02:01,314 INFO  TESTNG INVOKING: "Surefire test" - org.apache.brooklyn.core.internal.storage.impl.ConcurrentMapAcceptingNullValsTest.testAcceptsNullValue()
2016-06-15 23:02:01,315 INFO  TESTNG PASSED: "Surefire test" - org.apache.brooklyn.core.internal.storage.impl.ConcurrentMapAcceptingNullValsTest.testAcceptsNullValue()
finished in 1 ms
2016-06-15 23:02:01,315 INFO  TESTNG INVOKING CONFIGURATION: "Surefire test" - @BeforeMethod
org.apache.brooklyn.core.internal.storage.impl.ConcurrentMapAcceptingNullValsTest.setUp()
2016-06-15 23:02:01,315 INFO  TESTNG PASSED CONFIGURATION: "Surefire test" - @BeforeMethod
org.apache.brooklyn.core.internal.storage.impl.ConcurrentMapAcceptingNullValsTest.setUp()
finished in 0 ms
2016-06-15 23:02:01,315 INFO  TESTNG INVOKING: "Surefire test" - org.apache.brooklyn.core.internal.storage.impl.ConcurrentMapAcceptingNullValsTest.testSimpleOperations()
2016-06-15 23:02:01,316 INFO  TESTNG PASSED: "Surefire test" - org.apache.brooklyn.core.internal.storage.impl.ConcurrentMapAcceptingNullValsTest.testSimpleOperations()
finished in 1 ms
2016-06-15 23:02:01,537 INFO  TESTNG 
===============================================
    Surefire test
    Tests run: 1787, Failures: 6, Skips: 0
===============================================
2016-06-15 23:02:01,537 INFO  BrooklynLeakListener.onFinish attempting to terminate all extant
ManagementContexts: name=Surefire test; includedGroups=[]; excludedGroups=[Integration, Live-sanity,
Acceptance, Live, Broken, WIP]; suiteName=Surefire suite; outDir=<https://builds.apache.org/job/brooklyn-server-master/ws/core/target/surefire-reports/Surefire>
suite: no org.apache.brooklyn.core.management.internal.LocalManagementContext available, so
skipped
SUREFIRE-859: [GC 554734K->336456K(766976K), 0.0233150 secs]
SUREFIRE-859: [GC 558664K->338461K(765952K), 0.0239650 secs]
Tests run: 1787, Failures: 6, Errors: 0, Skipped: 0, Time elapsed: 200.804 sec <<<
FAILURE! - in TestSuite
testConfigInImplVisible(org.apache.brooklyn.core.objs.BasicSpecParameterFromClassTest)  Time
elapsed: 0.031 sec  <<< FAILURE!
java.lang.AssertionError: expected [1] but found [2]
	at org.testng.Assert.fail(Assert.java:94)
	at org.testng.Assert.failNotEquals(Assert.java:494)
	at org.testng.Assert.assertEquals(Assert.java:123)
	at org.testng.Assert.assertEquals(Assert.java:370)
	at org.testng.Assert.assertEquals(Assert.java:380)
	at org.apache.brooklyn.core.objs.BasicSpecParameterFromClassTest.testConfigInImplVisible(BasicSpecParameterFromClassTest.java:98)

testAddConfigKey(org.apache.brooklyn.core.entity.DynamicEntityTypeConfigTest)  Time elapsed:
0.003 sec  <<< FAILURE!
java.lang.AssertionError: Sets differ: expected [install.version[ConfigKey:java.lang.String],
install.unique_label[ConfigKey:java.lang.String], pre.install.command[ConfigKey:java.lang.String],
post.install.command[ConfigKey:java.lang.String], spec.config[ConfigKey:java.lang.String],
new.config[ConfigKey:java.lang.String]] but got [spec.config[ConfigKey:java.lang.String],
install.version[ConfigKey:java.lang.String], post.install.command[ConfigKey:java.lang.String],
new.config[ConfigKey:java.lang.String], install.unique_label[ConfigKey:java.lang.String],
defaultDisplayName[ConfigKey:java.lang.String], pre.install.command[ConfigKey:java.lang.String]]
	at org.testng.Assert.fail(Assert.java:94)
	at org.testng.Assert.assertEquals(Assert.java:806)
	at org.testng.Assert.assertEquals(Assert.java:784)
	at org.apache.brooklyn.core.entity.DynamicEntityTypeConfigTest.testAddConfigKey(DynamicEntityTypeConfigTest.java:91)

testAddConfigKeyThroughEntity(org.apache.brooklyn.core.entity.DynamicEntityTypeConfigTest)
 Time elapsed: 0.002 sec  <<< FAILURE!
java.lang.AssertionError: Sets differ: expected [install.version[ConfigKey:java.lang.String],
install.unique_label[ConfigKey:java.lang.String], pre.install.command[ConfigKey:java.lang.String],
post.install.command[ConfigKey:java.lang.String], spec.config[ConfigKey:java.lang.String],
new.config[ConfigKey:java.lang.String]] but got [spec.config[ConfigKey:java.lang.String],
install.version[ConfigKey:java.lang.String], post.install.command[ConfigKey:java.lang.String],
new.config[ConfigKey:java.lang.String], install.unique_label[ConfigKey:java.lang.String],
defaultDisplayName[ConfigKey:java.lang.String], pre.install.command[ConfigKey:java.lang.String]]
	at org.testng.Assert.fail(Assert.java:94)
	at org.testng.Assert.assertEquals(Assert.java:806)
	at org.testng.Assert.assertEquals(Assert.java:784)
	at org.apache.brooklyn.core.entity.DynamicEntityTypeConfigTest.testAddConfigKeyThroughEntity(DynamicEntityTypeConfigTest.java:100)

testGetConfigKeys(org.apache.brooklyn.core.entity.DynamicEntityTypeConfigTest)  Time elapsed:
0.002 sec  <<< FAILURE!
java.lang.AssertionError: Sets differ: expected [install.version[ConfigKey:java.lang.String],
install.unique_label[ConfigKey:java.lang.String], pre.install.command[ConfigKey:java.lang.String],
post.install.command[ConfigKey:java.lang.String], spec.config[ConfigKey:java.lang.String]]
but got [spec.config[ConfigKey:java.lang.String], install.version[ConfigKey:java.lang.String],
post.install.command[ConfigKey:java.lang.String], install.unique_label[ConfigKey:java.lang.String],
defaultDisplayName[ConfigKey:java.lang.String], pre.install.command[ConfigKey:java.lang.String]]
	at org.testng.Assert.fail(Assert.java:94)
	at org.testng.Assert.assertEquals(Assert.java:806)
	at org.testng.Assert.assertEquals(Assert.java:784)
	at org.apache.brooklyn.core.entity.DynamicEntityTypeConfigTest.testGetConfigKeys(DynamicEntityTypeConfigTest.java:85)

testRemoveConfigKey(org.apache.brooklyn.core.entity.DynamicEntityTypeConfigTest)  Time elapsed:
0.001 sec  <<< FAILURE!
java.lang.AssertionError: Sets differ: expected [install.version[ConfigKey:java.lang.String],
pre.install.command[ConfigKey:java.lang.String], post.install.command[ConfigKey:java.lang.String],
spec.config[ConfigKey:java.lang.String]] but got [spec.config[ConfigKey:java.lang.String],
install.version[ConfigKey:java.lang.String], post.install.command[ConfigKey:java.lang.String],
defaultDisplayName[ConfigKey:java.lang.String], pre.install.command[ConfigKey:java.lang.String]]
	at org.testng.Assert.fail(Assert.java:94)
	at org.testng.Assert.assertEquals(Assert.java:806)
	at org.testng.Assert.assertEquals(Assert.java:784)
	at org.apache.brooklyn.core.entity.DynamicEntityTypeConfigTest.testRemoveConfigKey(DynamicEntityTypeConfigTest.java:109)

testGetConfigKeysReturnsFromSuperAndInterfacesAndSubClass(org.apache.brooklyn.core.entity.EntityConfigTest)
 Time elapsed: 0.017 sec  <<< FAILURE!
java.lang.AssertionError: Sets differ: expected [superKey1[ConfigKey:java.lang.String], superKey2[ConfigKey:java.lang.String],
subKey2[ConfigKey:java.lang.String], interfaceKey1[ConfigKey:java.lang.String]] but got [subKey2[ConfigKey:java.lang.String],
superKey1[ConfigKey:java.lang.String], interfaceKey1[ConfigKey:java.lang.String], defaultDisplayName[ConfigKey:java.lang.String],
superKey2[ConfigKey:java.lang.String]]
	at org.testng.Assert.fail(Assert.java:94)
	at org.testng.Assert.assertEquals(Assert.java:806)
	at org.testng.Assert.assertEquals(Assert.java:784)
	at org.apache.brooklyn.core.entity.EntityConfigTest.testGetConfigKeysReturnsFromSuperAndInterfacesAndSubClass(EntityConfigTest.java:276)

2016-06-15 23:02:03,339 INFO  Brooklyn shutdown: stopping entities [TestEntityImpl{id=jupwjq7rzq},
TestEntityImpl{id=qnhb0uep57}, BlockingEntityImpl{id=gha0lwksbw}]

Results :

Failed tests: 
  DynamicEntityTypeConfigTest.testAddConfigKey:91 Sets differ: expected [install.version[ConfigKey:java.lang.String],
install.unique_label[ConfigKey:java.lang.String], pre.install.command[ConfigKey:java.lang.String],
post.install.command[ConfigKey:java.lang.String], spec.config[ConfigKey:java.lang.String],
new.config[ConfigKey:java.lang.String]] but got [spec.config[ConfigKey:java.lang.String],
install.version[ConfigKey:java.lang.String], post.install.command[ConfigKey:java.lang.String],
new.config[ConfigKey:java.lang.String], install.unique_label[ConfigKey:java.lang.String],
defaultDisplayName[ConfigKey:java.lang.String], pre.install.command[ConfigKey:java.lang.String]]
  DynamicEntityTypeConfigTest.testAddConfigKeyThroughEntity:100 Sets differ: expected [install.version[ConfigKey:java.lang.String],
install.unique_label[ConfigKey:java.lang.String], pre.install.command[ConfigKey:java.lang.String],
post.install.command[ConfigKey:java.lang.String], spec.config[ConfigKey:java.lang.String],
new.config[ConfigKey:java.lang.String]] but got [spec.config[ConfigKey:java.lang.String],
install.version[ConfigKey:java.lang.String], post.install.command[ConfigKey:java.lang.String],
new.config[ConfigKey:java.lang.String], install.unique_label[ConfigKey:java.lang.String],
defaultDisplayName[ConfigKey:java.lang.String], pre.install.command[ConfigKey:java.lang.String]]
  DynamicEntityTypeConfigTest.testGetConfigKeys:85 Sets differ: expected [install.version[ConfigKey:java.lang.String],
install.unique_label[ConfigKey:java.lang.String], pre.install.command[ConfigKey:java.lang.String],
post.install.command[ConfigKey:java.lang.String], spec.config[ConfigKey:java.lang.String]]
but got [spec.config[ConfigKey:java.lang.String], install.version[ConfigKey:java.lang.String],
post.install.command[ConfigKey:java.lang.String], install.unique_label[ConfigKey:java.lang.String],
defaultDisplayName[ConfigKey:java.lang.String], pre.install.command[ConfigKey:java.lang.String]]
  DynamicEntityTypeConfigTest.testRemoveConfigKey:109 Sets differ: expected [install.version[ConfigKey:java.lang.String],
pre.install.command[ConfigKey:java.lang.String], post.install.command[ConfigKey:java.lang.String],
spec.config[ConfigKey:java.lang.String]] but got [spec.config[ConfigKey:java.lang.String],
install.version[ConfigKey:java.lang.String], post.install.command[ConfigKey:java.lang.String],
defaultDisplayName[ConfigKey:java.lang.String], pre.install.command[ConfigKey:java.lang.String]]
  EntityConfigTest.testGetConfigKeysReturnsFromSuperAndInterfacesAndSubClass:276 Sets differ:
expected [superKey1[ConfigKey:java.lang.String], superKey2[ConfigKey:java.lang.String], subKey2[ConfigKey:java.lang.String],
interfaceKey1[ConfigKey:java.lang.String]] but got [subKey2[ConfigKey:java.lang.String], superKey1[ConfigKey:java.lang.String],
interfaceKey1[ConfigKey:java.lang.String], defaultDisplayName[ConfigKey:java.lang.String],
superKey2[ConfigKey:java.lang.String]]
  BasicSpecParameterFromClassTest.testConfigInImplVisible:98 expected [1] but found [2]

Tests run: 1787, Failures: 6, Errors: 0, Skipped: 0

[JENKINS] Recording test results
[INFO] ------------------------------------------------------------------------
[INFO] Reactor Summary:
[INFO] 
[INFO] Brooklyn Server Root ............................... SUCCESS [  6.645 s]
[INFO] Brooklyn Parent Project ............................ SUCCESS [ 13.173 s]
[INFO] Brooklyn Test Support Utilities .................... SUCCESS [  8.643 s]
[INFO] Brooklyn Logback Includable Configuration .......... SUCCESS [  2.591 s]
[INFO] Brooklyn Common Utilities .......................... SUCCESS [ 28.002 s]
[INFO] Brooklyn API ....................................... SUCCESS [  7.977 s]
[INFO] CAMP Server Parent Project ......................... SUCCESS [  1.050 s]
[INFO] CAMP Base .......................................... SUCCESS [ 13.663 s]
[INFO] Brooklyn Test Support .............................. SUCCESS [  2.971 s]
[INFO] Brooklyn REST Swagger Apidoc Utilities ............. SUCCESS [  5.189 s]
[INFO] Brooklyn Logback Configuration ..................... SUCCESS [  1.848 s]
[INFO] CAMP Server ........................................ SUCCESS [ 11.079 s]
[INFO] Brooklyn Felix Runtime ............................. SUCCESS [  6.553 s]
[INFO] Brooklyn Groovy Utilities .......................... SUCCESS [  3.171 s]
[INFO] Brooklyn Core ...................................... FAILURE [04:00 min]
[INFO] Brooklyn Policies .................................. SKIPPED
[INFO] Brooklyn WinRM Software Entities ................... SKIPPED
[INFO] Brooklyn Secure JMXMP Agent ........................ SKIPPED
[INFO] Brooklyn JMX RMI Agent ............................. SKIPPED
[INFO] Brooklyn Jclouds Location Targets .................. SKIPPED
[INFO] Brooklyn Software Base ............................. SKIPPED
[INFO] Brooklyn CAMP REST API ............................. SKIPPED
[INFO] Brooklyn Hazelcast Storage ......................... SKIPPED
[INFO] Brooklyn Launcher Common ........................... SKIPPED
[INFO] Brooklyn REST API .................................. SKIPPED
[INFO] Brooklyn REST Resources ............................ SKIPPED
[INFO] Brooklyn REST Server ............................... SKIPPED
[INFO] Brooklyn Launcher .................................. SKIPPED
[INFO] Brooklyn Command Line Interface .................... SKIPPED
[INFO] Brooklyn REST Client ............................... SKIPPED
[INFO] Brooklyn Test Framework ............................ SKIPPED
[INFO] Brooklyn OSGi init ................................. SKIPPED
[INFO] Brooklyn Karaf ..................................... SKIPPED
[INFO] Jetty config fragment .............................. SKIPPED
[INFO] Brooklyn Karaf Features ............................ SKIPPED
[INFO] Brooklyn Karaf Shell Commands ...................... SKIPPED
[INFO] Brooklyn Karaf Distro .............................. SKIPPED
[INFO] Brooklyn Karaf pax-exam itest ...................... SKIPPED
[INFO] ------------------------------------------------------------------------
[INFO] BUILD FAILURE
[INFO] ------------------------------------------------------------------------
[INFO] Total time: 06:19 min
[INFO] Finished at: 2016-06-15T23:02:08+00:00
[INFO] Final Memory: 79M/496M
[INFO] ------------------------------------------------------------------------
Waiting for Jenkins to finish collecting data
[ERROR] Failed to execute goal org.apache.maven.plugins:maven-surefire-plugin:2.18.1:test
(default-test) on project brooklyn-core: There are test failures.
[ERROR] 
[ERROR] Please refer to <https://builds.apache.org/job/brooklyn-server-master/ws/core/target/surefire-reports>
for the individual test results.
[ERROR] -> [Help 1]
[ERROR] 
[ERROR] To see the full stack trace of the errors, re-run Maven with the -e switch.
[ERROR] Re-run Maven using the -X switch to enable full debug logging.
[ERROR] 
[ERROR] For more information about the errors and possible solutions, please read the following
articles:
[ERROR] [Help 1] http://cwiki.apache.org/confluence/display/MAVEN/MojoFailureException
[ERROR] 
[ERROR] After correcting the problems, you can resume the build with the command
[ERROR]   mvn <goals> -rf :brooklyn-core
[JENKINS] Archiving <https://builds.apache.org/job/brooklyn-server-master/ws/policy/pom.xml>
to org.apache.brooklyn/brooklyn-policy/0.10.0-SNAPSHOT/brooklyn-policy-0.10.0-SNAPSHOT.pom
[JENKINS] Archiving <https://builds.apache.org/job/brooklyn-server-master/ws/storage/hazelcast/pom.xml>
to org.apache.brooklyn/brooklyn-storage-hazelcast/0.10.0-SNAPSHOT/brooklyn-storage-hazelcast-0.10.0-SNAPSHOT.pom
[JENKINS] Archiving <https://builds.apache.org/job/brooklyn-server-master/ws/test-framework/pom.xml>
to org.apache.brooklyn/brooklyn-test-framework/0.10.0-SNAPSHOT/brooklyn-test-framework-0.10.0-SNAPSHOT.pom
[JENKINS] Archiving <https://builds.apache.org/job/brooklyn-server-master/ws/karaf/init/pom.xml>
to org.apache.brooklyn/brooklyn-karaf-init/0.10.0-SNAPSHOT/brooklyn-karaf-init-0.10.0-SNAPSHOT.pom
[JENKINS] Archiving <https://builds.apache.org/job/brooklyn-server-master/ws/pom.xml>
to org.apache.brooklyn/brooklyn-server/0.10.0-SNAPSHOT/brooklyn-server-0.10.0-SNAPSHOT.pom
[JENKINS] Archiving <https://builds.apache.org/job/brooklyn-server-master/ws/karaf/commands/pom.xml>
to org.apache.brooklyn/brooklyn-commands/0.10.0-SNAPSHOT/brooklyn-commands-0.10.0-SNAPSHOT.pom
[JENKINS] Archiving <https://builds.apache.org/job/brooklyn-server-master/ws/rest/rest-api/pom.xml>
to org.apache.brooklyn/brooklyn-rest-api/0.10.0-SNAPSHOT/brooklyn-rest-api-0.10.0-SNAPSHOT.pom
[JENKINS] Archiving <https://builds.apache.org/job/brooklyn-server-master/ws/core/pom.xml>
to org.apache.brooklyn/brooklyn-core/0.10.0-SNAPSHOT/brooklyn-core-0.10.0-SNAPSHOT.pom
[JENKINS] Archiving <https://builds.apache.org/job/brooklyn-server-master/ws/logging/logback-xml/pom.xml>
to org.apache.brooklyn/brooklyn-logback-xml/0.10.0-SNAPSHOT/brooklyn-logback-xml-0.10.0-SNAPSHOT.pom
[JENKINS] Archiving <https://builds.apache.org/job/brooklyn-server-master/ws/logging/logback-xml/target/brooklyn-logback-xml-0.10.0-SNAPSHOT.jar>
to org.apache.brooklyn/brooklyn-logback-xml/0.10.0-SNAPSHOT/brooklyn-logback-xml-0.10.0-SNAPSHOT.jar
[JENKINS] Archiving <https://builds.apache.org/job/brooklyn-server-master/ws/logging/logback-xml/target/brooklyn-logback-xml-0.10.0-SNAPSHOT-sources.jar>
to org.apache.brooklyn/brooklyn-logback-xml/0.10.0-SNAPSHOT/brooklyn-logback-xml-0.10.0-SNAPSHOT-sources.jar
[JENKINS] Archiving <https://builds.apache.org/job/brooklyn-server-master/ws/logging/logback-xml/target/brooklyn-logback-xml-0.10.0-SNAPSHOT-test-sources.jar>
to org.apache.brooklyn/brooklyn-logback-xml/0.10.0-SNAPSHOT/brooklyn-logback-xml-0.10.0-SNAPSHOT-test-sources.jar
[JENKINS] Archiving <https://builds.apache.org/job/brooklyn-server-master/ws/karaf/features/pom.xml>
to org.apache.brooklyn/brooklyn-features/0.10.0-SNAPSHOT/brooklyn-features-0.10.0-SNAPSHOT.pom
[JENKINS] Archiving <https://builds.apache.org/job/brooklyn-server-master/ws/rest/rest-resources/pom.xml>
to org.apache.brooklyn/brooklyn-rest-resources/0.10.0-SNAPSHOT/brooklyn-rest-resources-0.10.0-SNAPSHOT.pom
[JENKINS] Archiving <https://builds.apache.org/job/brooklyn-server-master/ws/camp/camp-server/pom.xml>
to org.apache.brooklyn.camp/camp-server/0.10.0-SNAPSHOT/camp-server-0.10.0-SNAPSHOT.pom
[JENKINS] Archiving <https://builds.apache.org/job/brooklyn-server-master/ws/camp/camp-server/target/camp-server-0.10.0-SNAPSHOT.jar>
to org.apache.brooklyn.camp/camp-server/0.10.0-SNAPSHOT/camp-server-0.10.0-SNAPSHOT.jar
[JENKINS] Archiving <https://builds.apache.org/job/brooklyn-server-master/ws/camp/camp-server/target/camp-server-0.10.0-SNAPSHOT-tests.jar>
to org.apache.brooklyn.camp/camp-server/0.10.0-SNAPSHOT/camp-server-0.10.0-SNAPSHOT-tests.jar
[JENKINS] Archiving <https://builds.apache.org/job/brooklyn-server-master/ws/camp/camp-server/target/camp-server-0.10.0-SNAPSHOT-sources.jar>
to org.apache.brooklyn.camp/camp-server/0.10.0-SNAPSHOT/camp-server-0.10.0-SNAPSHOT-sources.jar
[JENKINS] Archiving <https://builds.apache.org/job/brooklyn-server-master/ws/camp/camp-server/target/camp-server-0.10.0-SNAPSHOT-test-sources.jar>
to org.apache.brooklyn.camp/camp-server/0.10.0-SNAPSHOT/camp-server-0.10.0-SNAPSHOT-test-sources.jar
[JENKINS] Archiving <https://builds.apache.org/job/brooklyn-server-master/ws/launcher-common/pom.xml>
to org.apache.brooklyn/brooklyn-launcher-common/0.10.0-SNAPSHOT/brooklyn-launcher-common-0.10.0-SNAPSHOT.pom
[JENKINS] Archiving <https://builds.apache.org/job/brooklyn-server-master/ws/utils/groovy/pom.xml>
to org.apache.brooklyn/brooklyn-utils-groovy/0.10.0-SNAPSHOT/brooklyn-utils-groovy-0.10.0-SNAPSHOT.pom
[JENKINS] Archiving <https://builds.apache.org/job/brooklyn-server-master/ws/utils/groovy/target/brooklyn-utils-groovy-0.10.0-SNAPSHOT.jar>
to org.apache.brooklyn/brooklyn-utils-groovy/0.10.0-SNAPSHOT/brooklyn-utils-groovy-0.10.0-SNAPSHOT.jar
[JENKINS] Archiving <https://builds.apache.org/job/brooklyn-server-master/ws/utils/groovy/target/brooklyn-utils-groovy-0.10.0-SNAPSHOT-tests.jar>
to org.apache.brooklyn/brooklyn-utils-groovy/0.10.0-SNAPSHOT/brooklyn-utils-groovy-0.10.0-SNAPSHOT-tests.jar
[JENKINS] Archiving <https://builds.apache.org/job/brooklyn-server-master/ws/utils/groovy/target/brooklyn-utils-groovy-0.10.0-SNAPSHOT-sources.jar>
to org.apache.brooklyn/brooklyn-utils-groovy/0.10.0-SNAPSHOT/brooklyn-utils-groovy-0.10.0-SNAPSHOT-sources.jar
[JENKINS] Archiving <https://builds.apache.org/job/brooklyn-server-master/ws/utils/groovy/target/brooklyn-utils-groovy-0.10.0-SNAPSHOT-test-sources.jar>
to org.apache.brooklyn/brooklyn-utils-groovy/0.10.0-SNAPSHOT/brooklyn-utils-groovy-0.10.0-SNAPSHOT-test-sources.jar
[JENKINS] Archiving <https://builds.apache.org/job/brooklyn-server-master/ws/utils/common/pom.xml>
to org.apache.brooklyn/brooklyn-utils-common/0.10.0-SNAPSHOT/brooklyn-utils-common-0.10.0-SNAPSHOT.pom
[JENKINS] Archiving <https://builds.apache.org/job/brooklyn-server-master/ws/utils/common/target/brooklyn-utils-common-0.10.0-SNAPSHOT.jar>
to org.apache.brooklyn/brooklyn-utils-common/0.10.0-SNAPSHOT/brooklyn-utils-common-0.10.0-SNAPSHOT.jar
[JENKINS] Archiving <https://builds.apache.org/job/brooklyn-server-master/ws/utils/common/target/brooklyn-utils-common-0.10.0-SNAPSHOT-tests.jar>
to org.apache.brooklyn/brooklyn-utils-common/0.10.0-SNAPSHOT/brooklyn-utils-common-0.10.0-SNAPSHOT-tests.jar
[JENKINS] Archiving <https://builds.apache.org/job/brooklyn-server-master/ws/utils/common/target/brooklyn-utils-common-0.10.0-SNAPSHOT-sources.jar>
to org.apache.brooklyn/brooklyn-utils-common/0.10.0-SNAPSHOT/brooklyn-utils-common-0.10.0-SNAPSHOT-sources.jar
[JENKINS] Archiving <https://builds.apache.org/job/brooklyn-server-master/ws/utils/common/target/brooklyn-utils-common-0.10.0-SNAPSHOT-test-sources.jar>
to org.apache.brooklyn/brooklyn-utils-common/0.10.0-SNAPSHOT/brooklyn-utils-common-0.10.0-SNAPSHOT-test-sources.jar
Compressed 1.18 MB of artifacts by 26.6% relative to #133
[JENKINS] Archiving <https://builds.apache.org/job/brooklyn-server-master/ws/locations/jclouds/pom.xml>
to org.apache.brooklyn/brooklyn-locations-jclouds/0.10.0-SNAPSHOT/brooklyn-locations-jclouds-0.10.0-SNAPSHOT.pom
[JENKINS] Archiving <https://builds.apache.org/job/brooklyn-server-master/ws/test-support/pom.xml>
to org.apache.brooklyn/brooklyn-test-support/0.10.0-SNAPSHOT/brooklyn-test-support-0.10.0-SNAPSHOT.pom
[JENKINS] Archiving <https://builds.apache.org/job/brooklyn-server-master/ws/test-support/target/brooklyn-test-support-0.10.0-SNAPSHOT.jar>
to org.apache.brooklyn/brooklyn-test-support/0.10.0-SNAPSHOT/brooklyn-test-support-0.10.0-SNAPSHOT.jar
[JENKINS] Archiving <https://builds.apache.org/job/brooklyn-server-master/ws/test-support/target/brooklyn-test-support-0.10.0-SNAPSHOT-sources.jar>
to org.apache.brooklyn/brooklyn-test-support/0.10.0-SNAPSHOT/brooklyn-test-support-0.10.0-SNAPSHOT-sources.jar
[JENKINS] Archiving <https://builds.apache.org/job/brooklyn-server-master/ws/test-support/target/brooklyn-test-support-0.10.0-SNAPSHOT-test-sources.jar>
to org.apache.brooklyn/brooklyn-test-support/0.10.0-SNAPSHOT/brooklyn-test-support-0.10.0-SNAPSHOT-test-sources.jar
[JENKINS] Archiving <https://builds.apache.org/job/brooklyn-server-master/ws/karaf/pom.xml>
to org.apache.brooklyn/brooklyn-karaf/0.10.0-SNAPSHOT/brooklyn-karaf-0.10.0-SNAPSHOT.pom
[JENKINS] Archiving <https://builds.apache.org/job/brooklyn-server-master/ws/utils/rt-felix/pom.xml>
to org.apache.brooklyn/brooklyn-rt-felix/0.10.0-SNAPSHOT/brooklyn-rt-felix-0.10.0-SNAPSHOT.pom
[JENKINS] Archiving <https://builds.apache.org/job/brooklyn-server-master/ws/utils/rt-felix/target/brooklyn-rt-felix-0.10.0-SNAPSHOT.jar>
to org.apache.brooklyn/brooklyn-rt-felix/0.10.0-SNAPSHOT/brooklyn-rt-felix-0.10.0-SNAPSHOT.jar
[JENKINS] Archiving <https://builds.apache.org/job/brooklyn-server-master/ws/utils/rt-felix/target/brooklyn-rt-felix-0.10.0-SNAPSHOT-tests.jar>
to org.apache.brooklyn/brooklyn-rt-felix/0.10.0-SNAPSHOT/brooklyn-rt-felix-0.10.0-SNAPSHOT-tests.jar
[JENKINS] Archiving <https://builds.apache.org/job/brooklyn-server-master/ws/utils/rt-felix/target/brooklyn-rt-felix-0.10.0-SNAPSHOT-sources.jar>
to org.apache.brooklyn/brooklyn-rt-felix/0.10.0-SNAPSHOT/brooklyn-rt-felix-0.10.0-SNAPSHOT-sources.jar
[JENKINS] Archiving <https://builds.apache.org/job/brooklyn-server-master/ws/utils/rt-felix/target/brooklyn-rt-felix-0.10.0-SNAPSHOT-test-sources.jar>
to org.apache.brooklyn/brooklyn-rt-felix/0.10.0-SNAPSHOT/brooklyn-rt-felix-0.10.0-SNAPSHOT-test-sources.jar
[JENKINS] Archiving <https://builds.apache.org/job/brooklyn-server-master/ws/karaf/itest/pom.xml>
to org.apache.brooklyn/brooklyn-itest/0.10.0-SNAPSHOT/brooklyn-itest-0.10.0-SNAPSHOT.pom
[JENKINS] Archiving <https://builds.apache.org/job/brooklyn-server-master/ws/software/winrm/pom.xml>
to org.apache.brooklyn/brooklyn-software-winrm/0.10.0-SNAPSHOT/brooklyn-software-winrm-0.10.0-SNAPSHOT.pom
[JENKINS] Archiving <https://builds.apache.org/job/brooklyn-server-master/ws/rest/rest-server/pom.xml>
to org.apache.brooklyn/brooklyn-rest-server/0.10.0-SNAPSHOT/brooklyn-rest-server-0.10.0-SNAPSHOT.pom
[JENKINS] Archiving <https://builds.apache.org/job/brooklyn-server-master/ws/camp/camp-base/pom.xml>
to org.apache.brooklyn.camp/camp-base/0.10.0-SNAPSHOT/camp-base-0.10.0-SNAPSHOT.pom
[JENKINS] Archiving <https://builds.apache.org/job/brooklyn-server-master/ws/camp/camp-base/target/camp-base-0.10.0-SNAPSHOT.jar>
to org.apache.brooklyn.camp/camp-base/0.10.0-SNAPSHOT/camp-base-0.10.0-SNAPSHOT.jar
[JENKINS] Archiving <https://builds.apache.org/job/brooklyn-server-master/ws/camp/camp-base/target/camp-base-0.10.0-SNAPSHOT-tests.jar>
to org.apache.brooklyn.camp/camp-base/0.10.0-SNAPSHOT/camp-base-0.10.0-SNAPSHOT-tests.jar
[JENKINS] Archiving <https://builds.apache.org/job/brooklyn-server-master/ws/camp/camp-base/target/camp-base-0.10.0-SNAPSHOT-sources.jar>
to org.apache.brooklyn.camp/camp-base/0.10.0-SNAPSHOT/camp-base-0.10.0-SNAPSHOT-sources.jar
[JENKINS] Archiving <https://builds.apache.org/job/brooklyn-server-master/ws/camp/camp-base/target/camp-base-0.10.0-SNAPSHOT-test-sources.jar>
to org.apache.brooklyn.camp/camp-base/0.10.0-SNAPSHOT/camp-base-0.10.0-SNAPSHOT-test-sources.jar
[JENKINS] Archiving <https://builds.apache.org/job/brooklyn-server-master/ws/rest/rest-client/pom.xml>
to org.apache.brooklyn/brooklyn-rest-client/0.10.0-SNAPSHOT/brooklyn-rest-client-0.10.0-SNAPSHOT.pom
[JENKINS] Archiving <https://builds.apache.org/job/brooklyn-server-master/ws/karaf/apache-brooklyn/pom.xml>
to org.apache.brooklyn/apache-brooklyn/0.10.0-SNAPSHOT/apache-brooklyn-0.10.0-SNAPSHOT.pom
[JENKINS] Archiving <https://builds.apache.org/job/brooklyn-server-master/ws/utils/jmx/jmxmp-ssl-agent/pom.xml>
to org.apache.brooklyn/brooklyn-jmxmp-agent/0.10.0-SNAPSHOT/brooklyn-jmxmp-agent-0.10.0-SNAPSHOT.pom
[JENKINS] Archiving <https://builds.apache.org/job/brooklyn-server-master/ws/utils/jmx/jmxrmi-agent/pom.xml>
to org.apache.brooklyn/brooklyn-jmxrmi-agent/0.10.0-SNAPSHOT/brooklyn-jmxrmi-agent-0.10.0-SNAPSHOT.pom
[JENKINS] Archiving <https://builds.apache.org/job/brooklyn-server-master/ws/camp/camp-brooklyn/pom.xml>
to org.apache.brooklyn/brooklyn-camp/0.10.0-SNAPSHOT/brooklyn-camp-0.10.0-SNAPSHOT.pom
[JENKINS] Archiving <https://builds.apache.org/job/brooklyn-server-master/ws/parent/pom.xml>
to org.apache.brooklyn/brooklyn-parent/0.10.0-SNAPSHOT/brooklyn-parent-0.10.0-SNAPSHOT.pom
Compressed 80.70 KB of artifacts by 79.3% relative to #133
[JENKINS] Archiving <https://builds.apache.org/job/brooklyn-server-master/ws/server-cli/pom.xml>
to org.apache.brooklyn/brooklyn-cli/0.10.0-SNAPSHOT/brooklyn-cli-0.10.0-SNAPSHOT.pom
[JENKINS] Archiving <https://builds.apache.org/job/brooklyn-server-master/ws/software/base/pom.xml>
to org.apache.brooklyn/brooklyn-software-base/0.10.0-SNAPSHOT/brooklyn-software-base-0.10.0-SNAPSHOT.pom
[JENKINS] Archiving <https://builds.apache.org/job/brooklyn-server-master/ws/logging/logback-includes/pom.xml>
to org.apache.brooklyn/brooklyn-logback-includes/0.10.0-SNAPSHOT/brooklyn-logback-includes-0.10.0-SNAPSHOT.pom
[JENKINS] Archiving <https://builds.apache.org/job/brooklyn-server-master/ws/logging/logback-includes/target/brooklyn-logback-includes-0.10.0-SNAPSHOT.jar>
to org.apache.brooklyn/brooklyn-logback-includes/0.10.0-SNAPSHOT/brooklyn-logback-includes-0.10.0-SNAPSHOT.jar
[JENKINS] Archiving <https://builds.apache.org/job/brooklyn-server-master/ws/logging/logback-includes/target/brooklyn-logback-includes-0.10.0-SNAPSHOT-sources.jar>
to org.apache.brooklyn/brooklyn-logback-includes/0.10.0-SNAPSHOT/brooklyn-logback-includes-0.10.0-SNAPSHOT-sources.jar
[JENKINS] Archiving <https://builds.apache.org/job/brooklyn-server-master/ws/logging/logback-includes/target/brooklyn-logback-includes-0.10.0-SNAPSHOT-test-sources.jar>
to org.apache.brooklyn/brooklyn-logback-includes/0.10.0-SNAPSHOT/brooklyn-logback-includes-0.10.0-SNAPSHOT-test-sources.jar
[JENKINS] Archiving <https://builds.apache.org/job/brooklyn-server-master/ws/launcher/pom.xml>
to org.apache.brooklyn/brooklyn-launcher/0.10.0-SNAPSHOT/brooklyn-launcher-0.10.0-SNAPSHOT.pom
[JENKINS] Archiving <https://builds.apache.org/job/brooklyn-server-master/ws/karaf/jetty-config/pom.xml>
to org.apache.brooklyn/brooklyn-karaf-jetty-config/0.10.0-SNAPSHOT/brooklyn-karaf-jetty-config-0.10.0-SNAPSHOT.pom
[JENKINS] Archiving <https://builds.apache.org/job/brooklyn-server-master/ws/utils/rest-swagger/pom.xml>
to org.apache.brooklyn/brooklyn-utils-rest-swagger/0.10.0-SNAPSHOT/brooklyn-utils-rest-swagger-0.10.0-SNAPSHOT.pom
[JENKINS] Archiving <https://builds.apache.org/job/brooklyn-server-master/ws/utils/rest-swagger/target/brooklyn-utils-rest-swagger-0.10.0-SNAPSHOT.jar>
to org.apache.brooklyn/brooklyn-utils-rest-swagger/0.10.0-SNAPSHOT/brooklyn-utils-rest-swagger-0.10.0-SNAPSHOT.jar
[JENKINS] Archiving <https://builds.apache.org/job/brooklyn-server-master/ws/utils/rest-swagger/target/brooklyn-utils-rest-swagger-0.10.0-SNAPSHOT-sources.jar>
to org.apache.brooklyn/brooklyn-utils-rest-swagger/0.10.0-SNAPSHOT/brooklyn-utils-rest-swagger-0.10.0-SNAPSHOT-sources.jar
[JENKINS] Archiving <https://builds.apache.org/job/brooklyn-server-master/ws/utils/rest-swagger/target/brooklyn-utils-rest-swagger-0.10.0-SNAPSHOT-test-sources.jar>
to org.apache.brooklyn/brooklyn-utils-rest-swagger/0.10.0-SNAPSHOT/brooklyn-utils-rest-swagger-0.10.0-SNAPSHOT-test-sources.jar
[JENKINS] Archiving <https://builds.apache.org/job/brooklyn-server-master/ws/utils/test-support/pom.xml>
to org.apache.brooklyn/brooklyn-utils-test-support/0.10.0-SNAPSHOT/brooklyn-utils-test-support-0.10.0-SNAPSHOT.pom
[JENKINS] Archiving <https://builds.apache.org/job/brooklyn-server-master/ws/utils/test-support/target/brooklyn-utils-test-support-0.10.0-SNAPSHOT.jar>
to org.apache.brooklyn/brooklyn-utils-test-support/0.10.0-SNAPSHOT/brooklyn-utils-test-support-0.10.0-SNAPSHOT.jar
[JENKINS] Archiving <https://builds.apache.org/job/brooklyn-server-master/ws/utils/test-support/target/brooklyn-utils-test-support-0.10.0-SNAPSHOT-sources.jar>
to org.apache.brooklyn/brooklyn-utils-test-support/0.10.0-SNAPSHOT/brooklyn-utils-test-support-0.10.0-SNAPSHOT-sources.jar
[JENKINS] Archiving <https://builds.apache.org/job/brooklyn-server-master/ws/utils/test-support/target/brooklyn-utils-test-support-0.10.0-SNAPSHOT-test-sources.jar>
to org.apache.brooklyn/brooklyn-utils-test-support/0.10.0-SNAPSHOT/brooklyn-utils-test-support-0.10.0-SNAPSHOT-test-sources.jar
[JENKINS] Archiving <https://builds.apache.org/job/brooklyn-server-master/ws/camp/pom.xml>
to org.apache.brooklyn.camp/camp-parent/0.10.0-SNAPSHOT/camp-parent-0.10.0-SNAPSHOT.pom
[JENKINS] Archiving <https://builds.apache.org/job/brooklyn-server-master/ws/api/pom.xml>
to org.apache.brooklyn/brooklyn-api/0.10.0-SNAPSHOT/brooklyn-api-0.10.0-SNAPSHOT.pom
[JENKINS] Archiving <https://builds.apache.org/job/brooklyn-server-master/ws/api/target/brooklyn-api-0.10.0-SNAPSHOT.jar>
to org.apache.brooklyn/brooklyn-api/0.10.0-SNAPSHOT/brooklyn-api-0.10.0-SNAPSHOT.jar
[JENKINS] Archiving <https://builds.apache.org/job/brooklyn-server-master/ws/api/target/brooklyn-api-0.10.0-SNAPSHOT-sources.jar>
to org.apache.brooklyn/brooklyn-api/0.10.0-SNAPSHOT/brooklyn-api-0.10.0-SNAPSHOT-sources.jar
[JENKINS] Archiving <https://builds.apache.org/job/brooklyn-server-master/ws/api/target/brooklyn-api-0.10.0-SNAPSHOT-test-sources.jar>
to org.apache.brooklyn/brooklyn-api/0.10.0-SNAPSHOT/brooklyn-api-0.10.0-SNAPSHOT-test-sources.jar
Compressed 287.57 KB of artifacts by 33.4% relative to #133
channel stopped

Mime
View raw message