brooklyn-dev mailing list archives

Site index · List index
Message view « Date » · « Thread »
Top « Date » · « Thread »
From Apache Jenkins Server <jenk...@builds.apache.org>
Subject Build failed in Jenkins: brooklyn-server-master #127
Date Thu, 09 Jun 2016 19:33:48 GMT
See <https://builds.apache.org/job/brooklyn-server-master/127/changes>

Changes:

[alex.heneveld] fix for issue where $brooklyn:external refs in provisioning.properties

[alex.heneveld] tidy test / logging as per PR comments

------------------------------------------
[...truncated 24170 lines...]
2016-06-09 19:32:30,965 INFO  No Camp-YAML parser registered for parsing catalog item DSL;
skipping DSL-parsing
2016-06-09 19:32:30,978 INFO  TESTNG PASSED CONFIGURATION: "Surefire test" - @BeforeMethod
org.apache.brooklyn.policy.followthesun.AbstractFollowTheSunPolicyTest.setUp() finished in
75 ms
2016-06-09 19:32:30,978 INFO  TESTNG INVOKING: "Surefire test" - org.apache.brooklyn.policy.followthesun.FollowTheSunPolicyTest.testNoopIfDemandIsSimilarToCurrentLocation()
2016-06-09 19:32:31,329 INFO  TESTNG PASSED: "Surefire test" - org.apache.brooklyn.policy.followthesun.FollowTheSunPolicyTest.testNoopIfDemandIsSimilarToCurrentLocation()
finished in 351 ms
2016-06-09 19:32:31,330 INFO  TESTNG INVOKING CONFIGURATION: "Surefire test" - @AfterMethod
org.apache.brooklyn.policy.followthesun.AbstractFollowTheSunPolicyTest.tearDown()
2016-06-09 19:32:31,342 INFO  TESTNG PASSED CONFIGURATION: "Surefire test" - @AfterMethod
org.apache.brooklyn.policy.followthesun.AbstractFollowTheSunPolicyTest.tearDown() finished
in 12 ms
2016-06-09 19:32:31,342 INFO  TESTNG INVOKING CONFIGURATION: "Surefire test" - @BeforeMethod
org.apache.brooklyn.policy.followthesun.AbstractFollowTheSunPolicyTest.setUp()
2016-06-09 19:32:31,401 INFO  No Camp-YAML parser registered for parsing catalog item DSL;
skipping DSL-parsing
2016-06-09 19:32:31,403 INFO  TESTNG PASSED CONFIGURATION: "Surefire test" - @BeforeMethod
org.apache.brooklyn.policy.followthesun.AbstractFollowTheSunPolicyTest.setUp() finished in
61 ms
2016-06-09 19:32:31,403 INFO  TESTNG INVOKING: "Surefire test" - org.apache.brooklyn.policy.followthesun.FollowTheSunPolicyTest.testNoopIfDemandIsTiny()
2016-06-09 19:32:31,719 INFO  TESTNG PASSED: "Surefire test" - org.apache.brooklyn.policy.followthesun.FollowTheSunPolicyTest.testNoopIfDemandIsTiny()
finished in 316 ms
2016-06-09 19:32:31,720 INFO  TESTNG INVOKING CONFIGURATION: "Surefire test" - @AfterMethod
org.apache.brooklyn.policy.followthesun.AbstractFollowTheSunPolicyTest.tearDown()
2016-06-09 19:32:31,742 INFO  TESTNG PASSED CONFIGURATION: "Surefire test" - @AfterMethod
org.apache.brooklyn.policy.followthesun.AbstractFollowTheSunPolicyTest.tearDown() finished
in 22 ms
2016-06-09 19:32:31,744 INFO  TESTNG INVOKING CONFIGURATION: "Surefire test" - @BeforeMethod
org.apache.brooklyn.policy.followthesun.AbstractFollowTheSunPolicyTest.setUp()
2016-06-09 19:32:31,816 INFO  No Camp-YAML parser registered for parsing catalog item DSL;
skipping DSL-parsing
2016-06-09 19:32:31,833 INFO  TESTNG PASSED CONFIGURATION: "Surefire test" - @BeforeMethod
org.apache.brooklyn.policy.followthesun.AbstractFollowTheSunPolicyTest.setUp() finished in
90 ms
2016-06-09 19:32:31,833 INFO  TESTNG INVOKING: "Surefire test" - org.apache.brooklyn.policy.followthesun.FollowTheSunPolicyTest.testPolicyAcceptsLocationFinder()
2016-06-09 19:32:31,852 INFO  TESTNG PASSED: "Surefire test" - org.apache.brooklyn.policy.followthesun.FollowTheSunPolicyTest.testPolicyAcceptsLocationFinder()
finished in 19 ms
2016-06-09 19:32:31,852 INFO  TESTNG INVOKING CONFIGURATION: "Surefire test" - @AfterMethod
org.apache.brooklyn.policy.followthesun.AbstractFollowTheSunPolicyTest.tearDown()
2016-06-09 19:32:31,858 INFO  TESTNG PASSED CONFIGURATION: "Surefire test" - @AfterMethod
org.apache.brooklyn.policy.followthesun.AbstractFollowTheSunPolicyTest.tearDown() finished
in 6 ms
2016-06-09 19:32:31,859 INFO  TESTNG INVOKING CONFIGURATION: "Surefire test" - @BeforeMethod
org.apache.brooklyn.policy.followthesun.AbstractFollowTheSunPolicyTest.setUp()
2016-06-09 19:32:31,923 INFO  No Camp-YAML parser registered for parsing catalog item DSL;
skipping DSL-parsing
2016-06-09 19:32:31,937 INFO  TESTNG PASSED CONFIGURATION: "Surefire test" - @BeforeMethod
org.apache.brooklyn.policy.followthesun.AbstractFollowTheSunPolicyTest.setUp() finished in
78 ms
2016-06-09 19:32:31,938 INFO  TESTNG INVOKING: "Surefire test" - org.apache.brooklyn.policy.followthesun.FollowTheSunPolicyTest.testPolicyUpdatesModel()
2016-06-09 19:32:32,025 INFO  TESTNG PASSED: "Surefire test" - org.apache.brooklyn.policy.followthesun.FollowTheSunPolicyTest.testPolicyUpdatesModel()
finished in 87 ms
2016-06-09 19:32:32,026 INFO  TESTNG INVOKING CONFIGURATION: "Surefire test" - @AfterMethod
org.apache.brooklyn.policy.followthesun.AbstractFollowTheSunPolicyTest.tearDown()
2016-06-09 19:32:32,062 INFO  TESTNG PASSED CONFIGURATION: "Surefire test" - @AfterMethod
org.apache.brooklyn.policy.followthesun.AbstractFollowTheSunPolicyTest.tearDown() finished
in 36 ms
2016-06-09 19:32:32,064 INFO  TESTNG INVOKING CONFIGURATION: "Surefire test" - @BeforeMethod
org.apache.brooklyn.policy.followthesun.AbstractFollowTheSunPolicyTest.setUp()
2016-06-09 19:32:32,118 INFO  No Camp-YAML parser registered for parsing catalog item DSL;
skipping DSL-parsing
2016-06-09 19:32:32,133 INFO  TESTNG PASSED CONFIGURATION: "Surefire test" - @BeforeMethod
org.apache.brooklyn.policy.followthesun.AbstractFollowTheSunPolicyTest.setUp() finished in
70 ms
2016-06-09 19:32:32,134 INFO  TESTNG INVOKING: "Surefire test" - org.apache.brooklyn.policy.followthesun.FollowTheSunPolicySoakTest.testFollowTheSunQuickTest()
2016-06-09 19:32:32,152 WARN  Deprecated use of unmanaged location (SimulatedLocation{id=ohjvsv3q8x,
name=loc1}); will be managed automatically now but not supported in future versions
2016-06-09 19:32:32,303 WARN  Deprecated use of unmanaged location (SimulatedLocation{id=shp55z02kd,
name=loc2}); will be managed automatically now but not supported in future versions
2016-06-09 19:32:32,448 WARN  Deprecated use of unmanaged location (SimulatedLocation{id=q0mm1wmflh,
name=loc3}); will be managed automatically now but not supported in future versions
SUREFIRE-859: [GC 344895K->161063K(714752K), 0.0265950 secs]
2016-06-09 19:32:32,573 WARN  Task Task[LSM.publish(Application[hmjfomd6].Sensor: entity.children.removed
(org.apache.brooklyn.api.entity.Entity)=MockContainer[B] @ 1465500751738);[subscription-delivery-entity-bmhmjfomd6[Application[hmjfomd6]]]]@JKfI83Bv
is being finalized before completion
2016-06-09 19:32:32,573 WARN  Task Task[LSM.publish(Application[hmjfomd6].Sensor: entity.children.removed
(org.apache.brooklyn.api.entity.Entity)=MockItem[1] @ 1465500751738);[subscription-delivery-entity-bmhmjfomd6[Application[hmjfomd6]]]]@SnHZP8uJ
is being finalized before completion
2016-06-09 19:32:32,573 WARN  Task Task[LSM.publish(Application[hmjfomd6].Sensor: entity.children.removed
(org.apache.brooklyn.api.entity.Entity)=MockItem[2] @ 1465500751738);[subscription-delivery-entity-bmhmjfomd6[Application[hmjfomd6]]]]@JQkGBxp8
is being finalized before completion
2016-06-09 19:32:32,812 INFO  FollowTheSunPolicySoakTest: cycle 1
2016-06-09 19:32:32,818 INFO  POLICY pool-model detected MockItem[item-movable5] should be
in location SimulatedLocation{id=q0mm1wmflh, name=loc3} on MockContainer[container-loc3-1]
(2010.9977824691045 of 2405.5794581709133 msgs/sec), migrating
2016-06-09 19:32:32,819 INFO  POLICY pool-model detected MockItem[item-movable3] should be
in location SimulatedLocation{id=q0mm1wmflh, name=loc3} on MockContainer[container-loc3-1]
(1993.9500216404056 of 2421.409268196406 msgs/sec), migrating
2016-06-09 19:32:32,820 INFO  POLICY pool-model detected MockItem[item-movable6] should be
in location SimulatedLocation{id=q0mm1wmflh, name=loc3} on MockContainer[container-loc3-1]
(2016.7762663571584 of 2418.8341460916527 msgs/sec), migrating
2016-06-09 19:32:32,821 INFO  POLICY pool-model detected MockItem[item-movable7] should be
in location SimulatedLocation{id=q0mm1wmflh, name=loc3} on MockContainer[container-loc3-1]
(1994.3174545034221 of 2387.060868186392 msgs/sec), migrating
2016-06-09 19:32:32,823 INFO  POLICY pool-model detected MockItem[item-movable1] should be
in location SimulatedLocation{id=q0mm1wmflh, name=loc3} on MockContainer[container-loc3-1]
(1998.4339748793848 of 2395.4373276003025 msgs/sec), migrating
2016-06-09 19:32:32,824 INFO  POLICY pool-model detected MockItem[item-movable9] should be
in location SimulatedLocation{id=q0mm1wmflh, name=loc3} on MockContainer[container-loc3-1]
(2012.032467771991 of 2418.7529475606507 msgs/sec), migrating
2016-06-09 19:32:32,825 INFO  POLICY pool-model detected MockItem[item-movable8] should be
in location SimulatedLocation{id=q0mm1wmflh, name=loc3} on MockContainer[container-loc3-1]
(2002.291453676395 of 2400.723324260579 msgs/sec), migrating
2016-06-09 19:32:32,826 INFO  POLICY pool-model detected MockItem[item-movable2] should be
in location SimulatedLocation{id=q0mm1wmflh, name=loc3} on MockContainer[container-loc3-1]
(2000.420662805242 of 2405.01514368629 msgs/sec), migrating
2016-06-09 19:32:32,827 INFO  POLICY pool-model detected MockItem[item-movable4] should be
in location SimulatedLocation{id=q0mm1wmflh, name=loc3} on MockContainer[container-loc3-1]
(1999.1245523533712 of 2401.626608712261 msgs/sec), migrating
2016-06-09 19:32:32,830 INFO  TESTNG PASSED: "Surefire test" - org.apache.brooklyn.policy.followthesun.FollowTheSunPolicySoakTest.testFollowTheSunQuickTest()
finished in 696 ms
2016-06-09 19:32:32,830 INFO  TESTNG INVOKING CONFIGURATION: "Surefire test" - @AfterMethod
org.apache.brooklyn.policy.followthesun.AbstractFollowTheSunPolicyTest.tearDown()
2016-06-09 19:32:32,895 INFO  TESTNG PASSED CONFIGURATION: "Surefire test" - @AfterMethod
org.apache.brooklyn.policy.followthesun.AbstractFollowTheSunPolicyTest.tearDown() finished
in 65 ms
2016-06-09 19:32:32,895 INFO  TESTNG INVOKING CONFIGURATION: "Surefire test" - @BeforeMethod
org.apache.brooklyn.policy.followthesun.AbstractFollowTheSunPolicyTest.setUp()
2016-06-09 19:32:32,975 INFO  No Camp-YAML parser registered for parsing catalog item DSL;
skipping DSL-parsing
2016-06-09 19:32:32,990 INFO  TESTNG PASSED CONFIGURATION: "Surefire test" - @BeforeMethod
org.apache.brooklyn.policy.followthesun.AbstractFollowTheSunPolicyTest.setUp() finished in
95 ms
2016-06-09 19:32:32,990 INFO  TESTNG INVOKING: "Surefire test" - org.apache.brooklyn.policy.followthesun.FollowTheSunPolicySoakTest.testLoadBalancingManyItemsQuickTest()
2016-06-09 19:32:33,016 WARN  Deprecated use of unmanaged location (SimulatedLocation{id=pbvcrx7r84,
name=loc1}); will be managed automatically now but not supported in future versions
2016-06-09 19:32:33,115 WARN  Deprecated use of unmanaged location (SimulatedLocation{id=mwf1lqudho,
name=loc2}); will be managed automatically now but not supported in future versions
2016-06-09 19:32:33,328 INFO  FollowTheSunPolicySoakTest: cycle 1
2016-06-09 19:32:33,378 INFO  POLICY pool-model detected MockItem[item-movable9] should be
in location SimulatedLocation{id=pbvcrx7r84, name=loc1} on MockContainer[container-loc1-2]
(2000.8898156610303 of 2208.446584698346 msgs/sec), migrating
2016-06-09 19:32:33,379 INFO  POLICY pool-model detected MockItem[item-movable3] should be
in location SimulatedLocation{id=pbvcrx7r84, name=loc1} on MockContainer[container-loc1-2]
(1994.64343606039 of 2189.8105711636917 msgs/sec), migrating
2016-06-09 19:32:33,381 INFO  POLICY pool-model detected MockItem[item-movable4] should be
in location SimulatedLocation{id=pbvcrx7r84, name=loc1} on MockContainer[container-loc1-2]
(2000.875440195272 of 2199.409564720752 msgs/sec), migrating
2016-06-09 19:32:33,382 INFO  POLICY pool-model detected MockItem[item-movable5] should be
in location SimulatedLocation{id=pbvcrx7r84, name=loc1} on MockContainer[container-loc1-2]
(2014.6007894170052 of 2206.3690817937827 msgs/sec), migrating
2016-06-09 19:32:33,387 INFO  TESTNG PASSED: "Surefire test" - org.apache.brooklyn.policy.followthesun.FollowTheSunPolicySoakTest.testLoadBalancingManyItemsQuickTest()
finished in 397 ms
2016-06-09 19:32:33,387 INFO  TESTNG INVOKING CONFIGURATION: "Surefire test" - @AfterMethod
org.apache.brooklyn.policy.followthesun.AbstractFollowTheSunPolicyTest.tearDown()
2016-06-09 19:32:33,415 INFO  TESTNG PASSED CONFIGURATION: "Surefire test" - @AfterMethod
org.apache.brooklyn.policy.followthesun.AbstractFollowTheSunPolicyTest.tearDown() finished
in 28 ms
2016-06-09 19:32:33,466 INFO  TESTNG 
===============================================
    Surefire test
    Tests run: 226, Failures: 1, Skips: 0
===============================================
2016-06-09 19:32:33,467 INFO  BrooklynLeakListener.onFinish attempting to terminate all extant
ManagementContexts: name=Surefire test; includedGroups=[]; excludedGroups=[Integration, Live-sanity,
Acceptance, Live, Broken, WIP]; suiteName=Surefire suite; outDir=<https://builds.apache.org/job/brooklyn-server-master/ws/policy/target/surefire-reports/Surefire>
suite: no org.apache.brooklyn.core.management.internal.LocalManagementContext available, so
skipped
SUREFIRE-859: [GC 346407K->162279K(746496K), 0.0311920 secs]
Tests run: 226, Failures: 1, Errors: 0, Skipped: 0, Time elapsed: 119.376 sec <<<
FAILURE! - in TestSuite
testLoadBalancingQuickTest(org.apache.brooklyn.policy.loadbalancing.LoadBalancingPolicySoakTest)
 Time elapsed: 40.263 sec  <<< FAILURE!
org.apache.brooklyn.util.exceptions.PropagatedRuntimeException: failed succeeds-eventually,
89 attempts, 40002ms elapsed: AssertionError: containers=[MockContainer[container-1], MockContainer[container-2],
MockContainer[container-3], MockContainer[container-4], MockContainer[container-5.1.1]]; containerRates=[566.0,
286.0, 284.0, 287.0, 0.0]; itemDistributionByContainer={MockContainer[container-1]=[MockItem[item-4],
MockItem[item-5.1.1]], MockContainer[container-2]=[MockItem[item-2]], MockContainer[container-3]=[MockItem[item-1]],
MockContainer[container-4]=[MockItem[item-3]], MockContainer[container-5.1.1]=[]}; itemDistributionByItem={MockItem[item-1]=MockContainer[container-3],
MockItem[item-2]=MockContainer[container-2], MockItem[item-3]=MockContainer[container-4],
MockItem[item-4]=MockContainer[container-1], MockItem[item-5.1.1]=MockContainer[container-1]};
model=Container 'MockContainer[container-4]': 
	Item 'MockItem[item-3]' (287.0)
Container 'MockContainer[container-3]': 
	Item 'MockItem[item-1]' (284.0)
Container 'MockContainer[container-5]': 
Container 'MockContainer[container-2]': 
	Item 'MockItem[item-2]' (286.0)
Container 'MockContainer[container-1]': 
	Item 'MockItem[item-5.1.1]' (283.0)
	Item 'MockItem[item-4]' (283.0)
Container 'MockContainer[container-5.1.1]': 
; totalMoves=18; lastMoveTime=2016-06-09 19:31:08.222; itemRates=[284, 286, 287, 283, 283]
expected [true] but found [false]
	at org.testng.Assert.fail(Assert.java:94)
	at org.testng.Assert.failNotEquals(Assert.java:494)
	at org.testng.Assert.assertTrue(Assert.java:42)
	at org.apache.brooklyn.policy.loadbalancing.LoadBalancingPolicySoakTest$1.run(LoadBalancingPolicySoakTest.java:210)
	at org.apache.brooklyn.test.Asserts$RunnableAdapter.call(Asserts.java:1277)
	at org.apache.brooklyn.test.Asserts.succeedsEventually(Asserts.java:930)
	at org.apache.brooklyn.test.Asserts.succeedsEventually(Asserts.java:854)
	at org.apache.brooklyn.policy.loadbalancing.LoadBalancingPolicySoakTest.runLoadBalancingSoakTest(LoadBalancingPolicySoakTest.java:178)
	at org.apache.brooklyn.policy.loadbalancing.LoadBalancingPolicySoakTest.testLoadBalancingQuickTest(LoadBalancingPolicySoakTest.java:57)


Results :

Failed tests: 
  LoadBalancingPolicySoakTest.testLoadBalancingQuickTest:57->runLoadBalancingSoakTest:178
ยป PropagatedRuntime

Tests run: 226, Failures: 1, Errors: 0, Skipped: 0

[JENKINS] Recording test results
[INFO] ------------------------------------------------------------------------
[INFO] Reactor Summary:
[INFO] 
[INFO] Brooklyn Server Root ............................... SUCCESS [  4.726 s]
[INFO] Brooklyn Parent Project ............................ SUCCESS [  9.887 s]
[INFO] Brooklyn Test Support Utilities .................... SUCCESS [ 10.374 s]
[INFO] Brooklyn Logback Includable Configuration .......... SUCCESS [  3.749 s]
[INFO] Brooklyn Common Utilities .......................... SUCCESS [ 35.837 s]
[INFO] Brooklyn API ....................................... SUCCESS [  5.490 s]
[INFO] CAMP Server Parent Project ......................... SUCCESS [  1.606 s]
[INFO] CAMP Base .......................................... SUCCESS [  5.794 s]
[INFO] Brooklyn Test Support .............................. SUCCESS [  3.517 s]
[INFO] Brooklyn REST Swagger Apidoc Utilities ............. SUCCESS [  5.012 s]
[INFO] Brooklyn Logback Configuration ..................... SUCCESS [  2.148 s]
[INFO] CAMP Server ........................................ SUCCESS [ 10.539 s]
[INFO] Brooklyn Felix Runtime ............................. SUCCESS [  7.054 s]
[INFO] Brooklyn Groovy Utilities .......................... SUCCESS [  3.502 s]
[INFO] Brooklyn Core ...................................... SUCCESS [04:37 min]
[INFO] Brooklyn Policies .................................. FAILURE [02:06 min]
[INFO] Brooklyn WinRM Software Entities ................... SKIPPED
[INFO] Brooklyn Secure JMXMP Agent ........................ SKIPPED
[INFO] Brooklyn JMX RMI Agent ............................. SKIPPED
[INFO] Brooklyn Jclouds Location Targets .................. SKIPPED
[INFO] Brooklyn Software Base ............................. SKIPPED
[INFO] Brooklyn CAMP REST API ............................. SKIPPED
[INFO] Brooklyn Hazelcast Storage ......................... SKIPPED
[INFO] Brooklyn Launcher Common ........................... SKIPPED
[INFO] Brooklyn REST API .................................. SKIPPED
[INFO] Brooklyn REST Resources ............................ SKIPPED
[INFO] Brooklyn REST Server ............................... SKIPPED
[INFO] Brooklyn Launcher .................................. SKIPPED
[INFO] Brooklyn Command Line Interface .................... SKIPPED
[INFO] Brooklyn REST Client ............................... SKIPPED
[INFO] Brooklyn Test Framework ............................ SKIPPED
[INFO] Brooklyn OSGi init ................................. SKIPPED
[INFO] Brooklyn Karaf ..................................... SKIPPED
[INFO] Jetty config fragment .............................. SKIPPED
[INFO] Brooklyn Karaf Features ............................ SKIPPED
[INFO] Brooklyn Karaf Shell Commands ...................... SKIPPED
[INFO] Brooklyn Karaf Distro .............................. SKIPPED
[INFO] Brooklyn Karaf pax-exam itest ...................... SKIPPED
[INFO] ------------------------------------------------------------------------
[INFO] BUILD FAILURE
[INFO] ------------------------------------------------------------------------
[INFO] Total time: 09:10 min
[INFO] Finished at: 2016-06-09T19:32:46+00:00
[INFO] Final Memory: 88M/569M
[INFO] ------------------------------------------------------------------------
Waiting for Jenkins to finish collecting data
[ERROR] Failed to execute goal org.apache.maven.plugins:maven-surefire-plugin:2.18.1:test
(default-test) on project brooklyn-policy: There are test failures.
[ERROR] 
[ERROR] Please refer to <https://builds.apache.org/job/brooklyn-server-master/ws/policy/target/surefire-reports>
for the individual test results.
[ERROR] -> [Help 1]
[ERROR] 
[ERROR] To see the full stack trace of the errors, re-run Maven with the -e switch.
[ERROR] Re-run Maven using the -X switch to enable full debug logging.
[ERROR] 
[ERROR] For more information about the errors and possible solutions, please read the following
articles:
[ERROR] [Help 1] http://cwiki.apache.org/confluence/display/MAVEN/MojoFailureException
[ERROR] 
[ERROR] After correcting the problems, you can resume the build with the command
[ERROR]   mvn <goals> -rf :brooklyn-policy
[JENKINS] Archiving <https://builds.apache.org/job/brooklyn-server-master/ws/policy/pom.xml>
to org.apache.brooklyn/brooklyn-policy/0.10.0-SNAPSHOT/brooklyn-policy-0.10.0-SNAPSHOT.pom
[JENKINS] Archiving <https://builds.apache.org/job/brooklyn-server-master/ws/storage/hazelcast/pom.xml>
to org.apache.brooklyn/brooklyn-storage-hazelcast/0.10.0-SNAPSHOT/brooklyn-storage-hazelcast-0.10.0-SNAPSHOT.pom
[JENKINS] Archiving <https://builds.apache.org/job/brooklyn-server-master/ws/test-framework/pom.xml>
to org.apache.brooklyn/brooklyn-test-framework/0.10.0-SNAPSHOT/brooklyn-test-framework-0.10.0-SNAPSHOT.pom
[JENKINS] Archiving <https://builds.apache.org/job/brooklyn-server-master/ws/karaf/init/pom.xml>
to org.apache.brooklyn/brooklyn-karaf-init/0.10.0-SNAPSHOT/brooklyn-karaf-init-0.10.0-SNAPSHOT.pom
[JENKINS] Archiving <https://builds.apache.org/job/brooklyn-server-master/ws/pom.xml>
to org.apache.brooklyn/brooklyn-server/0.10.0-SNAPSHOT/brooklyn-server-0.10.0-SNAPSHOT.pom
[JENKINS] Archiving <https://builds.apache.org/job/brooklyn-server-master/ws/karaf/commands/pom.xml>
to org.apache.brooklyn/brooklyn-commands/0.10.0-SNAPSHOT/brooklyn-commands-0.10.0-SNAPSHOT.pom
[JENKINS] Archiving <https://builds.apache.org/job/brooklyn-server-master/ws/rest/rest-api/pom.xml>
to org.apache.brooklyn/brooklyn-rest-api/0.10.0-SNAPSHOT/brooklyn-rest-api-0.10.0-SNAPSHOT.pom
[JENKINS] Archiving <https://builds.apache.org/job/brooklyn-server-master/ws/core/pom.xml>
to org.apache.brooklyn/brooklyn-core/0.10.0-SNAPSHOT/brooklyn-core-0.10.0-SNAPSHOT.pom
[JENKINS] Archiving <https://builds.apache.org/job/brooklyn-server-master/ws/core/target/brooklyn-core-0.10.0-SNAPSHOT.jar>
to org.apache.brooklyn/brooklyn-core/0.10.0-SNAPSHOT/brooklyn-core-0.10.0-SNAPSHOT.jar
[JENKINS] Archiving <https://builds.apache.org/job/brooklyn-server-master/ws/core/target/brooklyn-core-0.10.0-SNAPSHOT-tests.jar>
to org.apache.brooklyn/brooklyn-core/0.10.0-SNAPSHOT/brooklyn-core-0.10.0-SNAPSHOT-tests.jar
[JENKINS] Archiving <https://builds.apache.org/job/brooklyn-server-master/ws/core/target/brooklyn-core-0.10.0-SNAPSHOT-sources.jar>
to org.apache.brooklyn/brooklyn-core/0.10.0-SNAPSHOT/brooklyn-core-0.10.0-SNAPSHOT-sources.jar
[JENKINS] Archiving <https://builds.apache.org/job/brooklyn-server-master/ws/core/target/brooklyn-core-0.10.0-SNAPSHOT-test-sources.jar>
to org.apache.brooklyn/brooklyn-core/0.10.0-SNAPSHOT/brooklyn-core-0.10.0-SNAPSHOT-test-sources.jar
[JENKINS] Archiving <https://builds.apache.org/job/brooklyn-server-master/ws/logging/logback-xml/pom.xml>
to org.apache.brooklyn/brooklyn-logback-xml/0.10.0-SNAPSHOT/brooklyn-logback-xml-0.10.0-SNAPSHOT.pom
[JENKINS] Archiving <https://builds.apache.org/job/brooklyn-server-master/ws/logging/logback-xml/target/brooklyn-logback-xml-0.10.0-SNAPSHOT.jar>
to org.apache.brooklyn/brooklyn-logback-xml/0.10.0-SNAPSHOT/brooklyn-logback-xml-0.10.0-SNAPSHOT.jar
[JENKINS] Archiving <https://builds.apache.org/job/brooklyn-server-master/ws/logging/logback-xml/target/brooklyn-logback-xml-0.10.0-SNAPSHOT-sources.jar>
to org.apache.brooklyn/brooklyn-logback-xml/0.10.0-SNAPSHOT/brooklyn-logback-xml-0.10.0-SNAPSHOT-sources.jar
[JENKINS] Archiving <https://builds.apache.org/job/brooklyn-server-master/ws/logging/logback-xml/target/brooklyn-logback-xml-0.10.0-SNAPSHOT-test-sources.jar>
to org.apache.brooklyn/brooklyn-logback-xml/0.10.0-SNAPSHOT/brooklyn-logback-xml-0.10.0-SNAPSHOT-test-sources.jar
[JENKINS] Archiving <https://builds.apache.org/job/brooklyn-server-master/ws/karaf/features/pom.xml>
to org.apache.brooklyn/brooklyn-features/0.10.0-SNAPSHOT/brooklyn-features-0.10.0-SNAPSHOT.pom
[JENKINS] Archiving <https://builds.apache.org/job/brooklyn-server-master/ws/rest/rest-resources/pom.xml>
to org.apache.brooklyn/brooklyn-rest-resources/0.10.0-SNAPSHOT/brooklyn-rest-resources-0.10.0-SNAPSHOT.pom
[JENKINS] Archiving <https://builds.apache.org/job/brooklyn-server-master/ws/camp/camp-server/pom.xml>
to org.apache.brooklyn.camp/camp-server/0.10.0-SNAPSHOT/camp-server-0.10.0-SNAPSHOT.pom
[JENKINS] Archiving <https://builds.apache.org/job/brooklyn-server-master/ws/camp/camp-server/target/camp-server-0.10.0-SNAPSHOT.jar>
to org.apache.brooklyn.camp/camp-server/0.10.0-SNAPSHOT/camp-server-0.10.0-SNAPSHOT.jar
[JENKINS] Archiving <https://builds.apache.org/job/brooklyn-server-master/ws/camp/camp-server/target/camp-server-0.10.0-SNAPSHOT-tests.jar>
to org.apache.brooklyn.camp/camp-server/0.10.0-SNAPSHOT/camp-server-0.10.0-SNAPSHOT-tests.jar
[JENKINS] Archiving <https://builds.apache.org/job/brooklyn-server-master/ws/camp/camp-server/target/camp-server-0.10.0-SNAPSHOT-sources.jar>
to org.apache.brooklyn.camp/camp-server/0.10.0-SNAPSHOT/camp-server-0.10.0-SNAPSHOT-sources.jar
[JENKINS] Archiving <https://builds.apache.org/job/brooklyn-server-master/ws/camp/camp-server/target/camp-server-0.10.0-SNAPSHOT-test-sources.jar>
to org.apache.brooklyn.camp/camp-server/0.10.0-SNAPSHOT/camp-server-0.10.0-SNAPSHOT-test-sources.jar
[JENKINS] Archiving <https://builds.apache.org/job/brooklyn-server-master/ws/launcher-common/pom.xml>
to org.apache.brooklyn/brooklyn-launcher-common/0.10.0-SNAPSHOT/brooklyn-launcher-common-0.10.0-SNAPSHOT.pom
[JENKINS] Archiving <https://builds.apache.org/job/brooklyn-server-master/ws/utils/groovy/pom.xml>
to org.apache.brooklyn/brooklyn-utils-groovy/0.10.0-SNAPSHOT/brooklyn-utils-groovy-0.10.0-SNAPSHOT.pom
[JENKINS] Archiving <https://builds.apache.org/job/brooklyn-server-master/ws/utils/groovy/target/brooklyn-utils-groovy-0.10.0-SNAPSHOT.jar>
to org.apache.brooklyn/brooklyn-utils-groovy/0.10.0-SNAPSHOT/brooklyn-utils-groovy-0.10.0-SNAPSHOT.jar
[JENKINS] Archiving <https://builds.apache.org/job/brooklyn-server-master/ws/utils/groovy/target/brooklyn-utils-groovy-0.10.0-SNAPSHOT-tests.jar>
to org.apache.brooklyn/brooklyn-utils-groovy/0.10.0-SNAPSHOT/brooklyn-utils-groovy-0.10.0-SNAPSHOT-tests.jar
[JENKINS] Archiving <https://builds.apache.org/job/brooklyn-server-master/ws/utils/groovy/target/brooklyn-utils-groovy-0.10.0-SNAPSHOT-sources.jar>
to org.apache.brooklyn/brooklyn-utils-groovy/0.10.0-SNAPSHOT/brooklyn-utils-groovy-0.10.0-SNAPSHOT-sources.jar
[JENKINS] Archiving <https://builds.apache.org/job/brooklyn-server-master/ws/utils/groovy/target/brooklyn-utils-groovy-0.10.0-SNAPSHOT-test-sources.jar>
to org.apache.brooklyn/brooklyn-utils-groovy/0.10.0-SNAPSHOT/brooklyn-utils-groovy-0.10.0-SNAPSHOT-test-sources.jar
[JENKINS] Archiving <https://builds.apache.org/job/brooklyn-server-master/ws/utils/common/pom.xml>
to org.apache.brooklyn/brooklyn-utils-common/0.10.0-SNAPSHOT/brooklyn-utils-common-0.10.0-SNAPSHOT.pom
[JENKINS] Archiving <https://builds.apache.org/job/brooklyn-server-master/ws/utils/common/target/brooklyn-utils-common-0.10.0-SNAPSHOT.jar>
to org.apache.brooklyn/brooklyn-utils-common/0.10.0-SNAPSHOT/brooklyn-utils-common-0.10.0-SNAPSHOT.jar
[JENKINS] Archiving <https://builds.apache.org/job/brooklyn-server-master/ws/utils/common/target/brooklyn-utils-common-0.10.0-SNAPSHOT-tests.jar>
to org.apache.brooklyn/brooklyn-utils-common/0.10.0-SNAPSHOT/brooklyn-utils-common-0.10.0-SNAPSHOT-tests.jar
[JENKINS] Archiving <https://builds.apache.org/job/brooklyn-server-master/ws/utils/common/target/brooklyn-utils-common-0.10.0-SNAPSHOT-sources.jar>
to org.apache.brooklyn/brooklyn-utils-common/0.10.0-SNAPSHOT/brooklyn-utils-common-0.10.0-SNAPSHOT-sources.jar
[JENKINS] Archiving <https://builds.apache.org/job/brooklyn-server-master/ws/utils/common/target/brooklyn-utils-common-0.10.0-SNAPSHOT-test-sources.jar>
to org.apache.brooklyn/brooklyn-utils-common/0.10.0-SNAPSHOT/brooklyn-utils-common-0.10.0-SNAPSHOT-test-sources.jar
[JENKINS] Archiving <https://builds.apache.org/job/brooklyn-server-master/ws/locations/jclouds/pom.xml>
to org.apache.brooklyn/brooklyn-locations-jclouds/0.10.0-SNAPSHOT/brooklyn-locations-jclouds-0.10.0-SNAPSHOT.pom
[JENKINS] Archiving <https://builds.apache.org/job/brooklyn-server-master/ws/test-support/pom.xml>
to org.apache.brooklyn/brooklyn-test-support/0.10.0-SNAPSHOT/brooklyn-test-support-0.10.0-SNAPSHOT.pom
[JENKINS] Archiving <https://builds.apache.org/job/brooklyn-server-master/ws/test-support/target/brooklyn-test-support-0.10.0-SNAPSHOT.jar>
to org.apache.brooklyn/brooklyn-test-support/0.10.0-SNAPSHOT/brooklyn-test-support-0.10.0-SNAPSHOT.jar
[JENKINS] Archiving <https://builds.apache.org/job/brooklyn-server-master/ws/test-support/target/brooklyn-test-support-0.10.0-SNAPSHOT-sources.jar>
to org.apache.brooklyn/brooklyn-test-support/0.10.0-SNAPSHOT/brooklyn-test-support-0.10.0-SNAPSHOT-sources.jar
[JENKINS] Archiving <https://builds.apache.org/job/brooklyn-server-master/ws/test-support/target/brooklyn-test-support-0.10.0-SNAPSHOT-test-sources.jar>
to org.apache.brooklyn/brooklyn-test-support/0.10.0-SNAPSHOT/brooklyn-test-support-0.10.0-SNAPSHOT-test-sources.jar
[JENKINS] Archiving <https://builds.apache.org/job/brooklyn-server-master/ws/karaf/pom.xml>
to org.apache.brooklyn/brooklyn-karaf/0.10.0-SNAPSHOT/brooklyn-karaf-0.10.0-SNAPSHOT.pom
[JENKINS] Archiving <https://builds.apache.org/job/brooklyn-server-master/ws/utils/rt-felix/pom.xml>
to org.apache.brooklyn/brooklyn-rt-felix/0.10.0-SNAPSHOT/brooklyn-rt-felix-0.10.0-SNAPSHOT.pom
[JENKINS] Archiving <https://builds.apache.org/job/brooklyn-server-master/ws/utils/rt-felix/target/brooklyn-rt-felix-0.10.0-SNAPSHOT.jar>
to org.apache.brooklyn/brooklyn-rt-felix/0.10.0-SNAPSHOT/brooklyn-rt-felix-0.10.0-SNAPSHOT.jar
[JENKINS] Archiving <https://builds.apache.org/job/brooklyn-server-master/ws/utils/rt-felix/target/brooklyn-rt-felix-0.10.0-SNAPSHOT-tests.jar>
to org.apache.brooklyn/brooklyn-rt-felix/0.10.0-SNAPSHOT/brooklyn-rt-felix-0.10.0-SNAPSHOT-tests.jar
[JENKINS] Archiving <https://builds.apache.org/job/brooklyn-server-master/ws/utils/rt-felix/target/brooklyn-rt-felix-0.10.0-SNAPSHOT-sources.jar>
to org.apache.brooklyn/brooklyn-rt-felix/0.10.0-SNAPSHOT/brooklyn-rt-felix-0.10.0-SNAPSHOT-sources.jar
[JENKINS] Archiving <https://builds.apache.org/job/brooklyn-server-master/ws/utils/rt-felix/target/brooklyn-rt-felix-0.10.0-SNAPSHOT-test-sources.jar>
to org.apache.brooklyn/brooklyn-rt-felix/0.10.0-SNAPSHOT/brooklyn-rt-felix-0.10.0-SNAPSHOT-test-sources.jar
[JENKINS] Archiving <https://builds.apache.org/job/brooklyn-server-master/ws/karaf/itest/pom.xml>
to org.apache.brooklyn/brooklyn-itest/0.10.0-SNAPSHOT/brooklyn-itest-0.10.0-SNAPSHOT.pom
[JENKINS] Archiving <https://builds.apache.org/job/brooklyn-server-master/ws/software/winrm/pom.xml>
to org.apache.brooklyn/brooklyn-software-winrm/0.10.0-SNAPSHOT/brooklyn-software-winrm-0.10.0-SNAPSHOT.pom
[JENKINS] Archiving <https://builds.apache.org/job/brooklyn-server-master/ws/rest/rest-server/pom.xml>
to org.apache.brooklyn/brooklyn-rest-server/0.10.0-SNAPSHOT/brooklyn-rest-server-0.10.0-SNAPSHOT.pom
[JENKINS] Archiving <https://builds.apache.org/job/brooklyn-server-master/ws/camp/camp-base/pom.xml>
to org.apache.brooklyn.camp/camp-base/0.10.0-SNAPSHOT/camp-base-0.10.0-SNAPSHOT.pom
[JENKINS] Archiving <https://builds.apache.org/job/brooklyn-server-master/ws/camp/camp-base/target/camp-base-0.10.0-SNAPSHOT.jar>
to org.apache.brooklyn.camp/camp-base/0.10.0-SNAPSHOT/camp-base-0.10.0-SNAPSHOT.jar
[JENKINS] Archiving <https://builds.apache.org/job/brooklyn-server-master/ws/camp/camp-base/target/camp-base-0.10.0-SNAPSHOT-tests.jar>
to org.apache.brooklyn.camp/camp-base/0.10.0-SNAPSHOT/camp-base-0.10.0-SNAPSHOT-tests.jar
[JENKINS] Archiving <https://builds.apache.org/job/brooklyn-server-master/ws/camp/camp-base/target/camp-base-0.10.0-SNAPSHOT-sources.jar>
to org.apache.brooklyn.camp/camp-base/0.10.0-SNAPSHOT/camp-base-0.10.0-SNAPSHOT-sources.jar
[JENKINS] Archiving <https://builds.apache.org/job/brooklyn-server-master/ws/camp/camp-base/target/camp-base-0.10.0-SNAPSHOT-test-sources.jar>
to org.apache.brooklyn.camp/camp-base/0.10.0-SNAPSHOT/camp-base-0.10.0-SNAPSHOT-test-sources.jar
[JENKINS] Archiving <https://builds.apache.org/job/brooklyn-server-master/ws/rest/rest-client/pom.xml>
to org.apache.brooklyn/brooklyn-rest-client/0.10.0-SNAPSHOT/brooklyn-rest-client-0.10.0-SNAPSHOT.pom
[JENKINS] Archiving <https://builds.apache.org/job/brooklyn-server-master/ws/karaf/apache-brooklyn/pom.xml>
to org.apache.brooklyn/apache-brooklyn/0.10.0-SNAPSHOT/apache-brooklyn-0.10.0-SNAPSHOT.pom
[JENKINS] Archiving <https://builds.apache.org/job/brooklyn-server-master/ws/utils/jmx/jmxmp-ssl-agent/pom.xml>
to org.apache.brooklyn/brooklyn-jmxmp-agent/0.10.0-SNAPSHOT/brooklyn-jmxmp-agent-0.10.0-SNAPSHOT.pom
[JENKINS] Archiving <https://builds.apache.org/job/brooklyn-server-master/ws/utils/jmx/jmxrmi-agent/pom.xml>
to org.apache.brooklyn/brooklyn-jmxrmi-agent/0.10.0-SNAPSHOT/brooklyn-jmxrmi-agent-0.10.0-SNAPSHOT.pom
[JENKINS] Archiving <https://builds.apache.org/job/brooklyn-server-master/ws/camp/camp-brooklyn/pom.xml>
to org.apache.brooklyn/brooklyn-camp/0.10.0-SNAPSHOT/brooklyn-camp-0.10.0-SNAPSHOT.pom
[JENKINS] Archiving <https://builds.apache.org/job/brooklyn-server-master/ws/parent/pom.xml>
to org.apache.brooklyn/brooklyn-parent/0.10.0-SNAPSHOT/brooklyn-parent-0.10.0-SNAPSHOT.pom
Compressed 80.70 KB of artifacts by 79.3% relative to #126
[JENKINS] Archiving <https://builds.apache.org/job/brooklyn-server-master/ws/server-cli/pom.xml>
to org.apache.brooklyn/brooklyn-cli/0.10.0-SNAPSHOT/brooklyn-cli-0.10.0-SNAPSHOT.pom
[JENKINS] Archiving <https://builds.apache.org/job/brooklyn-server-master/ws/software/base/pom.xml>
to org.apache.brooklyn/brooklyn-software-base/0.10.0-SNAPSHOT/brooklyn-software-base-0.10.0-SNAPSHOT.pom
[JENKINS] Archiving <https://builds.apache.org/job/brooklyn-server-master/ws/logging/logback-includes/pom.xml>
to org.apache.brooklyn/brooklyn-logback-includes/0.10.0-SNAPSHOT/brooklyn-logback-includes-0.10.0-SNAPSHOT.pom
[JENKINS] Archiving <https://builds.apache.org/job/brooklyn-server-master/ws/logging/logback-includes/target/brooklyn-logback-includes-0.10.0-SNAPSHOT.jar>
to org.apache.brooklyn/brooklyn-logback-includes/0.10.0-SNAPSHOT/brooklyn-logback-includes-0.10.0-SNAPSHOT.jar
[JENKINS] Archiving <https://builds.apache.org/job/brooklyn-server-master/ws/logging/logback-includes/target/brooklyn-logback-includes-0.10.0-SNAPSHOT-sources.jar>
to org.apache.brooklyn/brooklyn-logback-includes/0.10.0-SNAPSHOT/brooklyn-logback-includes-0.10.0-SNAPSHOT-sources.jar
[JENKINS] Archiving <https://builds.apache.org/job/brooklyn-server-master/ws/logging/logback-includes/target/brooklyn-logback-includes-0.10.0-SNAPSHOT-test-sources.jar>
to org.apache.brooklyn/brooklyn-logback-includes/0.10.0-SNAPSHOT/brooklyn-logback-includes-0.10.0-SNAPSHOT-test-sources.jar
[JENKINS] Archiving <https://builds.apache.org/job/brooklyn-server-master/ws/launcher/pom.xml>
to org.apache.brooklyn/brooklyn-launcher/0.10.0-SNAPSHOT/brooklyn-launcher-0.10.0-SNAPSHOT.pom
[JENKINS] Archiving <https://builds.apache.org/job/brooklyn-server-master/ws/karaf/jetty-config/pom.xml>
to org.apache.brooklyn/brooklyn-karaf-jetty-config/0.10.0-SNAPSHOT/brooklyn-karaf-jetty-config-0.10.0-SNAPSHOT.pom
[JENKINS] Archiving <https://builds.apache.org/job/brooklyn-server-master/ws/utils/rest-swagger/pom.xml>
to org.apache.brooklyn/brooklyn-utils-rest-swagger/0.10.0-SNAPSHOT/brooklyn-utils-rest-swagger-0.10.0-SNAPSHOT.pom
[JENKINS] Archiving <https://builds.apache.org/job/brooklyn-server-master/ws/utils/rest-swagger/target/brooklyn-utils-rest-swagger-0.10.0-SNAPSHOT.jar>
to org.apache.brooklyn/brooklyn-utils-rest-swagger/0.10.0-SNAPSHOT/brooklyn-utils-rest-swagger-0.10.0-SNAPSHOT.jar
[JENKINS] Archiving <https://builds.apache.org/job/brooklyn-server-master/ws/utils/rest-swagger/target/brooklyn-utils-rest-swagger-0.10.0-SNAPSHOT-sources.jar>
to org.apache.brooklyn/brooklyn-utils-rest-swagger/0.10.0-SNAPSHOT/brooklyn-utils-rest-swagger-0.10.0-SNAPSHOT-sources.jar
[JENKINS] Archiving <https://builds.apache.org/job/brooklyn-server-master/ws/utils/rest-swagger/target/brooklyn-utils-rest-swagger-0.10.0-SNAPSHOT-test-sources.jar>
to org.apache.brooklyn/brooklyn-utils-rest-swagger/0.10.0-SNAPSHOT/brooklyn-utils-rest-swagger-0.10.0-SNAPSHOT-test-sources.jar
[JENKINS] Archiving <https://builds.apache.org/job/brooklyn-server-master/ws/utils/test-support/pom.xml>
to org.apache.brooklyn/brooklyn-utils-test-support/0.10.0-SNAPSHOT/brooklyn-utils-test-support-0.10.0-SNAPSHOT.pom
[JENKINS] Archiving <https://builds.apache.org/job/brooklyn-server-master/ws/utils/test-support/target/brooklyn-utils-test-support-0.10.0-SNAPSHOT.jar>
to org.apache.brooklyn/brooklyn-utils-test-support/0.10.0-SNAPSHOT/brooklyn-utils-test-support-0.10.0-SNAPSHOT.jar
[JENKINS] Archiving <https://builds.apache.org/job/brooklyn-server-master/ws/utils/test-support/target/brooklyn-utils-test-support-0.10.0-SNAPSHOT-sources.jar>
to org.apache.brooklyn/brooklyn-utils-test-support/0.10.0-SNAPSHOT/brooklyn-utils-test-support-0.10.0-SNAPSHOT-sources.jar
[JENKINS] Archiving <https://builds.apache.org/job/brooklyn-server-master/ws/utils/test-support/target/brooklyn-utils-test-support-0.10.0-SNAPSHOT-test-sources.jar>
to org.apache.brooklyn/brooklyn-utils-test-support/0.10.0-SNAPSHOT/brooklyn-utils-test-support-0.10.0-SNAPSHOT-test-sources.jar
[JENKINS] Archiving <https://builds.apache.org/job/brooklyn-server-master/ws/camp/pom.xml>
to org.apache.brooklyn.camp/camp-parent/0.10.0-SNAPSHOT/camp-parent-0.10.0-SNAPSHOT.pom
[JENKINS] Archiving <https://builds.apache.org/job/brooklyn-server-master/ws/api/pom.xml>
to org.apache.brooklyn/brooklyn-api/0.10.0-SNAPSHOT/brooklyn-api-0.10.0-SNAPSHOT.pom
[JENKINS] Archiving <https://builds.apache.org/job/brooklyn-server-master/ws/api/target/brooklyn-api-0.10.0-SNAPSHOT.jar>
to org.apache.brooklyn/brooklyn-api/0.10.0-SNAPSHOT/brooklyn-api-0.10.0-SNAPSHOT.jar
[JENKINS] Archiving <https://builds.apache.org/job/brooklyn-server-master/ws/api/target/brooklyn-api-0.10.0-SNAPSHOT-sources.jar>
to org.apache.brooklyn/brooklyn-api/0.10.0-SNAPSHOT/brooklyn-api-0.10.0-SNAPSHOT-sources.jar
[JENKINS] Archiving <https://builds.apache.org/job/brooklyn-server-master/ws/api/target/brooklyn-api-0.10.0-SNAPSHOT-test-sources.jar>
to org.apache.brooklyn/brooklyn-api/0.10.0-SNAPSHOT/brooklyn-api-0.10.0-SNAPSHOT-test-sources.jar
channel stopped

Mime
View raw message