brooklyn-dev mailing list archives

Site index · List index
Message view « Date » · « Thread »
Top « Date » · « Thread »
From Apache Jenkins Server <jenk...@builds.apache.org>
Subject Build failed in Jenkins: brooklyn-ui-master #9
Date Wed, 06 Apr 2016 15:14:48 GMT
See <https://builds.apache.org/job/brooklyn-ui-master/9/changes>

Changes:

[thomas.bouron] BROOKLYN-244: Fix blueprint composer loading issue

[thomas.bouron] BROOKLYN-244: Add error handling if the applications' fetch fails

------------------------------------------
[...truncated 1072 lines...]
text!tpl/editor/page.html
text!tpl/editor/location-alert.html
<https://builds.apache.org/job/brooklyn-ui-master/ws/target/brooklyn-jsgui-0.10.0-SNAPSHOT/assets/js/util/jquery.slideto.js>
<https://builds.apache.org/job/brooklyn-ui-master/ws/target/brooklyn-jsgui-0.10.0-SNAPSHOT/assets/js/libs/jquery.wiggle.min.js>
<https://builds.apache.org/job/brooklyn-ui-master/ws/target/brooklyn-jsgui-0.10.0-SNAPSHOT/assets/js/libs/jquery.ba-bbq.min.js>
<https://builds.apache.org/job/brooklyn-ui-master/ws/target/brooklyn-jsgui-0.10.0-SNAPSHOT/assets/js/libs/handlebars-1.0.rc.1.js>
<https://builds.apache.org/job/brooklyn-ui-master/ws/target/brooklyn-jsgui-0.10.0-SNAPSHOT/assets/js/view/editor.js>
<https://builds.apache.org/job/brooklyn-ui-master/ws/target/brooklyn-jsgui-0.10.0-SNAPSHOT/assets/js/model/entity-summary.js>
text!tpl/apps/tree-item.html
text!tpl/apps/tree-empty.html
<https://builds.apache.org/job/brooklyn-ui-master/ws/target/brooklyn-jsgui-0.10.0-SNAPSHOT/assets/js/view/application-tree.js>
text!tpl/apps/summary.html
<https://builds.apache.org/job/brooklyn-ui-master/ws/target/brooklyn-jsgui-0.10.0-SNAPSHOT/assets/js/libs/ZeroClipboard.js>
<https://builds.apache.org/job/brooklyn-ui-master/ws/target/brooklyn-jsgui-0.10.0-SNAPSHOT/assets/js/model/config-summary.js>
text!tpl/apps/config.html
text!tpl/apps/config-name.html
<https://builds.apache.org/job/brooklyn-ui-master/ws/target/brooklyn-jsgui-0.10.0-SNAPSHOT/assets/js/libs/jquery.dataTables.js>
<https://builds.apache.org/job/brooklyn-ui-master/ws/target/brooklyn-jsgui-0.10.0-SNAPSHOT/assets/js/util/dataTables.extensions.js>
<https://builds.apache.org/job/brooklyn-ui-master/ws/target/brooklyn-jsgui-0.10.0-SNAPSHOT/assets/js/view/entity-config.js>
<https://builds.apache.org/job/brooklyn-ui-master/ws/target/brooklyn-jsgui-0.10.0-SNAPSHOT/assets/js/view/entity-summary.js>
<https://builds.apache.org/job/brooklyn-ui-master/ws/target/brooklyn-jsgui-0.10.0-SNAPSHOT/assets/js/model/sensor-summary.js>
text!tpl/apps/sensors.html
text!tpl/apps/sensor-name.html
<https://builds.apache.org/job/brooklyn-ui-master/ws/target/brooklyn-jsgui-0.10.0-SNAPSHOT/assets/js/libs/URI.js>
<https://builds.apache.org/job/brooklyn-ui-master/ws/target/brooklyn-jsgui-0.10.0-SNAPSHOT/assets/js/view/entity-sensors.js>
<https://builds.apache.org/job/brooklyn-ui-master/ws/target/brooklyn-jsgui-0.10.0-SNAPSHOT/assets/js/model/effector-summary.js>
text!tpl/apps/effector-modal.html
text!tpl/apps/param.html
text!tpl/apps/param-list.html
<https://builds.apache.org/job/brooklyn-ui-master/ws/target/brooklyn-jsgui-0.10.0-SNAPSHOT/assets/js/view/effector-invoke.js>
text!tpl/apps/effector.html
text!tpl/apps/effector-row.html
<https://builds.apache.org/job/brooklyn-ui-master/ws/target/brooklyn-jsgui-0.10.0-SNAPSHOT/assets/js/view/entity-effectors.js>
<https://builds.apache.org/job/brooklyn-ui-master/ws/target/brooklyn-jsgui-0.10.0-SNAPSHOT/assets/js/model/policy-summary.js>
<https://builds.apache.org/job/brooklyn-ui-master/ws/target/brooklyn-jsgui-0.10.0-SNAPSHOT/assets/js/model/policy-config-summary.js>
text!tpl/apps/policy-parameter-config.html
<https://builds.apache.org/job/brooklyn-ui-master/ws/target/brooklyn-jsgui-0.10.0-SNAPSHOT/assets/js/view/policy-config-invoke.js>
text!tpl/apps/policy-new.html
<https://builds.apache.org/job/brooklyn-ui-master/ws/target/brooklyn-jsgui-0.10.0-SNAPSHOT/assets/js/view/policy-new.js>
text!tpl/apps/policy.html
text!tpl/apps/policy-row.html
text!tpl/apps/policy-config-row.html
<https://builds.apache.org/job/brooklyn-ui-master/ws/target/brooklyn-jsgui-0.10.0-SNAPSHOT/assets/js/view/entity-policies.js>
<https://builds.apache.org/job/brooklyn-ui-master/ws/target/brooklyn-jsgui-0.10.0-SNAPSHOT/assets/js/model/task-summary.js>
text!tpl/apps/activity-details.html
text!tpl/apps/activity-table.html
<https://builds.apache.org/job/brooklyn-ui-master/ws/target/brooklyn-jsgui-0.10.0-SNAPSHOT/assets/js/view/activity-details.js>
text!tpl/apps/activities.html
text!tpl/apps/activity-row-details.html
text!tpl/apps/activity-row-details-main.html
text!tpl/apps/activity-full-details.html
<https://builds.apache.org/job/brooklyn-ui-master/ws/target/brooklyn-jsgui-0.10.0-SNAPSHOT/assets/js/view/entity-activities.js>
text!tpl/apps/advanced.html
text!tpl/apps/change-name-modal.html
<https://builds.apache.org/job/brooklyn-ui-master/ws/target/brooklyn-jsgui-0.10.0-SNAPSHOT/assets/js/view/change-name-invoke.js>
text!tpl/apps/add-child-modal.html
<https://builds.apache.org/job/brooklyn-ui-master/ws/target/brooklyn-jsgui-0.10.0-SNAPSHOT/assets/js/view/add-child-invoke.js>
<https://builds.apache.org/job/brooklyn-ui-master/ws/target/brooklyn-jsgui-0.10.0-SNAPSHOT/assets/js/view/entity-advanced.js>
text!tpl/apps/details.html
<https://builds.apache.org/job/brooklyn-ui-master/ws/target/brooklyn-jsgui-0.10.0-SNAPSHOT/assets/js/view/entity-details.js>
text!tpl/apps/entity-not-found.html
text!tpl/apps/page.html
<https://builds.apache.org/job/brooklyn-ui-master/ws/target/brooklyn-jsgui-0.10.0-SNAPSHOT/assets/js/view/application-explorer.js>
text!tpl/catalog/page.html
text!tpl/catalog/details-entity.html
text!tpl/catalog/details-generic.html
text!tpl/catalog/details-location.html
text!tpl/catalog/add-catalog-entry.html
text!tpl/catalog/add-yaml.html
text!tpl/catalog/add-location.html
text!tpl/catalog/nav-entry.html
<https://builds.apache.org/job/brooklyn-ui-master/ws/target/brooklyn-jsgui-0.10.0-SNAPSHOT/assets/js/libs/jquery.form.js>
<https://builds.apache.org/job/brooklyn-ui-master/ws/target/brooklyn-jsgui-0.10.0-SNAPSHOT/assets/js/view/catalog.js>
text!tpl/script/groovy.html
<https://builds.apache.org/job/brooklyn-ui-master/ws/target/brooklyn-jsgui-0.10.0-SNAPSHOT/assets/js/view/script-groovy.js>
text!tpl/help/page.html
text!tpl/labs/page.html
text!tpl/home/server-caution.html
<https://builds.apache.org/job/brooklyn-ui-master/ws/target/brooklyn-jsgui-0.10.0-SNAPSHOT/assets/js/router.js>
<https://builds.apache.org/job/brooklyn-ui-master/ws/target/brooklyn-jsgui-0.10.0-SNAPSHOT/assets/js/config.js>

[INFO] 
[INFO] --- requirejs-maven-plugin:2.0.0:optimize (optimize-css) @ brooklyn-jsgui ---
[INFO] Running with Node @ <https://builds.apache.org/job/brooklyn-ui-master/ws/src/build/nodejs>
Forcing 64 bit nodejs at <https://builds.apache.org/job/brooklyn-ui-master/ws/src/build/../../target/nodejs64/node>
base.css
  URL not a relative URL, skipping: data:image/png;base64,iVBORw0KGgoAAAANSUhEUgAAAAoAAAAKCAYAAACNMs+9AAAAGXRFWHRTb2Z0d2FyZQBBZG9iZSBJbWFnZVJlYWR5ccllPAAAAJ5JREFUeNpi+P//PwMQMANxERCfAeI/UBrEZwbJQ9WAFR0A4u1AbAnEbFB6O1ScGaawGoi3wHQiYyBYDZKHKbwHxLo4FOqC5GEKf4Ksw6EQ5IyfIDYTkPEUiNUZsAOQ+F9GRkYJEKcFiDficSOIcRjE4QTiY0C8DuRbqAJLKP8/FP9kQArHUiA+jySJjA8w4LAS5KZd0MAHhaccQIABALsMiBZy4YLtAAAAAElFTkSuQmCC

<https://builds.apache.org/job/brooklyn-ui-master/ws/target/brooklyn-jsgui-0.10.0-SNAPSHOT/assets/css/styles.min.css>
----------------
<https://builds.apache.org/job/brooklyn-ui-master/ws/target/brooklyn-jsgui-0.10.0-SNAPSHOT/assets/css/bootstrap.css>
<https://builds.apache.org/job/brooklyn-ui-master/ws/target/brooklyn-jsgui-0.10.0-SNAPSHOT/assets/css/jquery.dataTables.css>
<https://builds.apache.org/job/brooklyn-ui-master/ws/target/brooklyn-jsgui-0.10.0-SNAPSHOT/assets/css/easy-autocomplete.css>
<https://builds.apache.org/job/brooklyn-ui-master/ws/target/brooklyn-jsgui-0.10.0-SNAPSHOT/assets/css/base.css>
<https://builds.apache.org/job/brooklyn-ui-master/ws/target/brooklyn-jsgui-0.10.0-SNAPSHOT/assets/css/styles.css>

[INFO] 
[INFO] --- replacer:1.5.2:replace (modify-for-optimized) @ brooklyn-jsgui ---
[INFO] Downloading: https://repo.maven.apache.org/maven2/commons-io/commons-io/2.1/commons-io-2.1.pom
[INFO] Downloaded: https://repo.maven.apache.org/maven2/commons-io/commons-io/2.1/commons-io-2.1.pom
(11 KB at 472.1 KB/sec)
[INFO] Downloading: https://repo.maven.apache.org/maven2/xerces/xercesImpl/2.8.0/xercesImpl-2.8.0.pom
[INFO] Downloaded: https://repo.maven.apache.org/maven2/xerces/xercesImpl/2.8.0/xercesImpl-2.8.0.pom
(2 KB at 62.4 KB/sec)
[INFO] Downloading: https://repo.maven.apache.org/maven2/org/apache/apache/1/apache-1.pom
[INFO] Downloaded: https://repo.maven.apache.org/maven2/org/apache/apache/1/apache-1.pom (4
KB at 158.6 KB/sec)
[INFO] Downloading: https://repo.maven.apache.org/maven2/xml-apis/xml-apis/1.3.03/xml-apis-1.3.03.pom
[INFO] Downloaded: https://repo.maven.apache.org/maven2/xml-apis/xml-apis/1.3.03/xml-apis-1.3.03.pom
(738 B at 36.0 KB/sec)
[INFO] Downloading: https://repo.maven.apache.org/maven2/org/apache/maven/maven-plugin-api/3.0.3/maven-plugin-api-3.0.3.jar
[INFO] Downloading: https://repo.maven.apache.org/maven2/org/apache/maven/maven-model/3.0.3/maven-model-3.0.3.jar
[INFO] Downloading: https://repo.maven.apache.org/maven2/org/apache/maven/maven-artifact/3.0.3/maven-artifact-3.0.3.jar
[INFO] Downloading: https://repo.maven.apache.org/maven2/commons-io/commons-io/2.1/commons-io-2.1.jar
[INFO] Downloading: https://repo.maven.apache.org/maven2/org/sonatype/sisu/sisu-inject-plexus/2.1.1/sisu-inject-plexus-2.1.1.jar
[INFO] Downloaded: https://repo.maven.apache.org/maven2/org/apache/maven/maven-plugin-api/3.0.3/maven-plugin-api-3.0.3.jar
(49 KB at 1716.0 KB/sec)
[INFO] Downloading: https://repo.maven.apache.org/maven2/xerces/xercesImpl/2.8.0/xercesImpl-2.8.0.jar
[INFO] Downloaded: https://repo.maven.apache.org/maven2/org/apache/maven/maven-artifact/3.0.3/maven-artifact-3.0.3.jar
(51 KB at 1756.5 KB/sec)
[INFO] Downloading: https://repo.maven.apache.org/maven2/xml-apis/xml-apis/1.3.03/xml-apis-1.3.03.jar
[INFO] Downloaded: https://repo.maven.apache.org/maven2/org/apache/maven/maven-model/3.0.3/maven-model-3.0.3.jar
(160 KB at 4836.6 KB/sec)
[INFO] Downloaded: https://repo.maven.apache.org/maven2/commons-io/commons-io/2.1/commons-io-2.1.jar
(160 KB at 4686.1 KB/sec)
[INFO] Downloaded: https://repo.maven.apache.org/maven2/org/sonatype/sisu/sisu-inject-plexus/2.1.1/sisu-inject-plexus-2.1.1.jar
(192 KB at 5459.4 KB/sec)
[INFO] Downloaded: https://repo.maven.apache.org/maven2/xml-apis/xml-apis/1.3.03/xml-apis-1.3.03.jar
(191 KB at 3464.5 KB/sec)
[INFO] Downloaded: https://repo.maven.apache.org/maven2/xerces/xercesImpl/2.8.0/xercesImpl-2.8.0.jar
(1179 KB at 13868.0 KB/sec)
[INFO] Replacement run on 1 file.
[INFO] 
[INFO] --- maven-antrun-plugin:1.7:run (Compress resources) @ brooklyn-jsgui ---
[INFO] Downloading: https://repo.maven.apache.org/maven2/org/apache/maven/maven-plugin-api/2.0.11/maven-plugin-api-2.0.11.jar
[INFO] Downloading: https://repo.maven.apache.org/maven2/org/apache/maven/maven-project/2.0.11/maven-project-2.0.11.jar
[INFO] Downloading: https://repo.maven.apache.org/maven2/org/apache/maven/maven-settings/2.0.11/maven-settings-2.0.11.jar
[INFO] Downloading: https://repo.maven.apache.org/maven2/org/apache/maven/maven-model/2.0.11/maven-model-2.0.11.jar
[INFO] Downloading: https://repo.maven.apache.org/maven2/org/apache/maven/maven-profile/2.0.11/maven-profile-2.0.11.jar
[INFO] Downloaded: https://repo.maven.apache.org/maven2/org/apache/maven/maven-plugin-api/2.0.11/maven-plugin-api-2.0.11.jar
(13 KB at 580.5 KB/sec)
[INFO] Downloading: https://repo.maven.apache.org/maven2/org/apache/maven/maven-artifact-manager/2.0.11/maven-artifact-manager-2.0.11.jar
[INFO] Downloaded: https://repo.maven.apache.org/maven2/org/apache/maven/maven-settings/2.0.11/maven-settings-2.0.11.jar
(51 KB at 2091.2 KB/sec)
[INFO] Downloading: https://repo.maven.apache.org/maven2/org/apache/maven/maven-repository-metadata/2.0.11/maven-repository-metadata-2.0.11.jar
[INFO] Downloaded: https://repo.maven.apache.org/maven2/org/apache/maven/maven-profile/2.0.11/maven-profile-2.0.11.jar
(37 KB at 1452.0 KB/sec)
[INFO] Downloading: https://repo.maven.apache.org/maven2/org/apache/maven/maven-plugin-registry/2.0.11/maven-plugin-registry-2.0.11.jar
[INFO] Downloaded: https://repo.maven.apache.org/maven2/org/apache/maven/maven-project/2.0.11/maven-project-2.0.11.jar
(121 KB at 4637.4 KB/sec)
[INFO] Downloading: https://repo.maven.apache.org/maven2/org/apache/maven/maven-artifact/2.0.11/maven-artifact-2.0.11.jar
[INFO] Downloaded: https://repo.maven.apache.org/maven2/org/apache/maven/maven-model/2.0.11/maven-model-2.0.11.jar
(95 KB at 3632.7 KB/sec)
[INFO] Downloaded: https://repo.maven.apache.org/maven2/org/apache/maven/maven-artifact-manager/2.0.11/maven-artifact-manager-2.0.11.jar
(58 KB at 1393.3 KB/sec)
[INFO] Downloaded: https://repo.maven.apache.org/maven2/org/apache/maven/maven-repository-metadata/2.0.11/maven-repository-metadata-2.0.11.jar
(26 KB at 596.4 KB/sec)
[INFO] Downloaded: https://repo.maven.apache.org/maven2/org/apache/maven/maven-plugin-registry/2.0.11/maven-plugin-registry-2.0.11.jar
(30 KB at 680.1 KB/sec)
[INFO] Downloaded: https://repo.maven.apache.org/maven2/org/apache/maven/maven-artifact/2.0.11/maven-artifact-2.0.11.jar
(88 KB at 1821.6 KB/sec)
[INFO] Executing tasks

main:
     [gzip] Building: <https://builds.apache.org/job/brooklyn-ui-master/ws/target/brooklyn-jsgui-0.10.0-SNAPSHOT/assets/css/styles.min.css.gz>
     [gzip] Building: <https://builds.apache.org/job/brooklyn-ui-master/ws/target/brooklyn-jsgui-0.10.0-SNAPSHOT/assets/css/brooklyn.css.gz>
     [gzip] Building: <https://builds.apache.org/job/brooklyn-ui-master/ws/target/brooklyn-jsgui-0.10.0-SNAPSHOT/assets/js/gui.all.min.js.gz>
     [gzip] Building: <https://builds.apache.org/job/brooklyn-ui-master/ws/target/brooklyn-jsgui-0.10.0-SNAPSHOT/assets/js/libs/require.js.gz>
[INFO] Executed tasks
[INFO] 
[INFO] --- maven-war-plugin:2.4:war (default-war) @ brooklyn-jsgui ---
[INFO] Packaging webapp
[INFO] Assembling webapp [brooklyn-jsgui] in [<https://builds.apache.org/job/brooklyn-ui-master/ws/target/brooklyn-jsgui-0.10.0-SNAPSHOT]>
[INFO] Processing war project
[INFO] Copying webapp webResources [<https://builds.apache.org/job/brooklyn-ui-master/ws/src/main/license/files]>
to [<https://builds.apache.org/job/brooklyn-ui-master/ws/target/brooklyn-jsgui-0.10.0-SNAPSHOT]>
[INFO] Copying webapp resources [<https://builds.apache.org/job/brooklyn-ui-master/ws/src/main/webapp]>
[INFO] Webapp assembled in [49 msecs]
[INFO] Building war: <https://builds.apache.org/job/brooklyn-ui-master/ws/target/brooklyn-jsgui-0.10.0-SNAPSHOT.war>
[INFO] 
[INFO] --- maven-site-plugin:3.4:attach-descriptor (attach-descriptor) @ brooklyn-jsgui ---
[INFO] Downloading: https://repo.maven.apache.org/maven2/org/apache/maven/maven-core/3.0/maven-core-3.0.jar
[INFO] Downloading: https://repo.maven.apache.org/maven2/org/apache/maven/maven-repository-metadata/3.0/maven-repository-metadata-3.0.jar
[INFO] Downloading: https://repo.maven.apache.org/maven2/org/apache/maven/maven-model-builder/3.0/maven-model-builder-3.0.jar
[INFO] Downloading: https://repo.maven.apache.org/maven2/org/apache/maven/maven-aether-provider/3.0/maven-aether-provider-3.0.jar
[INFO] Downloading: https://repo.maven.apache.org/maven2/org/sonatype/aether/aether-impl/1.7/aether-impl-1.7.jar
[INFO] Downloaded: https://repo.maven.apache.org/maven2/org/apache/maven/maven-aether-provider/3.0/maven-aether-provider-3.0.jar
(50 KB at 1785.3 KB/sec)
[INFO] Downloading: https://repo.maven.apache.org/maven2/org/sonatype/aether/aether-spi/1.7/aether-spi-1.7.jar
[INFO] Downloaded: https://repo.maven.apache.org/maven2/org/apache/maven/maven-repository-metadata/3.0/maven-repository-metadata-3.0.jar
(30 KB at 979.2 KB/sec)
[INFO] Downloading: https://repo.maven.apache.org/maven2/org/sonatype/aether/aether-api/1.7/aether-api-1.7.jar
[INFO] Downloaded: https://repo.maven.apache.org/maven2/org/apache/maven/maven-model-builder/3.0/maven-model-builder-3.0.jar
(145 KB at 4128.7 KB/sec)
[INFO] Downloading: https://repo.maven.apache.org/maven2/org/sonatype/sisu/sisu-inject-plexus/1.4.2/sisu-inject-plexus-1.4.2.jar
[INFO] Downloaded: https://repo.maven.apache.org/maven2/org/sonatype/aether/aether-impl/1.7/aether-impl-1.7.jar
(104 KB at 2965.3 KB/sec)
[INFO] Downloading: https://repo.maven.apache.org/maven2/org/codehaus/plexus/plexus-classworlds/2.2.3/plexus-classworlds-2.2.3.jar
[INFO] Downloaded: https://repo.maven.apache.org/maven2/org/sonatype/aether/aether-api/1.7/aether-api-1.7.jar
(73 KB at 1509.1 KB/sec)
[INFO] Downloading: https://repo.maven.apache.org/maven2/org/apache/maven/maven-model/3.0/maven-model-3.0.jar
[INFO] Downloaded: https://repo.maven.apache.org/maven2/org/sonatype/aether/aether-spi/1.7/aether-spi-1.7.jar
(14 KB at 270.0 KB/sec)
[INFO] Downloading: https://repo.maven.apache.org/maven2/org/apache/maven/maven-plugin-api/3.0/maven-plugin-api-3.0.jar
[INFO] Downloaded: https://repo.maven.apache.org/maven2/org/apache/maven/maven-core/3.0/maven-core-3.0.jar
(515 KB at 9897.8 KB/sec)
[INFO] Downloading: https://repo.maven.apache.org/maven2/org/apache/maven/maven-settings/3.0/maven-settings-3.0.jar
[INFO] Downloaded: https://repo.maven.apache.org/maven2/org/codehaus/plexus/plexus-classworlds/2.2.3/plexus-classworlds-2.2.3.jar
(46 KB at 652.4 KB/sec)
[INFO] Downloading: https://repo.maven.apache.org/maven2/org/apache/maven/maven-settings-builder/3.0/maven-settings-builder-3.0.jar
[INFO] Downloaded: https://repo.maven.apache.org/maven2/org/sonatype/sisu/sisu-inject-plexus/1.4.2/sisu-inject-plexus-1.4.2.jar
(197 KB at 2854.9 KB/sec)
[INFO] Downloaded: https://repo.maven.apache.org/maven2/org/apache/maven/maven-plugin-api/3.0/maven-plugin-api-3.0.jar
(48 KB at 645.6 KB/sec)
[INFO] Downloaded: https://repo.maven.apache.org/maven2/org/apache/maven/maven-settings/3.0/maven-settings-3.0.jar
(46 KB at 591.9 KB/sec)
[INFO] Downloaded: https://repo.maven.apache.org/maven2/org/apache/maven/maven-model/3.0/maven-model-3.0.jar
(161 KB at 2061.9 KB/sec)
[INFO] Downloaded: https://repo.maven.apache.org/maven2/org/apache/maven/maven-settings-builder/3.0/maven-settings-builder-3.0.jar
(37 KB at 409.9 KB/sec)
[INFO] 
[INFO] --- maven-jar-plugin:2.5:test-jar (default) @ brooklyn-jsgui ---
[INFO] Building jar: <https://builds.apache.org/job/brooklyn-ui-master/ws/target/brooklyn-jsgui-0.10.0-SNAPSHOT-tests.jar>
[INFO] 
[INFO] --- maven-install-plugin:2.5.2:install (default-install) @ brooklyn-jsgui ---
[INFO] Installing <https://builds.apache.org/job/brooklyn-ui-master/ws/target/brooklyn-jsgui-0.10.0-SNAPSHOT.war>
to /home/jenkins/jenkins-slave/maven-repositories/0/org/apache/brooklyn/brooklyn-jsgui/0.10.0-SNAPSHOT/brooklyn-jsgui-0.10.0-SNAPSHOT.war
[INFO] Installing <https://builds.apache.org/job/brooklyn-ui-master/ws/pom.xml> to /home/jenkins/jenkins-slave/maven-repositories/0/org/apache/brooklyn/brooklyn-jsgui/0.10.0-SNAPSHOT/brooklyn-jsgui-0.10.0-SNAPSHOT.pom
[INFO] Installing <https://builds.apache.org/job/brooklyn-ui-master/ws/target/brooklyn-jsgui-0.10.0-SNAPSHOT-tests.jar>
to /home/jenkins/jenkins-slave/maven-repositories/0/org/apache/brooklyn/brooklyn-jsgui/0.10.0-SNAPSHOT/brooklyn-jsgui-0.10.0-SNAPSHOT-tests.jar
[INFO] ------------------------------------------------------------------------
[INFO] BUILD SUCCESS
[INFO] ------------------------------------------------------------------------
[INFO] Total time: 01:27 min
[INFO] Finished at: 2016-04-06T15:14:47+00:00
[INFO] Final Memory: 35M/492M
[INFO] ------------------------------------------------------------------------
[JENKINS] Archiving <https://builds.apache.org/job/brooklyn-ui-master/ws/pom.xml> to
org.apache.brooklyn/brooklyn-jsgui/0.10.0-SNAPSHOT/brooklyn-jsgui-0.10.0-SNAPSHOT.pom
[JENKINS] Archiving <https://builds.apache.org/job/brooklyn-ui-master/ws/target/brooklyn-jsgui-0.10.0-SNAPSHOT.war>
to org.apache.brooklyn/brooklyn-jsgui/0.10.0-SNAPSHOT/brooklyn-jsgui-0.10.0-SNAPSHOT.war
[JENKINS] Archiving <https://builds.apache.org/job/brooklyn-ui-master/ws/target/brooklyn-jsgui-0.10.0-SNAPSHOT-tests.jar>
to org.apache.brooklyn/brooklyn-jsgui/0.10.0-SNAPSHOT/brooklyn-jsgui-0.10.0-SNAPSHOT-tests.jar
Compressed 2.83 MB of artifacts by 35.3% relative to #8
channel stopped
Maven RedeployPublisher use remote jenkins-test-f3e maven settings from : /home/jenkins/jenkins-slave/tools/hudson.tasks.Maven_MavenInstallation/maven-3.3.3/conf/settings.xml
[INFO] Deployment in https://repository.apache.org/content/repositories/snapshots (id=apache.snapshots.https,uniqueVersion=true)
Deploying the main artifact brooklyn-jsgui-0.10.0-SNAPSHOT.war
Downloading: https://repository.apache.org/content/repositories/snapshots/org/apache/brooklyn/brooklyn-jsgui/0.10.0-SNAPSHOT/maven-metadata.xml
Downloaded: https://repository.apache.org/content/repositories/snapshots/org/apache/brooklyn/brooklyn-jsgui/0.10.0-SNAPSHOT/maven-metadata.xml
(999 B at 1.7 KB/sec)
Uploading: https://repository.apache.org/content/repositories/snapshots/org/apache/brooklyn/brooklyn-jsgui/0.10.0-SNAPSHOT/brooklyn-jsgui-0.10.0-20160406.151446-4.war
Uploading: https://repository.apache.org/content/repositories/snapshots/org/apache/brooklyn/brooklyn-jsgui/0.10.0-SNAPSHOT/brooklyn-jsgui-0.10.0-20160406.151446-4.pom
ERROR: Failed to deploy artifacts: Could not transfer artifact org.apache.brooklyn:brooklyn-jsgui:war:0.10.0-20160406.151446-4
from/to apache.snapshots.https (https://repository.apache.org/content/repositories/snapshots):
Failed to transfer file: https://repository.apache.org/content/repositories/snapshots/org/apache/brooklyn/brooklyn-jsgui/0.10.0-SNAPSHOT/brooklyn-jsgui-0.10.0-20160406.151446-4.war.
Return code is: 401, ReasonPhrase: Unauthorized.
org.apache.maven.artifact.deployer.ArtifactDeploymentException: Failed to deploy artifacts:
Could not transfer artifact org.apache.brooklyn:brooklyn-jsgui:war:0.10.0-20160406.151446-4
from/to apache.snapshots.https (https://repository.apache.org/content/repositories/snapshots):
Failed to transfer file: https://repository.apache.org/content/repositories/snapshots/org/apache/brooklyn/brooklyn-jsgui/0.10.0-SNAPSHOT/brooklyn-jsgui-0.10.0-20160406.151446-4.war.
Return code is: 401, ReasonPhrase: Unauthorized.
	at org.apache.maven.artifact.deployer.DefaultArtifactDeployer.deploy(DefaultArtifactDeployer.java:143)
	at hudson.maven.reporters.MavenArtifactRecord.deploy(MavenArtifactRecord.java:193)
	at hudson.maven.RedeployPublisher.perform(RedeployPublisher.java:176)
	at hudson.tasks.BuildStepMonitor$1.perform(BuildStepMonitor.java:20)
	at hudson.model.AbstractBuild$AbstractBuildExecution.perform(AbstractBuild.java:782)
	at hudson.model.AbstractBuild$AbstractBuildExecution.performAllBuildSteps(AbstractBuild.java:723)
	at hudson.maven.MavenModuleSetBuild$MavenModuleSetBuildExecution.post2(MavenModuleSetBuild.java:1047)
	at hudson.model.AbstractBuild$AbstractBuildExecution.post(AbstractBuild.java:668)
	at hudson.model.Run.execute(Run.java:1763)
	at hudson.maven.MavenModuleSetBuild.run(MavenModuleSetBuild.java:531)
	at hudson.model.ResourceController.execute(ResourceController.java:98)
	at hudson.model.Executor.run(Executor.java:410)
Caused by: org.eclipse.aether.deployment.DeploymentException: Failed to deploy artifacts:
Could not transfer artifact org.apache.brooklyn:brooklyn-jsgui:war:0.10.0-20160406.151446-4
from/to apache.snapshots.https (https://repository.apache.org/content/repositories/snapshots):
Failed to transfer file: https://repository.apache.org/content/repositories/snapshots/org/apache/brooklyn/brooklyn-jsgui/0.10.0-SNAPSHOT/brooklyn-jsgui-0.10.0-20160406.151446-4.war.
Return code is: 401, ReasonPhrase: Unauthorized.
	at org.eclipse.aether.internal.impl.DefaultDeployer.deploy(DefaultDeployer.java:341)
	at org.eclipse.aether.internal.impl.DefaultDeployer.deploy(DefaultDeployer.java:269)
	at org.eclipse.aether.internal.impl.DefaultRepositorySystem.deploy(DefaultRepositorySystem.java:413)
	at org.apache.maven.artifact.deployer.DefaultArtifactDeployer.deploy(DefaultArtifactDeployer.java:139)
	... 11 more
Caused by: org.eclipse.aether.transfer.ArtifactTransferException: Could not transfer artifact
org.apache.brooklyn:brooklyn-jsgui:war:0.10.0-20160406.151446-4 from/to apache.snapshots.https
(https://repository.apache.org/content/repositories/snapshots): Failed to transfer file: https://repository.apache.org/content/repositories/snapshots/org/apache/brooklyn/brooklyn-jsgui/0.10.0-SNAPSHOT/brooklyn-jsgui-0.10.0-20160406.151446-4.war.
Return code is: 401, ReasonPhrase: Unauthorized.
	at org.eclipse.aether.connector.wagon.WagonRepositoryConnector$6.wrap(WagonRepositoryConnector.java:1016)
	at org.eclipse.aether.connector.wagon.WagonRepositoryConnector$6.wrap(WagonRepositoryConnector.java:1004)
	at org.eclipse.aether.connector.wagon.WagonRepositoryConnector$PutTask.run(WagonRepositoryConnector.java:895)
	at org.eclipse.aether.connector.wagon.WagonRepositoryConnector.put(WagonRepositoryConnector.java:522)
	at org.eclipse.aether.internal.impl.DefaultDeployer.deploy(DefaultDeployer.java:335)
	... 14 more
Caused by: org.apache.maven.wagon.TransferFailedException: Failed to transfer file: https://repository.apache.org/content/repositories/snapshots/org/apache/brooklyn/brooklyn-jsgui/0.10.0-SNAPSHOT/brooklyn-jsgui-0.10.0-20160406.151446-4.war.
Return code is: 401, ReasonPhrase: Unauthorized.
	at org.apache.maven.wagon.shared.http4.AbstractHttpClientWagon.put(AbstractHttpClientWagon.java:626)
	at org.apache.maven.wagon.shared.http4.AbstractHttpClientWagon.put(AbstractHttpClientWagon.java:524)
	at org.apache.maven.wagon.shared.http4.AbstractHttpClientWagon.put(AbstractHttpClientWagon.java:505)
	at org.apache.maven.wagon.shared.http4.AbstractHttpClientWagon.put(AbstractHttpClientWagon.java:485)
	at org.eclipse.aether.connector.wagon.WagonRepositoryConnector$PutTask.run(WagonRepositoryConnector.java:871)
	... 16 more
[INFO] Deployment failed after 3.1 sec
Build step 'Deploy artifacts to Maven repository' changed build result to FAILURE

Mime
View raw message