brooklyn-dev mailing list archives

Site index · List index
Message view « Date » · « Thread »
Top « Date » · « Thread »
From Apache Jenkins Server <jenk...@builds.apache.org>
Subject Build failed in Jenkins: brooklyn-server-master #38
Date Mon, 04 Apr 2016 10:37:37 GMT
See <https://builds.apache.org/job/brooklyn-server-master/38/changes>

Changes:

[svetoslav.neykov] Fix build on Windows

------------------------------------------
[...truncated 22828 lines...]
2016-04-04 10:36:54,552 INFO  Rebind complete (MASTER) in 99ms: 1 app, 1 entity, 0 locations,
0 policies, 1 enricher, 0 feeds, 0 catalog items
2016-04-04 10:36:54,559 INFO  TESTNG PASSED: "Surefire test" - org.apache.brooklyn.policy.enricher.RebindEnricherTest.testRollingMeanEnricher()
finished in 151 ms
2016-04-04 10:36:54,559 INFO  TESTNG INVOKING CONFIGURATION: "Surefire test" - @AfterMethod
org.apache.brooklyn.policy.enricher.RebindEnricherTest.tearDown()
2016-04-04 10:36:54,623 INFO  TESTNG PASSED CONFIGURATION: "Surefire test" - @AfterMethod
org.apache.brooklyn.policy.enricher.RebindEnricherTest.tearDown() finished in 64 ms
2016-04-04 10:36:54,623 INFO  TESTNG INVOKING CONFIGURATION: "Surefire test" - @BeforeMethod
org.apache.brooklyn.core.mgmt.rebind.RebindTestFixture.setUp()
2016-04-04 10:36:54,665 INFO  Test class org.apache.brooklyn.policy.enricher.RebindEnricherTest
persisting to /tmp/RebindEnricherTest-ZteH
2016-04-04 10:36:54,665 INFO  TESTNG PASSED CONFIGURATION: "Surefire test" - @BeforeMethod
org.apache.brooklyn.core.mgmt.rebind.RebindTestFixture.setUp() finished in 42 ms
2016-04-04 10:36:54,665 INFO  TESTNG INVOKING: "Surefire test" - org.apache.brooklyn.policy.enricher.RebindEnricherTest.testRollingTimeWindowMeanEnricher()
2016-04-04 10:36:54,710 INFO  Rebinding app, using mementoDir /tmp/RebindEnricherTest-ZteH;
object store null
2016-04-04 10:36:54,779 INFO  Rebinding from /tmp/RebindEnricherTest-ZteH for master rylmjvVP...
2016-04-04 10:36:54,845 INFO  Rebind complete (MASTER) in 131ms: 1 app, 1 entity, 0 locations,
0 policies, 1 enricher, 0 feeds, 0 catalog items
2016-04-04 10:36:54,869 INFO  TESTNG PASSED: "Surefire test" - org.apache.brooklyn.policy.enricher.RebindEnricherTest.testRollingTimeWindowMeanEnricher()
finished in 204 ms
2016-04-04 10:36:54,870 INFO  TESTNG INVOKING CONFIGURATION: "Surefire test" - @AfterMethod
org.apache.brooklyn.policy.enricher.RebindEnricherTest.tearDown()
2016-04-04 10:36:54,893 INFO  TESTNG PASSED CONFIGURATION: "Surefire test" - @AfterMethod
org.apache.brooklyn.policy.enricher.RebindEnricherTest.tearDown() finished in 22 ms
2016-04-04 10:36:54,893 INFO  TESTNG INVOKING CONFIGURATION: "Surefire test" - @BeforeMethod
org.apache.brooklyn.core.mgmt.rebind.RebindTestFixture.setUp()
2016-04-04 10:36:54,952 INFO  Test class org.apache.brooklyn.policy.enricher.RebindEnricherTest
persisting to /tmp/RebindEnricherTest-L7wl
2016-04-04 10:36:54,952 INFO  TESTNG PASSED CONFIGURATION: "Surefire test" - @BeforeMethod
org.apache.brooklyn.core.mgmt.rebind.RebindTestFixture.setUp() finished in 59 ms
2016-04-04 10:36:54,952 INFO  TESTNG INVOKING: "Surefire test" - org.apache.brooklyn.policy.enricher.RebindEnricherTest.testTimeFractionDeltaEnricher()
2016-04-04 10:36:54,968 INFO  Rebinding app, using mementoDir /tmp/RebindEnricherTest-L7wl;
object store null
2016-04-04 10:36:55,025 INFO  Rebinding from /tmp/RebindEnricherTest-L7wl for master GLNgB7cO...
2016-04-04 10:36:55,102 INFO  Rebind complete (MASTER) in 132ms: 1 app, 1 entity, 0 locations,
0 policies, 1 enricher, 0 feeds, 0 catalog items
2016-04-04 10:36:55,108 INFO  TESTNG PASSED: "Surefire test" - org.apache.brooklyn.policy.enricher.RebindEnricherTest.testTimeFractionDeltaEnricher()
finished in 156 ms
2016-04-04 10:36:55,109 INFO  TESTNG INVOKING CONFIGURATION: "Surefire test" - @AfterMethod
org.apache.brooklyn.policy.enricher.RebindEnricherTest.tearDown()
2016-04-04 10:36:55,176 INFO  TESTNG PASSED CONFIGURATION: "Surefire test" - @AfterMethod
org.apache.brooklyn.policy.enricher.RebindEnricherTest.tearDown() finished in 68 ms
2016-04-04 10:36:55,177 INFO  TESTNG INVOKING CONFIGURATION: "Surefire test" - @BeforeMethod
org.apache.brooklyn.core.mgmt.rebind.RebindTestFixture.setUp()
2016-04-04 10:36:55,222 INFO  Test class org.apache.brooklyn.policy.enricher.RebindEnricherTest
persisting to /tmp/RebindEnricherTest-hr18
2016-04-04 10:36:55,223 INFO  TESTNG PASSED CONFIGURATION: "Surefire test" - @BeforeMethod
org.apache.brooklyn.core.mgmt.rebind.RebindTestFixture.setUp() finished in 47 ms
2016-04-04 10:36:55,223 INFO  TESTNG INVOKING: "Surefire test" - org.apache.brooklyn.policy.enricher.RebindEnricherTest.testTimeWeightedDeltaEnricher()
2016-04-04 10:36:55,260 INFO  Rebinding app, using mementoDir /tmp/RebindEnricherTest-hr18;
object store null
2016-04-04 10:36:55,321 INFO  Rebinding from /tmp/RebindEnricherTest-hr18 for master tGfe9b7u...
2016-04-04 10:36:55,386 INFO  Rebind complete (MASTER) in 124ms: 1 app, 1 entity, 0 locations,
0 policies, 1 enricher, 0 feeds, 0 catalog items
2016-04-04 10:36:55,409 INFO  TESTNG PASSED: "Surefire test" - org.apache.brooklyn.policy.enricher.RebindEnricherTest.testTimeWeightedDeltaEnricher()
finished in 186 ms
2016-04-04 10:36:55,410 INFO  TESTNG INVOKING CONFIGURATION: "Surefire test" - @AfterMethod
org.apache.brooklyn.policy.enricher.RebindEnricherTest.tearDown()
2016-04-04 10:36:55,451 INFO  TESTNG PASSED CONFIGURATION: "Surefire test" - @AfterMethod
org.apache.brooklyn.policy.enricher.RebindEnricherTest.tearDown() finished in 41 ms
2016-04-04 10:36:55,605 INFO  TESTNG 
===============================================
    Surefire test
    Tests run: 229, Failures: 1, Skips: 0
===============================================
2016-04-04 10:36:55,608 INFO  BrooklynLeakListener.onFinish attempting to terminate all extant
ManagementContexts: name=Surefire test; includedGroups=[]; excludedGroups=[Integration, Live-sanity,
Acceptance, Live, Broken, WIP]; suiteName=Surefire suite; outDir=<https://builds.apache.org/job/brooklyn-server-master/ws/policy/target/surefire-reports/Surefire>
suite: no org.apache.brooklyn.core.management.internal.LocalManagementContext available, so
skipped
Tests run: 229, Failures: 1, Errors: 0, Skipped: 0, Time elapsed: 178.671 sec <<<
FAILURE! - in TestSuite
testLoadBalancingManyItemsQuickTest(org.apache.brooklyn.policy.loadbalancing.LoadBalancingPolicySoakTest)
 Time elapsed: 43.603 sec  <<< FAILURE!
org.apache.brooklyn.util.exceptions.PropagatedRuntimeException: failed succeeds-eventually,
89 attempts, 40005ms elapsed: AssertionError: extras=[]; missing=[MockItem[item-24]]; duplicates=[];
actualSize=29; expectedSize=30; actual=[MockItem[item-22], MockItem[item-10], MockItem[item-5],
MockItem[item-7], MockItem[item-14], MockItem[item-8], MockItem[item-27], MockItem[item-18.1.1],
MockItem[item-6], MockItem[item-26], MockItem[item-19], MockItem[item-15], MockItem[item-9],
MockItem[item-28], MockItem[item-17], MockItem[item-13], MockItem[item-23], MockItem[item-3],
MockItem[item-12], MockItem[item-25], MockItem[item-29], MockItem[item-21], MockItem[item-4],
MockItem[item-1], MockItem[item-16], MockItem[item-2], MockItem[item-30], MockItem[item-11],
MockItem[item-20]]; expected=[MockItem[item-1], MockItem[item-2], MockItem[item-3], MockItem[item-4],
MockItem[item-5], MockItem[item-6], MockItem[item-7], MockItem[item-8], MockItem[item-9],
MockItem[item-10], MockItem[item-11], MockItem[item-12], MockItem[item-13], MockItem[item-14],
MockItem[item-15], MockItem[item-16], MockItem[item-17], MockItem[item-18.1.1], MockItem[item-19],
MockItem[item-20], MockItem[item-21], MockItem[item-22], MockItem[item-23], MockItem[item-24],
MockItem[item-25], MockItem[item-26], MockItem[item-27], MockItem[item-28], MockItem[item-29],
MockItem[item-30]]; containers=[MockContainer[container-1], MockContainer[container-2], MockContainer[container-3],
MockContainer[container-4], MockContainer[container-5.1.1]]; containerRates=[322.0, 243.0,
286.0, 288.0, 286.0]; itemDistributionByContainer={MockContainer[container-1]=[MockItem[item-5],
MockItem[item-7], MockItem[item-8], MockItem[item-10], MockItem[item-14], MockItem[item-22],
MockItem[item-24]], MockContainer[container-2]=[MockItem[item-29], MockItem[item-4], MockItem[item-25],
MockItem[item-21], MockItem[item-12]], MockContainer[container-3]=[MockItem[item-28], MockItem[item-13],
MockItem[item-9], MockItem[item-17], MockItem[item-23], MockItem[item-3]], MockContainer[container-4]=[MockItem[item-11],
MockItem[item-16], MockItem[item-20], MockItem[item-30], MockItem[item-1], MockItem[item-2]],
MockContainer[container-5.1.1]=[MockItem[item-6], MockItem[item-15], MockItem[item-26], MockItem[item-27],
MockItem[item-19], MockItem[item-18.1.1]]}; itemDistributionByItem={MockItem[item-1]=MockContainer[container-4],
MockItem[item-2]=MockContainer[container-4], MockItem[item-3]=MockContainer[container-3],
MockItem[item-4]=MockContainer[container-2], MockItem[item-5]=MockContainer[container-1],
MockItem[item-6]=MockContainer[container-5.1.1], MockItem[item-7]=MockContainer[container-1],
MockItem[item-8]=MockContainer[container-1], MockItem[item-9]=MockContainer[container-3],
MockItem[item-10]=MockContainer[container-1], MockItem[item-11]=MockContainer[container-4],
MockItem[item-12]=MockContainer[container-2], MockItem[item-13]=MockContainer[container-3],
MockItem[item-14]=MockContainer[container-1], MockItem[item-15]=MockContainer[container-5.1.1],
MockItem[item-16]=MockContainer[container-4], MockItem[item-17]=MockContainer[container-3],
MockItem[item-18.1.1]=MockContainer[container-5.1.1], MockItem[item-19]=MockContainer[container-5.1.1],
MockItem[item-20]=MockContainer[container-4], MockItem[item-21]=MockContainer[container-2],
MockItem[item-22]=MockContainer[container-1], MockItem[item-23]=MockContainer[container-3],
MockItem[item-24]=MockContainer[container-1], MockItem[item-25]=MockContainer[container-2],
MockItem[item-26]=MockContainer[container-5.1.1], MockItem[item-27]=MockContainer[container-5.1.1],
MockItem[item-28]=MockContainer[container-3], MockItem[item-29]=MockContainer[container-2],
MockItem[item-30]=MockContainer[container-4]}; model=Container 'MockContainer[container-1]':

	Item 'MockItem[item-22]' (45.0)
	Item 'MockItem[item-10]' (44.0)
	Item 'MockItem[item-5]' (45.0)
	Item 'MockItem[item-7]' (45.0)
	Item 'MockItem[item-14]' (46.0)
	Item 'MockItem[item-8]' (46.0)
Container 'MockContainer[container-5.1.1]': 
	Item 'MockItem[item-27]' (47.0)
	Item 'MockItem[item-18.1.1]' (46.0)
	Item 'MockItem[item-6]' (49.0)
	Item 'MockItem[item-26]' (48.0)
	Item 'MockItem[item-19]' (47.0)
	Item 'MockItem[item-15]' (49.0)
Container 'MockContainer[container-3]': 
	Item 'MockItem[item-9]' (49.0)
	Item 'MockItem[item-28]' (52.0)
	Item 'MockItem[item-17]' (47.0)
	Item 'MockItem[item-13]' (49.0)
	Item 'MockItem[item-23]' (46.0)
	Item 'MockItem[item-3]' (43.0)
Container 'MockContainer[container-2]': 
	Item 'MockItem[item-12]' (46.0)
	Item 'MockItem[item-25]' (49.0)
	Item 'MockItem[item-29]' (52.0)
	Item 'MockItem[item-21]' (47.0)
	Item 'MockItem[item-4]' (49.0)
Container 'MockContainer[container-4]': 
	Item 'MockItem[item-1]' (46.0)
	Item 'MockItem[item-16]' (50.0)
	Item 'MockItem[item-2]' (46.0)
	Item 'MockItem[item-30]' (47.0)
	Item 'MockItem[item-11]' (50.0)
	Item 'MockItem[item-20]' (49.0)
; totalMoves=57; lastMoveTime=2016-04-04 10:34:41.407; itemRates=[46, 46, 43, 49, 45, 49,
45, 46, 49, 44, 50, 46, 49, 46, 49, 50, 47, 46, 47, 49, 47, 45, 46, 51, 49, 48, 47, 52, 52,
47]
	at org.apache.brooklyn.test.Asserts.fail(Asserts.java:721)
	at org.apache.brooklyn.test.Asserts.assertTrue(Asserts.java:703)
	at org.apache.brooklyn.test.Asserts.assertEqualsIgnoringOrder(Asserts.java:742)
	at org.apache.brooklyn.policy.loadbalancing.LoadBalancingPolicySoakTest$1.run(LoadBalancingPolicySoakTest.java:203)
	at org.apache.brooklyn.test.Asserts$RunnableAdapter.call(Asserts.java:1277)
	at org.apache.brooklyn.test.Asserts.succeedsEventually(Asserts.java:930)
	at org.apache.brooklyn.test.Asserts.succeedsEventually(Asserts.java:854)
	at org.apache.brooklyn.policy.loadbalancing.LoadBalancingPolicySoakTest.runLoadBalancingSoakTest(LoadBalancingPolicySoakTest.java:178)
	at org.apache.brooklyn.policy.loadbalancing.LoadBalancingPolicySoakTest.testLoadBalancingManyItemsQuickTest(LoadBalancingPolicySoakTest.java:72)


Results :

Failed tests: 
  LoadBalancingPolicySoakTest.testLoadBalancingManyItemsQuickTest:72->runLoadBalancingSoakTest:178
ยป PropagatedRuntime

Tests run: 229, Failures: 1, Errors: 0, Skipped: 0

[JENKINS] Recording test results
[INFO] ------------------------------------------------------------------------
[INFO] Reactor Summary:
[INFO] 
[INFO] Brooklyn Server Root ............................... SUCCESS [  4.701 s]
[INFO] Brooklyn Parent Project ............................ SUCCESS [  8.715 s]
[INFO] Brooklyn Test Support Utilities .................... SUCCESS [ 11.048 s]
[INFO] Brooklyn Logback Includable Configuration .......... SUCCESS [  3.205 s]
[INFO] Brooklyn Common Utilities .......................... SUCCESS [ 42.415 s]
[INFO] Brooklyn API ....................................... SUCCESS [  5.866 s]
[INFO] CAMP Server Parent Project ......................... SUCCESS [  1.822 s]
[INFO] CAMP Base .......................................... SUCCESS [  6.680 s]
[INFO] Brooklyn Test Support .............................. SUCCESS [  3.979 s]
[INFO] Brooklyn REST Swagger Apidoc Utilities ............. SUCCESS [  5.280 s]
[INFO] Brooklyn Logback Configuration ..................... SUCCESS [  2.042 s]
[INFO] CAMP Server ........................................ SUCCESS [ 11.438 s]
[INFO] CAMP Server Jersey ................................. SUCCESS [ 12.564 s]
[INFO] Brooklyn Felix Runtime ............................. SUCCESS [  7.168 s]
[INFO] Brooklyn Groovy Utilities .......................... SUCCESS [  3.047 s]
[INFO] Brooklyn Core ...................................... SUCCESS [05:42 min]
[INFO] Brooklyn Policies .................................. FAILURE [03:08 min]
[INFO] Brooklyn WinRM Software Entities ................... SKIPPED
[INFO] Brooklyn Secure JMXMP Agent ........................ SKIPPED
[INFO] Brooklyn JMX RMI Agent ............................. SKIPPED
[INFO] Brooklyn Jclouds Location Targets .................. SKIPPED
[INFO] Brooklyn Software Base ............................. SKIPPED
[INFO] Brooklyn CAMP REST API ............................. SKIPPED
[INFO] Brooklyn Hazelcast Storage ......................... SKIPPED
[INFO] Brooklyn Launcher Common ........................... SKIPPED
[INFO] Brooklyn REST API .................................. SKIPPED
[INFO] Brooklyn REST Resources ............................ SKIPPED
[INFO] Brooklyn REST Server ............................... SKIPPED
[INFO] Brooklyn Launcher .................................. SKIPPED
[INFO] Brooklyn Command Line Interface .................... SKIPPED
[INFO] Brooklyn REST Client ............................... SKIPPED
[INFO] Brooklyn REST Server with Jersey dependencies ...... SKIPPED
[INFO] Brooklyn Test Framework ............................ SKIPPED
[INFO] Brooklyn OSGi init ................................. SKIPPED
[INFO] Brooklyn Karaf ..................................... SKIPPED
[INFO] Jetty config fragment .............................. SKIPPED
[INFO] Brooklyn Karaf Features ............................ SKIPPED
[INFO] Brooklyn Karaf Distro .............................. SKIPPED
[INFO] Brooklyn Karaf Shell Commands ...................... SKIPPED
[INFO] Brooklyn Karaf pax-exam itest ...................... SKIPPED
[INFO] ------------------------------------------------------------------------
[INFO] BUILD FAILURE
[INFO] ------------------------------------------------------------------------
[INFO] Total time: 11:33 min
[INFO] Finished at: 2016-04-04T10:37:05+00:00
[INFO] Final Memory: 119M/638M
[INFO] ------------------------------------------------------------------------
[ERROR] Failed to execute goal org.apache.maven.plugins:maven-surefire-plugin:2.18.1:test
(default-test) on project brooklyn-policy: There are test failures.
[ERROR] 
[ERROR] Please refer to <https://builds.apache.org/job/brooklyn-server-master/ws/policy/target/surefire-reports>
for the individual test results.
[ERROR] -> [Help 1]
[ERROR] 
[ERROR] To see the full stack trace of the errors, re-run Maven with the -e switch.
[ERROR] Re-run Maven using the -X switch to enable full debug logging.
[ERROR] 
[ERROR] For more information about the errors and possible solutions, please read the following
articles:
[ERROR] [Help 1] http://cwiki.apache.org/confluence/display/MAVEN/MojoFailureException
[ERROR] 
[ERROR] After correcting the problems, you can resume the build with the command
[ERROR]   mvn <goals> -rf :brooklyn-policy
[JENKINS] Archiving <https://builds.apache.org/job/brooklyn-server-master/ws/policy/pom.xml>
to org.apache.brooklyn/brooklyn-policy/0.10.0-SNAPSHOT/brooklyn-policy-0.10.0-SNAPSHOT.pom
[JENKINS] Archiving <https://builds.apache.org/job/brooklyn-server-master/ws/test-framework/pom.xml>
to org.apache.brooklyn/brooklyn-test-framework/0.10.0-SNAPSHOT/brooklyn-test-framework-0.10.0-SNAPSHOT.pom
[JENKINS] Archiving <https://builds.apache.org/job/brooklyn-server-master/ws/storage/hazelcast/pom.xml>
to org.apache.brooklyn/brooklyn-storage-hazelcast/0.10.0-SNAPSHOT/brooklyn-storage-hazelcast-0.10.0-SNAPSHOT.pom
[JENKINS] Archiving <https://builds.apache.org/job/brooklyn-server-master/ws/karaf/init/pom.xml>
to org.apache.brooklyn/brooklyn-karaf-init/0.10.0-SNAPSHOT/brooklyn-karaf-init-0.10.0-SNAPSHOT.pom
[JENKINS] Archiving <https://builds.apache.org/job/brooklyn-server-master/ws/pom.xml>
to org.apache.brooklyn/brooklyn-server/0.10.0-SNAPSHOT/brooklyn-server-0.10.0-SNAPSHOT.pom
[JENKINS] Archiving <https://builds.apache.org/job/brooklyn-server-master/ws/karaf/commands/pom.xml>
to org.apache.brooklyn/brooklyn-commands/0.10.0-SNAPSHOT/brooklyn-commands-0.10.0-SNAPSHOT.pom
[JENKINS] Archiving <https://builds.apache.org/job/brooklyn-server-master/ws/rest/rest-api/pom.xml>
to org.apache.brooklyn/brooklyn-rest-api/0.10.0-SNAPSHOT/brooklyn-rest-api-0.10.0-SNAPSHOT.pom
[JENKINS] Archiving <https://builds.apache.org/job/brooklyn-server-master/ws/core/pom.xml>
to org.apache.brooklyn/brooklyn-core/0.10.0-SNAPSHOT/brooklyn-core-0.10.0-SNAPSHOT.pom
[JENKINS] Archiving <https://builds.apache.org/job/brooklyn-server-master/ws/core/target/brooklyn-core-0.10.0-SNAPSHOT.jar>
to org.apache.brooklyn/brooklyn-core/0.10.0-SNAPSHOT/brooklyn-core-0.10.0-SNAPSHOT.jar
[JENKINS] Archiving <https://builds.apache.org/job/brooklyn-server-master/ws/core/target/brooklyn-core-0.10.0-SNAPSHOT-tests.jar>
to org.apache.brooklyn/brooklyn-core/0.10.0-SNAPSHOT/brooklyn-core-0.10.0-SNAPSHOT-tests.jar
[JENKINS] Archiving <https://builds.apache.org/job/brooklyn-server-master/ws/core/target/brooklyn-core-0.10.0-SNAPSHOT-sources.jar>
to org.apache.brooklyn/brooklyn-core/0.10.0-SNAPSHOT/brooklyn-core-0.10.0-SNAPSHOT-sources.jar
[JENKINS] Archiving <https://builds.apache.org/job/brooklyn-server-master/ws/core/target/brooklyn-core-0.10.0-SNAPSHOT-test-sources.jar>
to org.apache.brooklyn/brooklyn-core/0.10.0-SNAPSHOT/brooklyn-core-0.10.0-SNAPSHOT-test-sources.jar
Compressed 6.16 MB of artifacts by 30.9% relative to #37
[JENKINS] Archiving <https://builds.apache.org/job/brooklyn-server-master/ws/logging/logback-xml/pom.xml>
to org.apache.brooklyn/brooklyn-logback-xml/0.10.0-SNAPSHOT/brooklyn-logback-xml-0.10.0-SNAPSHOT.pom
[JENKINS] Archiving <https://builds.apache.org/job/brooklyn-server-master/ws/logging/logback-xml/target/brooklyn-logback-xml-0.10.0-SNAPSHOT.jar>
to org.apache.brooklyn/brooklyn-logback-xml/0.10.0-SNAPSHOT/brooklyn-logback-xml-0.10.0-SNAPSHOT.jar
[JENKINS] Archiving <https://builds.apache.org/job/brooklyn-server-master/ws/logging/logback-xml/target/brooklyn-logback-xml-0.10.0-SNAPSHOT-sources.jar>
to org.apache.brooklyn/brooklyn-logback-xml/0.10.0-SNAPSHOT/brooklyn-logback-xml-0.10.0-SNAPSHOT-sources.jar
[JENKINS] Archiving <https://builds.apache.org/job/brooklyn-server-master/ws/logging/logback-xml/target/brooklyn-logback-xml-0.10.0-SNAPSHOT-test-sources.jar>
to org.apache.brooklyn/brooklyn-logback-xml/0.10.0-SNAPSHOT/brooklyn-logback-xml-0.10.0-SNAPSHOT-test-sources.jar
[JENKINS] Archiving <https://builds.apache.org/job/brooklyn-server-master/ws/karaf/features/pom.xml>
to org.apache.brooklyn/brooklyn-features/0.10.0-SNAPSHOT/brooklyn-features-0.10.0-SNAPSHOT.pom
[JENKINS] Archiving <https://builds.apache.org/job/brooklyn-server-master/ws/rest/rest-resources/pom.xml>
to org.apache.brooklyn/brooklyn-rest-resources/0.10.0-SNAPSHOT/brooklyn-rest-resources-0.10.0-SNAPSHOT.pom
[JENKINS] Archiving <https://builds.apache.org/job/brooklyn-server-master/ws/camp/camp-server/pom.xml>
to org.apache.brooklyn.camp/camp-server/0.10.0-SNAPSHOT/camp-server-0.10.0-SNAPSHOT.pom
[JENKINS] Archiving <https://builds.apache.org/job/brooklyn-server-master/ws/camp/camp-server/target/camp-server-0.10.0-SNAPSHOT.jar>
to org.apache.brooklyn.camp/camp-server/0.10.0-SNAPSHOT/camp-server-0.10.0-SNAPSHOT.jar
[JENKINS] Archiving <https://builds.apache.org/job/brooklyn-server-master/ws/camp/camp-server/target/camp-server-0.10.0-SNAPSHOT-tests.jar>
to org.apache.brooklyn.camp/camp-server/0.10.0-SNAPSHOT/camp-server-0.10.0-SNAPSHOT-tests.jar
[JENKINS] Archiving <https://builds.apache.org/job/brooklyn-server-master/ws/camp/camp-server/target/camp-server-0.10.0-SNAPSHOT-sources.jar>
to org.apache.brooklyn.camp/camp-server/0.10.0-SNAPSHOT/camp-server-0.10.0-SNAPSHOT-sources.jar
[JENKINS] Archiving <https://builds.apache.org/job/brooklyn-server-master/ws/camp/camp-server/target/camp-server-0.10.0-SNAPSHOT-test-sources.jar>
to org.apache.brooklyn.camp/camp-server/0.10.0-SNAPSHOT/camp-server-0.10.0-SNAPSHOT-test-sources.jar
[JENKINS] Archiving <https://builds.apache.org/job/brooklyn-server-master/ws/launcher-common/pom.xml>
to org.apache.brooklyn/brooklyn-launcher-common/0.10.0-SNAPSHOT/brooklyn-launcher-common-0.10.0-SNAPSHOT.pom
[JENKINS] Archiving <https://builds.apache.org/job/brooklyn-server-master/ws/utils/groovy/pom.xml>
to org.apache.brooklyn/brooklyn-utils-groovy/0.10.0-SNAPSHOT/brooklyn-utils-groovy-0.10.0-SNAPSHOT.pom
[JENKINS] Archiving <https://builds.apache.org/job/brooklyn-server-master/ws/utils/groovy/target/brooklyn-utils-groovy-0.10.0-SNAPSHOT.jar>
to org.apache.brooklyn/brooklyn-utils-groovy/0.10.0-SNAPSHOT/brooklyn-utils-groovy-0.10.0-SNAPSHOT.jar
[JENKINS] Archiving <https://builds.apache.org/job/brooklyn-server-master/ws/utils/groovy/target/brooklyn-utils-groovy-0.10.0-SNAPSHOT-tests.jar>
to org.apache.brooklyn/brooklyn-utils-groovy/0.10.0-SNAPSHOT/brooklyn-utils-groovy-0.10.0-SNAPSHOT-tests.jar
[JENKINS] Archiving <https://builds.apache.org/job/brooklyn-server-master/ws/utils/groovy/target/brooklyn-utils-groovy-0.10.0-SNAPSHOT-sources.jar>
to org.apache.brooklyn/brooklyn-utils-groovy/0.10.0-SNAPSHOT/brooklyn-utils-groovy-0.10.0-SNAPSHOT-sources.jar
[JENKINS] Archiving <https://builds.apache.org/job/brooklyn-server-master/ws/utils/groovy/target/brooklyn-utils-groovy-0.10.0-SNAPSHOT-test-sources.jar>
to org.apache.brooklyn/brooklyn-utils-groovy/0.10.0-SNAPSHOT/brooklyn-utils-groovy-0.10.0-SNAPSHOT-test-sources.jar
[JENKINS] Archiving <https://builds.apache.org/job/brooklyn-server-master/ws/utils/common/pom.xml>
to org.apache.brooklyn/brooklyn-utils-common/0.10.0-SNAPSHOT/brooklyn-utils-common-0.10.0-SNAPSHOT.pom
[JENKINS] Archiving <https://builds.apache.org/job/brooklyn-server-master/ws/utils/common/target/brooklyn-utils-common-0.10.0-SNAPSHOT.jar>
to org.apache.brooklyn/brooklyn-utils-common/0.10.0-SNAPSHOT/brooklyn-utils-common-0.10.0-SNAPSHOT.jar
[JENKINS] Archiving <https://builds.apache.org/job/brooklyn-server-master/ws/utils/common/target/brooklyn-utils-common-0.10.0-SNAPSHOT-tests.jar>
to org.apache.brooklyn/brooklyn-utils-common/0.10.0-SNAPSHOT/brooklyn-utils-common-0.10.0-SNAPSHOT-tests.jar
[JENKINS] Archiving <https://builds.apache.org/job/brooklyn-server-master/ws/utils/common/target/brooklyn-utils-common-0.10.0-SNAPSHOT-sources.jar>
to org.apache.brooklyn/brooklyn-utils-common/0.10.0-SNAPSHOT/brooklyn-utils-common-0.10.0-SNAPSHOT-sources.jar
[JENKINS] Archiving <https://builds.apache.org/job/brooklyn-server-master/ws/utils/common/target/brooklyn-utils-common-0.10.0-SNAPSHOT-test-sources.jar>
to org.apache.brooklyn/brooklyn-utils-common/0.10.0-SNAPSHOT/brooklyn-utils-common-0.10.0-SNAPSHOT-test-sources.jar
Compressed 1.15 MB of artifacts by 27.1% relative to #37
[JENKINS] Archiving <https://builds.apache.org/job/brooklyn-server-master/ws/locations/jclouds/pom.xml>
to org.apache.brooklyn/brooklyn-locations-jclouds/0.10.0-SNAPSHOT/brooklyn-locations-jclouds-0.10.0-SNAPSHOT.pom
[JENKINS] Archiving <https://builds.apache.org/job/brooklyn-server-master/ws/test-support/pom.xml>
to org.apache.brooklyn/brooklyn-test-support/0.10.0-SNAPSHOT/brooklyn-test-support-0.10.0-SNAPSHOT.pom
[JENKINS] Archiving <https://builds.apache.org/job/brooklyn-server-master/ws/test-support/target/brooklyn-test-support-0.10.0-SNAPSHOT.jar>
to org.apache.brooklyn/brooklyn-test-support/0.10.0-SNAPSHOT/brooklyn-test-support-0.10.0-SNAPSHOT.jar
[JENKINS] Archiving <https://builds.apache.org/job/brooklyn-server-master/ws/test-support/target/brooklyn-test-support-0.10.0-SNAPSHOT-sources.jar>
to org.apache.brooklyn/brooklyn-test-support/0.10.0-SNAPSHOT/brooklyn-test-support-0.10.0-SNAPSHOT-sources.jar
[JENKINS] Archiving <https://builds.apache.org/job/brooklyn-server-master/ws/test-support/target/brooklyn-test-support-0.10.0-SNAPSHOT-test-sources.jar>
to org.apache.brooklyn/brooklyn-test-support/0.10.0-SNAPSHOT/brooklyn-test-support-0.10.0-SNAPSHOT-test-sources.jar
[JENKINS] Archiving <https://builds.apache.org/job/brooklyn-server-master/ws/karaf/pom.xml>
to org.apache.brooklyn/brooklyn-karaf/0.10.0-SNAPSHOT/brooklyn-karaf-0.10.0-SNAPSHOT.pom
[JENKINS] Archiving <https://builds.apache.org/job/brooklyn-server-master/ws/utils/rt-felix/pom.xml>
to org.apache.brooklyn/brooklyn-rt-felix/0.10.0-SNAPSHOT/brooklyn-rt-felix-0.10.0-SNAPSHOT.pom
[JENKINS] Archiving <https://builds.apache.org/job/brooklyn-server-master/ws/utils/rt-felix/target/brooklyn-rt-felix-0.10.0-SNAPSHOT.jar>
to org.apache.brooklyn/brooklyn-rt-felix/0.10.0-SNAPSHOT/brooklyn-rt-felix-0.10.0-SNAPSHOT.jar
[JENKINS] Archiving <https://builds.apache.org/job/brooklyn-server-master/ws/utils/rt-felix/target/brooklyn-rt-felix-0.10.0-SNAPSHOT-tests.jar>
to org.apache.brooklyn/brooklyn-rt-felix/0.10.0-SNAPSHOT/brooklyn-rt-felix-0.10.0-SNAPSHOT-tests.jar
[JENKINS] Archiving <https://builds.apache.org/job/brooklyn-server-master/ws/utils/rt-felix/target/brooklyn-rt-felix-0.10.0-SNAPSHOT-sources.jar>
to org.apache.brooklyn/brooklyn-rt-felix/0.10.0-SNAPSHOT/brooklyn-rt-felix-0.10.0-SNAPSHOT-sources.jar
[JENKINS] Archiving <https://builds.apache.org/job/brooklyn-server-master/ws/utils/rt-felix/target/brooklyn-rt-felix-0.10.0-SNAPSHOT-test-sources.jar>
to org.apache.brooklyn/brooklyn-rt-felix/0.10.0-SNAPSHOT/brooklyn-rt-felix-0.10.0-SNAPSHOT-test-sources.jar
[JENKINS] Archiving <https://builds.apache.org/job/brooklyn-server-master/ws/karaf/itest/pom.xml>
to org.apache.brooklyn/brooklyn-itest/0.10.0-SNAPSHOT/brooklyn-itest-0.10.0-SNAPSHOT.pom
[JENKINS] Archiving <https://builds.apache.org/job/brooklyn-server-master/ws/camp/camp-server-jersey/pom.xml>
to org.apache.brooklyn.camp/camp-server-jersey/0.10.0-SNAPSHOT/camp-server-jersey-0.10.0-SNAPSHOT.pom
[JENKINS] Archiving <https://builds.apache.org/job/brooklyn-server-master/ws/camp/camp-server-jersey/target/camp-server-jersey-0.10.0-SNAPSHOT.jar>
to org.apache.brooklyn.camp/camp-server-jersey/0.10.0-SNAPSHOT/camp-server-jersey-0.10.0-SNAPSHOT.jar
[JENKINS] Archiving <https://builds.apache.org/job/brooklyn-server-master/ws/camp/camp-server-jersey/target/camp-server-jersey-0.10.0-SNAPSHOT-sources.jar>
to org.apache.brooklyn.camp/camp-server-jersey/0.10.0-SNAPSHOT/camp-server-jersey-0.10.0-SNAPSHOT-sources.jar
[JENKINS] Archiving <https://builds.apache.org/job/brooklyn-server-master/ws/camp/camp-server-jersey/target/camp-server-jersey-0.10.0-SNAPSHOT-test-sources.jar>
to org.apache.brooklyn.camp/camp-server-jersey/0.10.0-SNAPSHOT/camp-server-jersey-0.10.0-SNAPSHOT-test-sources.jar
[JENKINS] Archiving <https://builds.apache.org/job/brooklyn-server-master/ws/software/winrm/pom.xml>
to org.apache.brooklyn/brooklyn-software-winrm/0.10.0-SNAPSHOT/brooklyn-software-winrm-0.10.0-SNAPSHOT.pom
[JENKINS] Archiving <https://builds.apache.org/job/brooklyn-server-master/ws/rest/rest-server/pom.xml>
to org.apache.brooklyn/brooklyn-rest-server/0.10.0-SNAPSHOT/brooklyn-rest-server-0.10.0-SNAPSHOT.pom
[JENKINS] Archiving <https://builds.apache.org/job/brooklyn-server-master/ws/camp/camp-base/pom.xml>
to org.apache.brooklyn.camp/camp-base/0.10.0-SNAPSHOT/camp-base-0.10.0-SNAPSHOT.pom
[JENKINS] Archiving <https://builds.apache.org/job/brooklyn-server-master/ws/camp/camp-base/target/camp-base-0.10.0-SNAPSHOT.jar>
to org.apache.brooklyn.camp/camp-base/0.10.0-SNAPSHOT/camp-base-0.10.0-SNAPSHOT.jar
[JENKINS] Archiving <https://builds.apache.org/job/brooklyn-server-master/ws/camp/camp-base/target/camp-base-0.10.0-SNAPSHOT-tests.jar>
to org.apache.brooklyn.camp/camp-base/0.10.0-SNAPSHOT/camp-base-0.10.0-SNAPSHOT-tests.jar
[JENKINS] Archiving <https://builds.apache.org/job/brooklyn-server-master/ws/camp/camp-base/target/camp-base-0.10.0-SNAPSHOT-sources.jar>
to org.apache.brooklyn.camp/camp-base/0.10.0-SNAPSHOT/camp-base-0.10.0-SNAPSHOT-sources.jar
[JENKINS] Archiving <https://builds.apache.org/job/brooklyn-server-master/ws/camp/camp-base/target/camp-base-0.10.0-SNAPSHOT-test-sources.jar>
to org.apache.brooklyn.camp/camp-base/0.10.0-SNAPSHOT/camp-base-0.10.0-SNAPSHOT-test-sources.jar
[JENKINS] Archiving <https://builds.apache.org/job/brooklyn-server-master/ws/rest/rest-client/pom.xml>
to org.apache.brooklyn/brooklyn-rest-client/0.10.0-SNAPSHOT/brooklyn-rest-client-0.10.0-SNAPSHOT.pom
[JENKINS] Archiving <https://builds.apache.org/job/brooklyn-server-master/ws/karaf/apache-brooklyn/pom.xml>
to org.apache.brooklyn/apache-brooklyn/0.10.0-SNAPSHOT/apache-brooklyn-0.10.0-SNAPSHOT.pom
[JENKINS] Archiving <https://builds.apache.org/job/brooklyn-server-master/ws/utils/jmx/jmxmp-ssl-agent/pom.xml>
to org.apache.brooklyn/brooklyn-jmxmp-agent/0.10.0-SNAPSHOT/brooklyn-jmxmp-agent-0.10.0-SNAPSHOT.pom
[JENKINS] Archiving <https://builds.apache.org/job/brooklyn-server-master/ws/utils/jmx/jmxrmi-agent/pom.xml>
to org.apache.brooklyn/brooklyn-jmxrmi-agent/0.10.0-SNAPSHOT/brooklyn-jmxrmi-agent-0.10.0-SNAPSHOT.pom
[JENKINS] Archiving <https://builds.apache.org/job/brooklyn-server-master/ws/camp/camp-brooklyn/pom.xml>
to org.apache.brooklyn/brooklyn-camp/0.10.0-SNAPSHOT/brooklyn-camp-0.10.0-SNAPSHOT.pom
[JENKINS] Archiving <https://builds.apache.org/job/brooklyn-server-master/ws/parent/pom.xml>
to org.apache.brooklyn/brooklyn-parent/0.10.0-SNAPSHOT/brooklyn-parent-0.10.0-SNAPSHOT.pom
Compressed 82.92 KB of artifacts by 77.2% relative to #37
[JENKINS] Archiving <https://builds.apache.org/job/brooklyn-server-master/ws/server-cli/pom.xml>
to org.apache.brooklyn/brooklyn-cli/0.10.0-SNAPSHOT/brooklyn-cli-0.10.0-SNAPSHOT.pom
[JENKINS] Archiving <https://builds.apache.org/job/brooklyn-server-master/ws/software/base/pom.xml>
to org.apache.brooklyn/brooklyn-software-base/0.10.0-SNAPSHOT/brooklyn-software-base-0.10.0-SNAPSHOT.pom
[JENKINS] Archiving <https://builds.apache.org/job/brooklyn-server-master/ws/logging/logback-includes/pom.xml>
to org.apache.brooklyn/brooklyn-logback-includes/0.10.0-SNAPSHOT/brooklyn-logback-includes-0.10.0-SNAPSHOT.pom
[JENKINS] Archiving <https://builds.apache.org/job/brooklyn-server-master/ws/logging/logback-includes/target/brooklyn-logback-includes-0.10.0-SNAPSHOT.jar>
to org.apache.brooklyn/brooklyn-logback-includes/0.10.0-SNAPSHOT/brooklyn-logback-includes-0.10.0-SNAPSHOT.jar
[JENKINS] Archiving <https://builds.apache.org/job/brooklyn-server-master/ws/logging/logback-includes/target/brooklyn-logback-includes-0.10.0-SNAPSHOT-sources.jar>
to org.apache.brooklyn/brooklyn-logback-includes/0.10.0-SNAPSHOT/brooklyn-logback-includes-0.10.0-SNAPSHOT-sources.jar
[JENKINS] Archiving <https://builds.apache.org/job/brooklyn-server-master/ws/logging/logback-includes/target/brooklyn-logback-includes-0.10.0-SNAPSHOT-test-sources.jar>
to org.apache.brooklyn/brooklyn-logback-includes/0.10.0-SNAPSHOT/brooklyn-logback-includes-0.10.0-SNAPSHOT-test-sources.jar
[JENKINS] Archiving <https://builds.apache.org/job/brooklyn-server-master/ws/launcher/pom.xml>
to org.apache.brooklyn/brooklyn-launcher/0.10.0-SNAPSHOT/brooklyn-launcher-0.10.0-SNAPSHOT.pom
[JENKINS] Archiving <https://builds.apache.org/job/brooklyn-server-master/ws/karaf/jetty-config/pom.xml>
to org.apache.brooklyn/brooklyn-karaf-jetty-config/0.10.0-SNAPSHOT/brooklyn-karaf-jetty-config-0.10.0-SNAPSHOT.pom
[JENKINS] Archiving <https://builds.apache.org/job/brooklyn-server-master/ws/utils/rest-swagger/pom.xml>
to org.apache.brooklyn/brooklyn-utils-rest-swagger/0.10.0-SNAPSHOT/brooklyn-utils-rest-swagger-0.10.0-SNAPSHOT.pom
[JENKINS] Archiving <https://builds.apache.org/job/brooklyn-server-master/ws/utils/rest-swagger/target/brooklyn-utils-rest-swagger-0.10.0-SNAPSHOT.jar>
to org.apache.brooklyn/brooklyn-utils-rest-swagger/0.10.0-SNAPSHOT/brooklyn-utils-rest-swagger-0.10.0-SNAPSHOT.jar
[JENKINS] Archiving <https://builds.apache.org/job/brooklyn-server-master/ws/utils/rest-swagger/target/brooklyn-utils-rest-swagger-0.10.0-SNAPSHOT-sources.jar>
to org.apache.brooklyn/brooklyn-utils-rest-swagger/0.10.0-SNAPSHOT/brooklyn-utils-rest-swagger-0.10.0-SNAPSHOT-sources.jar
[JENKINS] Archiving <https://builds.apache.org/job/brooklyn-server-master/ws/utils/rest-swagger/target/brooklyn-utils-rest-swagger-0.10.0-SNAPSHOT-test-sources.jar>
to org.apache.brooklyn/brooklyn-utils-rest-swagger/0.10.0-SNAPSHOT/brooklyn-utils-rest-swagger-0.10.0-SNAPSHOT-test-sources.jar
[JENKINS] Archiving <https://builds.apache.org/job/brooklyn-server-master/ws/utils/test-support/pom.xml>
to org.apache.brooklyn/brooklyn-utils-test-support/0.10.0-SNAPSHOT/brooklyn-utils-test-support-0.10.0-SNAPSHOT.pom
[JENKINS] Archiving <https://builds.apache.org/job/brooklyn-server-master/ws/utils/test-support/target/brooklyn-utils-test-support-0.10.0-SNAPSHOT.jar>
to org.apache.brooklyn/brooklyn-utils-test-support/0.10.0-SNAPSHOT/brooklyn-utils-test-support-0.10.0-SNAPSHOT.jar
[JENKINS] Archiving <https://builds.apache.org/job/brooklyn-server-master/ws/utils/test-support/target/brooklyn-utils-test-support-0.10.0-SNAPSHOT-sources.jar>
to org.apache.brooklyn/brooklyn-utils-test-support/0.10.0-SNAPSHOT/brooklyn-utils-test-support-0.10.0-SNAPSHOT-sources.jar
[JENKINS] Archiving <https://builds.apache.org/job/brooklyn-server-master/ws/utils/test-support/target/brooklyn-utils-test-support-0.10.0-SNAPSHOT-test-sources.jar>
to org.apache.brooklyn/brooklyn-utils-test-support/0.10.0-SNAPSHOT/brooklyn-utils-test-support-0.10.0-SNAPSHOT-test-sources.jar
[JENKINS] Archiving <https://builds.apache.org/job/brooklyn-server-master/ws/camp/pom.xml>
to org.apache.brooklyn.camp/camp-parent/0.10.0-SNAPSHOT/camp-parent-0.10.0-SNAPSHOT.pom
[JENKINS] Archiving <https://builds.apache.org/job/brooklyn-server-master/ws/api/pom.xml>
to org.apache.brooklyn/brooklyn-api/0.10.0-SNAPSHOT/brooklyn-api-0.10.0-SNAPSHOT.pom
[JENKINS] Archiving <https://builds.apache.org/job/brooklyn-server-master/ws/api/target/brooklyn-api-0.10.0-SNAPSHOT.jar>
to org.apache.brooklyn/brooklyn-api/0.10.0-SNAPSHOT/brooklyn-api-0.10.0-SNAPSHOT.jar
[JENKINS] Archiving <https://builds.apache.org/job/brooklyn-server-master/ws/api/target/brooklyn-api-0.10.0-SNAPSHOT-sources.jar>
to org.apache.brooklyn/brooklyn-api/0.10.0-SNAPSHOT/brooklyn-api-0.10.0-SNAPSHOT-sources.jar
[JENKINS] Archiving <https://builds.apache.org/job/brooklyn-server-master/ws/api/target/brooklyn-api-0.10.0-SNAPSHOT-test-sources.jar>
to org.apache.brooklyn/brooklyn-api/0.10.0-SNAPSHOT/brooklyn-api-0.10.0-SNAPSHOT-test-sources.jar
Compressed 287.50 KB of artifacts by 33.4% relative to #37
[JENKINS] Archiving <https://builds.apache.org/job/brooklyn-server-master/ws/rest/rest-server-jersey/pom.xml>
to org.apache.brooklyn/brooklyn-rest-server-jersey/0.10.0-SNAPSHOT/brooklyn-rest-server-jersey-0.10.0-SNAPSHOT.pom
channel stopped

Mime
View raw message