brooklyn-dev mailing list archives

Site index · List index
Message view « Date » · « Thread »
Top « Date » · « Thread »
From Apache Jenkins Server <jenk...@builds.apache.org>
Subject Build failed in Jenkins: brooklyn-server-master #65
Date Fri, 22 Apr 2016 13:14:28 GMT
See <https://builds.apache.org/job/brooklyn-server-master/65/changes>

Changes:

[sam.corbett] Test case for resources used by vanilla software processes

------------------------------------------
[...truncated 27099 lines...]
2016-04-22 13:14:06,469 WARN  Execution failed, invalid result 106 for mock (throwing)
2016-04-22 13:14:06,469 INFO  STDIN of problem in null:
ignored
2016-04-22 13:14:06,470 INFO  ScriptHelper non-zero causes return code: java.lang.IllegalStateException:
Execution failed, invalid result 106 for mock
2016-04-22 13:14:06,470 INFO  TESTNG PASSED: "Surefire test" - org.apache.brooklyn.entity.software.base.lifecycle.NaiveScriptRunnerTest.testFailOnNonZero()
finished in 2 ms
2016-04-22 13:14:06,471 INFO  TESTNG INVOKING CONFIGURATION: "Surefire test" - @BeforeMethod
org.apache.brooklyn.entity.software.base.lifecycle.NaiveScriptRunnerTest.setup()
2016-04-22 13:14:06,472 INFO  TESTNG PASSED CONFIGURATION: "Surefire test" - @BeforeMethod
org.apache.brooklyn.entity.software.base.lifecycle.NaiveScriptRunnerTest.setup() finished
in 1 ms
2016-04-22 13:14:06,472 INFO  TESTNG INVOKING: "Surefire test" - org.apache.brooklyn.entity.software.base.lifecycle.NaiveScriptRunnerTest.testFailOnNonZeroDontFailIfZero()
2016-04-22 13:14:06,473 INFO  TESTNG PASSED: "Surefire test" - org.apache.brooklyn.entity.software.base.lifecycle.NaiveScriptRunnerTest.testFailOnNonZeroDontFailIfZero()
finished in 1 ms
2016-04-22 13:14:06,474 INFO  TESTNG INVOKING CONFIGURATION: "Surefire test" - @BeforeMethod
org.apache.brooklyn.entity.software.base.lifecycle.NaiveScriptRunnerTest.setup()
2016-04-22 13:14:06,474 INFO  TESTNG PASSED CONFIGURATION: "Surefire test" - @BeforeMethod
org.apache.brooklyn.entity.software.base.lifecycle.NaiveScriptRunnerTest.setup() finished
in 1 ms
2016-04-22 13:14:06,474 INFO  TESTNG INVOKING: "Surefire test" - org.apache.brooklyn.entity.software.base.lifecycle.NaiveScriptRunnerTest.testHeadBodyFootAndResult()
2016-04-22 13:14:06,475 INFO  TESTNG PASSED: "Surefire test" - org.apache.brooklyn.entity.software.base.lifecycle.NaiveScriptRunnerTest.testHeadBodyFootAndResult()
finished in 1 ms
SUREFIRE-859: [GC 290506K->79237K(761856K), 0.0855670 secs]
2016-04-22 13:14:06,621 INFO  TESTNG 
===============================================
    Surefire test
    Tests run: 155, Failures: 1, Skips: 0
===============================================
2016-04-22 13:14:06,622 INFO  BrooklynLeakListener.onFinish attempting to terminate all extant
ManagementContexts: name=Surefire test; includedGroups=[]; excludedGroups=[Integration, Live-sanity,
Acceptance, Live, Broken, WIP]; suiteName=Surefire suite; outDir=<https://builds.apache.org/job/brooklyn-server-master/ws/software/base/target/surefire-reports/Surefire>
suite: no org.apache.brooklyn.core.management.internal.LocalManagementContext available, so
skipped
Tests run: 155, Failures: 1, Errors: 0, Skipped: 0, Time elapsed: 67.673 sec <<<
FAILURE! - in TestSuite
testPersistenceVolumeFastNoTrigger(org.apache.brooklyn.entity.software.base.SoftwareProcessPersisterInMemorySizeIntegrationTest)
 Time elapsed: 0.287 sec  <<< FAILURE!
java.lang.AssertionError: should have written less than 150k, wrote 151985 expected [true]
but found [false]
	at org.testng.Assert.fail(Assert.java:94)
	at org.testng.Assert.failNotEquals(Assert.java:494)
	at org.testng.Assert.assertTrue(Assert.java:42)
	at org.apache.brooklyn.core.mgmt.persist.BrooklynMementoPersisterInMemorySizeIntegrationTest.doTestPersistenceVolume(BrooklynMementoPersisterInMemorySizeIntegrationTest.java:95)
	at org.apache.brooklyn.core.mgmt.persist.BrooklynMementoPersisterInMemorySizeIntegrationTest.testPersistenceVolumeFastNoTrigger(BrooklynMementoPersisterInMemorySizeIntegrationTest.java:67)
	at sun.reflect.NativeMethodAccessorImpl.invoke0(Native Method)
	at sun.reflect.NativeMethodAccessorImpl.invoke(NativeMethodAccessorImpl.java:57)
	at sun.reflect.DelegatingMethodAccessorImpl.invoke(DelegatingMethodAccessorImpl.java:43)
	at java.lang.reflect.Method.invoke(Method.java:606)
	at org.testng.internal.MethodInvocationHelper.invokeMethod(MethodInvocationHelper.java:84)
	at org.testng.internal.Invoker.invokeMethod(Invoker.java:714)
	at org.testng.internal.Invoker.invokeTestMethod(Invoker.java:901)
	at org.testng.internal.Invoker.invokeTestMethods(Invoker.java:1231)
	at org.testng.internal.TestMethodWorker.invokeTestMethods(TestMethodWorker.java:127)
	at org.testng.internal.TestMethodWorker.run(TestMethodWorker.java:111)
	at org.testng.TestRunner.privateRun(TestRunner.java:767)
	at org.testng.TestRunner.run(TestRunner.java:617)
	at org.testng.SuiteRunner.runTest(SuiteRunner.java:348)
	at org.testng.SuiteRunner.runSequentially(SuiteRunner.java:343)
	at org.testng.SuiteRunner.privateRun(SuiteRunner.java:305)
	at org.testng.SuiteRunner.run(SuiteRunner.java:254)
	at org.testng.SuiteRunnerWorker.runSuite(SuiteRunnerWorker.java:52)
	at org.testng.SuiteRunnerWorker.run(SuiteRunnerWorker.java:86)
	at org.testng.TestNG.runSuitesSequentially(TestNG.java:1224)
	at org.testng.TestNG.runSuitesLocally(TestNG.java:1149)
	at org.testng.TestNG.run(TestNG.java:1057)
	at org.apache.maven.surefire.testng.TestNGExecutor.run(TestNGExecutor.java:115)
	at org.apache.maven.surefire.testng.TestNGDirectoryTestSuite.executeMulti(TestNGDirectoryTestSuite.java:205)
	at org.apache.maven.surefire.testng.TestNGDirectoryTestSuite.execute(TestNGDirectoryTestSuite.java:108)
	at org.apache.maven.surefire.testng.TestNGProvider.invoke(TestNGProvider.java:111)
	at org.apache.maven.surefire.booter.ForkedBooter.invokeProviderInSameClassLoader(ForkedBooter.java:203)
	at org.apache.maven.surefire.booter.ForkedBooter.runSuitesInProcess(ForkedBooter.java:155)
	at org.apache.maven.surefire.booter.ForkedBooter.main(ForkedBooter.java:103)


Results :

Failed tests: 
  SoftwareProcessPersisterInMemorySizeIntegrationTest>BrooklynMementoPersisterInMemorySizeIntegrationTest.testPersistenceVolumeFastNoTrigger:67->BrooklynMementoPersisterInMemorySizeIntegrationTest.doTestPersistenceVolume:95
should have written less than 150k, wrote 151985 expected [true] but found [false]

Tests run: 155, Failures: 1, Errors: 0, Skipped: 0

[JENKINS] Recording test results
[INFO] ------------------------------------------------------------------------
[INFO] Reactor Summary:
[INFO] 
[INFO] Brooklyn Server Root ............................... SUCCESS [  3.101 s]
[INFO] Brooklyn Parent Project ............................ SUCCESS [  6.892 s]
[INFO] Brooklyn Test Support Utilities .................... SUCCESS [  8.860 s]
[INFO] Brooklyn Logback Includable Configuration .......... SUCCESS [  2.593 s]
[INFO] Brooklyn Common Utilities .......................... SUCCESS [ 30.774 s]
[INFO] Brooklyn API ....................................... SUCCESS [  5.137 s]
[INFO] CAMP Server Parent Project ......................... SUCCESS [  1.272 s]
[INFO] CAMP Base .......................................... SUCCESS [  5.415 s]
[INFO] Brooklyn Test Support .............................. SUCCESS [  8.525 s]
[INFO] Brooklyn REST Swagger Apidoc Utilities ............. SUCCESS [  4.645 s]
[INFO] Brooklyn Logback Configuration ..................... SUCCESS [  2.256 s]
[INFO] CAMP Server ........................................ SUCCESS [  9.798 s]
[INFO] Brooklyn Felix Runtime ............................. SUCCESS [  6.130 s]
[INFO] Brooklyn Groovy Utilities .......................... SUCCESS [  7.142 s]
[INFO] Brooklyn Core ...................................... SUCCESS [04:19 min]
[INFO] Brooklyn Policies .................................. SUCCESS [01:38 min]
[INFO] Brooklyn WinRM Software Entities ................... SUCCESS [ 12.538 s]
[INFO] Brooklyn Secure JMXMP Agent ........................ SUCCESS [ 15.784 s]
[INFO] Brooklyn JMX RMI Agent ............................. SUCCESS [  2.295 s]
[INFO] Brooklyn Jclouds Location Targets .................. SUCCESS [ 27.456 s]
[INFO] Brooklyn Software Base ............................. FAILURE [01:18 min]
[INFO] Brooklyn CAMP REST API ............................. SKIPPED
[INFO] Brooklyn Hazelcast Storage ......................... SKIPPED
[INFO] Brooklyn Launcher Common ........................... SKIPPED
[INFO] Brooklyn REST API .................................. SKIPPED
[INFO] Brooklyn REST Resources ............................ SKIPPED
[INFO] Brooklyn REST Server ............................... SKIPPED
[INFO] Brooklyn Launcher .................................. SKIPPED
[INFO] Brooklyn Command Line Interface .................... SKIPPED
[INFO] Brooklyn REST Client ............................... SKIPPED
[INFO] Brooklyn Test Framework ............................ SKIPPED
[INFO] Brooklyn OSGi init ................................. SKIPPED
[INFO] Brooklyn Karaf ..................................... SKIPPED
[INFO] Jetty config fragment .............................. SKIPPED
[INFO] Brooklyn Karaf Features ............................ SKIPPED
[INFO] Brooklyn Karaf Distro .............................. SKIPPED
[INFO] Brooklyn Karaf Shell Commands ...................... SKIPPED
[INFO] Brooklyn Karaf pax-exam itest ...................... SKIPPED
[INFO] ------------------------------------------------------------------------
[INFO] BUILD FAILURE
[INFO] ------------------------------------------------------------------------
[INFO] Total time: 10:32 min
[INFO] Finished at: 2016-04-22T13:14:16+00:00
[INFO] Final Memory: 106M/624M
[INFO] ------------------------------------------------------------------------
Waiting for Jenkins to finish collecting data
[ERROR] Failed to execute goal org.apache.maven.plugins:maven-surefire-plugin:2.18.1:test
(default-test) on project brooklyn-software-base: There are test failures.
[ERROR] 
[ERROR] Please refer to <https://builds.apache.org/job/brooklyn-server-master/ws/software/base/target/surefire-reports>
for the individual test results.
[ERROR] -> [Help 1]
[ERROR] 
[ERROR] To see the full stack trace of the errors, re-run Maven with the -e switch.
[ERROR] Re-run Maven using the -X switch to enable full debug logging.
[ERROR] 
[ERROR] For more information about the errors and possible solutions, please read the following
articles:
[ERROR] [Help 1] http://cwiki.apache.org/confluence/display/MAVEN/MojoFailureException
[ERROR] 
[ERROR] After correcting the problems, you can resume the build with the command
[ERROR]   mvn <goals> -rf :brooklyn-software-base
[JENKINS] Archiving <https://builds.apache.org/job/brooklyn-server-master/ws/policy/pom.xml>
to org.apache.brooklyn/brooklyn-policy/0.10.0-SNAPSHOT/brooklyn-policy-0.10.0-SNAPSHOT.pom
[JENKINS] Archiving <https://builds.apache.org/job/brooklyn-server-master/ws/policy/target/brooklyn-policy-0.10.0-SNAPSHOT.jar>
to org.apache.brooklyn/brooklyn-policy/0.10.0-SNAPSHOT/brooklyn-policy-0.10.0-SNAPSHOT.jar
[JENKINS] Archiving <https://builds.apache.org/job/brooklyn-server-master/ws/policy/target/brooklyn-policy-0.10.0-SNAPSHOT-tests.jar>
to org.apache.brooklyn/brooklyn-policy/0.10.0-SNAPSHOT/brooklyn-policy-0.10.0-SNAPSHOT-tests.jar
[JENKINS] Archiving <https://builds.apache.org/job/brooklyn-server-master/ws/policy/target/brooklyn-policy-0.10.0-SNAPSHOT-sources.jar>
to org.apache.brooklyn/brooklyn-policy/0.10.0-SNAPSHOT/brooklyn-policy-0.10.0-SNAPSHOT-sources.jar
[JENKINS] Archiving <https://builds.apache.org/job/brooklyn-server-master/ws/policy/target/brooklyn-policy-0.10.0-SNAPSHOT-test-sources.jar>
to org.apache.brooklyn/brooklyn-policy/0.10.0-SNAPSHOT/brooklyn-policy-0.10.0-SNAPSHOT-test-sources.jar
No artifacts from brooklyn-server-master » Brooklyn Policies #64 to compare, so performing
full copy of artifacts
[JENKINS] Archiving <https://builds.apache.org/job/brooklyn-server-master/ws/storage/hazelcast/pom.xml>
to org.apache.brooklyn/brooklyn-storage-hazelcast/0.10.0-SNAPSHOT/brooklyn-storage-hazelcast-0.10.0-SNAPSHOT.pom
[JENKINS] Archiving <https://builds.apache.org/job/brooklyn-server-master/ws/test-framework/pom.xml>
to org.apache.brooklyn/brooklyn-test-framework/0.10.0-SNAPSHOT/brooklyn-test-framework-0.10.0-SNAPSHOT.pom
[JENKINS] Archiving <https://builds.apache.org/job/brooklyn-server-master/ws/karaf/init/pom.xml>
to org.apache.brooklyn/brooklyn-karaf-init/0.10.0-SNAPSHOT/brooklyn-karaf-init-0.10.0-SNAPSHOT.pom
[JENKINS] Archiving <https://builds.apache.org/job/brooklyn-server-master/ws/pom.xml>
to org.apache.brooklyn/brooklyn-server/0.10.0-SNAPSHOT/brooklyn-server-0.10.0-SNAPSHOT.pom
No artifacts from brooklyn-server-master » Brooklyn Server Root #64 to compare, so performing
full copy of artifacts
[JENKINS] Archiving <https://builds.apache.org/job/brooklyn-server-master/ws/karaf/commands/pom.xml>
to org.apache.brooklyn/brooklyn-commands/0.10.0-SNAPSHOT/brooklyn-commands-0.10.0-SNAPSHOT.pom
[JENKINS] Archiving <https://builds.apache.org/job/brooklyn-server-master/ws/rest/rest-api/pom.xml>
to org.apache.brooklyn/brooklyn-rest-api/0.10.0-SNAPSHOT/brooklyn-rest-api-0.10.0-SNAPSHOT.pom
[JENKINS] Archiving <https://builds.apache.org/job/brooklyn-server-master/ws/core/pom.xml>
to org.apache.brooklyn/brooklyn-core/0.10.0-SNAPSHOT/brooklyn-core-0.10.0-SNAPSHOT.pom
[JENKINS] Archiving <https://builds.apache.org/job/brooklyn-server-master/ws/core/target/brooklyn-core-0.10.0-SNAPSHOT.jar>
to org.apache.brooklyn/brooklyn-core/0.10.0-SNAPSHOT/brooklyn-core-0.10.0-SNAPSHOT.jar
[JENKINS] Archiving <https://builds.apache.org/job/brooklyn-server-master/ws/core/target/brooklyn-core-0.10.0-SNAPSHOT-tests.jar>
to org.apache.brooklyn/brooklyn-core/0.10.0-SNAPSHOT/brooklyn-core-0.10.0-SNAPSHOT-tests.jar
[JENKINS] Archiving <https://builds.apache.org/job/brooklyn-server-master/ws/core/target/brooklyn-core-0.10.0-SNAPSHOT-sources.jar>
to org.apache.brooklyn/brooklyn-core/0.10.0-SNAPSHOT/brooklyn-core-0.10.0-SNAPSHOT-sources.jar
[JENKINS] Archiving <https://builds.apache.org/job/brooklyn-server-master/ws/core/target/brooklyn-core-0.10.0-SNAPSHOT-test-sources.jar>
to org.apache.brooklyn/brooklyn-core/0.10.0-SNAPSHOT/brooklyn-core-0.10.0-SNAPSHOT-test-sources.jar
No artifacts from brooklyn-server-master » Brooklyn Core #64 to compare, so performing full
copy of artifacts
[JENKINS] Archiving <https://builds.apache.org/job/brooklyn-server-master/ws/logging/logback-xml/pom.xml>
to org.apache.brooklyn/brooklyn-logback-xml/0.10.0-SNAPSHOT/brooklyn-logback-xml-0.10.0-SNAPSHOT.pom
[JENKINS] Archiving <https://builds.apache.org/job/brooklyn-server-master/ws/logging/logback-xml/target/brooklyn-logback-xml-0.10.0-SNAPSHOT.jar>
to org.apache.brooklyn/brooklyn-logback-xml/0.10.0-SNAPSHOT/brooklyn-logback-xml-0.10.0-SNAPSHOT.jar
[JENKINS] Archiving <https://builds.apache.org/job/brooklyn-server-master/ws/logging/logback-xml/target/brooklyn-logback-xml-0.10.0-SNAPSHOT-sources.jar>
to org.apache.brooklyn/brooklyn-logback-xml/0.10.0-SNAPSHOT/brooklyn-logback-xml-0.10.0-SNAPSHOT-sources.jar
[JENKINS] Archiving <https://builds.apache.org/job/brooklyn-server-master/ws/logging/logback-xml/target/brooklyn-logback-xml-0.10.0-SNAPSHOT-test-sources.jar>
to org.apache.brooklyn/brooklyn-logback-xml/0.10.0-SNAPSHOT/brooklyn-logback-xml-0.10.0-SNAPSHOT-test-sources.jar
No artifacts from brooklyn-server-master » Brooklyn Logback Configuration #64 to compare,
so performing full copy of artifacts
[JENKINS] Archiving <https://builds.apache.org/job/brooklyn-server-master/ws/karaf/features/pom.xml>
to org.apache.brooklyn/brooklyn-features/0.10.0-SNAPSHOT/brooklyn-features-0.10.0-SNAPSHOT.pom
[JENKINS] Archiving <https://builds.apache.org/job/brooklyn-server-master/ws/rest/rest-resources/pom.xml>
to org.apache.brooklyn/brooklyn-rest-resources/0.10.0-SNAPSHOT/brooklyn-rest-resources-0.10.0-SNAPSHOT.pom
[JENKINS] Archiving <https://builds.apache.org/job/brooklyn-server-master/ws/camp/camp-server/pom.xml>
to org.apache.brooklyn.camp/camp-server/0.10.0-SNAPSHOT/camp-server-0.10.0-SNAPSHOT.pom
[JENKINS] Archiving <https://builds.apache.org/job/brooklyn-server-master/ws/camp/camp-server/target/camp-server-0.10.0-SNAPSHOT.jar>
to org.apache.brooklyn.camp/camp-server/0.10.0-SNAPSHOT/camp-server-0.10.0-SNAPSHOT.jar
[JENKINS] Archiving <https://builds.apache.org/job/brooklyn-server-master/ws/camp/camp-server/target/camp-server-0.10.0-SNAPSHOT-tests.jar>
to org.apache.brooklyn.camp/camp-server/0.10.0-SNAPSHOT/camp-server-0.10.0-SNAPSHOT-tests.jar
[JENKINS] Archiving <https://builds.apache.org/job/brooklyn-server-master/ws/camp/camp-server/target/camp-server-0.10.0-SNAPSHOT-sources.jar>
to org.apache.brooklyn.camp/camp-server/0.10.0-SNAPSHOT/camp-server-0.10.0-SNAPSHOT-sources.jar
[JENKINS] Archiving <https://builds.apache.org/job/brooklyn-server-master/ws/camp/camp-server/target/camp-server-0.10.0-SNAPSHOT-test-sources.jar>
to org.apache.brooklyn.camp/camp-server/0.10.0-SNAPSHOT/camp-server-0.10.0-SNAPSHOT-test-sources.jar
No artifacts from brooklyn-server-master » CAMP Server #64 to compare, so performing full
copy of artifacts
[JENKINS] Archiving <https://builds.apache.org/job/brooklyn-server-master/ws/launcher-common/pom.xml>
to org.apache.brooklyn/brooklyn-launcher-common/0.10.0-SNAPSHOT/brooklyn-launcher-common-0.10.0-SNAPSHOT.pom
[JENKINS] Archiving <https://builds.apache.org/job/brooklyn-server-master/ws/utils/groovy/pom.xml>
to org.apache.brooklyn/brooklyn-utils-groovy/0.10.0-SNAPSHOT/brooklyn-utils-groovy-0.10.0-SNAPSHOT.pom
[JENKINS] Archiving <https://builds.apache.org/job/brooklyn-server-master/ws/utils/groovy/target/brooklyn-utils-groovy-0.10.0-SNAPSHOT.jar>
to org.apache.brooklyn/brooklyn-utils-groovy/0.10.0-SNAPSHOT/brooklyn-utils-groovy-0.10.0-SNAPSHOT.jar
[JENKINS] Archiving <https://builds.apache.org/job/brooklyn-server-master/ws/utils/groovy/target/brooklyn-utils-groovy-0.10.0-SNAPSHOT-tests.jar>
to org.apache.brooklyn/brooklyn-utils-groovy/0.10.0-SNAPSHOT/brooklyn-utils-groovy-0.10.0-SNAPSHOT-tests.jar
[JENKINS] Archiving <https://builds.apache.org/job/brooklyn-server-master/ws/utils/groovy/target/brooklyn-utils-groovy-0.10.0-SNAPSHOT-sources.jar>
to org.apache.brooklyn/brooklyn-utils-groovy/0.10.0-SNAPSHOT/brooklyn-utils-groovy-0.10.0-SNAPSHOT-sources.jar
[JENKINS] Archiving <https://builds.apache.org/job/brooklyn-server-master/ws/utils/groovy/target/brooklyn-utils-groovy-0.10.0-SNAPSHOT-test-sources.jar>
to org.apache.brooklyn/brooklyn-utils-groovy/0.10.0-SNAPSHOT/brooklyn-utils-groovy-0.10.0-SNAPSHOT-test-sources.jar
No artifacts from brooklyn-server-master » Brooklyn Groovy Utilities #64 to compare, so performing
full copy of artifacts
[JENKINS] Archiving <https://builds.apache.org/job/brooklyn-server-master/ws/utils/common/pom.xml>
to org.apache.brooklyn/brooklyn-utils-common/0.10.0-SNAPSHOT/brooklyn-utils-common-0.10.0-SNAPSHOT.pom
[JENKINS] Archiving <https://builds.apache.org/job/brooklyn-server-master/ws/utils/common/target/brooklyn-utils-common-0.10.0-SNAPSHOT.jar>
to org.apache.brooklyn/brooklyn-utils-common/0.10.0-SNAPSHOT/brooklyn-utils-common-0.10.0-SNAPSHOT.jar
[JENKINS] Archiving <https://builds.apache.org/job/brooklyn-server-master/ws/utils/common/target/brooklyn-utils-common-0.10.0-SNAPSHOT-tests.jar>
to org.apache.brooklyn/brooklyn-utils-common/0.10.0-SNAPSHOT/brooklyn-utils-common-0.10.0-SNAPSHOT-tests.jar
[JENKINS] Archiving <https://builds.apache.org/job/brooklyn-server-master/ws/utils/common/target/brooklyn-utils-common-0.10.0-SNAPSHOT-sources.jar>
to org.apache.brooklyn/brooklyn-utils-common/0.10.0-SNAPSHOT/brooklyn-utils-common-0.10.0-SNAPSHOT-sources.jar
[JENKINS] Archiving <https://builds.apache.org/job/brooklyn-server-master/ws/utils/common/target/brooklyn-utils-common-0.10.0-SNAPSHOT-test-sources.jar>
to org.apache.brooklyn/brooklyn-utils-common/0.10.0-SNAPSHOT/brooklyn-utils-common-0.10.0-SNAPSHOT-test-sources.jar
No artifacts from brooklyn-server-master » Brooklyn Common Utilities #64 to compare, so performing
full copy of artifacts
[JENKINS] Archiving <https://builds.apache.org/job/brooklyn-server-master/ws/locations/jclouds/pom.xml>
to org.apache.brooklyn/brooklyn-locations-jclouds/0.10.0-SNAPSHOT/brooklyn-locations-jclouds-0.10.0-SNAPSHOT.pom
[JENKINS] Archiving <https://builds.apache.org/job/brooklyn-server-master/ws/locations/jclouds/target/brooklyn-locations-jclouds-0.10.0-SNAPSHOT.jar>
to org.apache.brooklyn/brooklyn-locations-jclouds/0.10.0-SNAPSHOT/brooklyn-locations-jclouds-0.10.0-SNAPSHOT.jar
[JENKINS] Archiving <https://builds.apache.org/job/brooklyn-server-master/ws/locations/jclouds/target/brooklyn-locations-jclouds-0.10.0-SNAPSHOT-tests.jar>
to org.apache.brooklyn/brooklyn-locations-jclouds/0.10.0-SNAPSHOT/brooklyn-locations-jclouds-0.10.0-SNAPSHOT-tests.jar
[JENKINS] Archiving <https://builds.apache.org/job/brooklyn-server-master/ws/locations/jclouds/target/brooklyn-locations-jclouds-0.10.0-SNAPSHOT-sources.jar>
to org.apache.brooklyn/brooklyn-locations-jclouds/0.10.0-SNAPSHOT/brooklyn-locations-jclouds-0.10.0-SNAPSHOT-sources.jar
[JENKINS] Archiving <https://builds.apache.org/job/brooklyn-server-master/ws/locations/jclouds/target/brooklyn-locations-jclouds-0.10.0-SNAPSHOT-test-sources.jar>
to org.apache.brooklyn/brooklyn-locations-jclouds/0.10.0-SNAPSHOT/brooklyn-locations-jclouds-0.10.0-SNAPSHOT-test-sources.jar
[JENKINS] Archiving <https://builds.apache.org/job/brooklyn-server-master/ws/test-support/pom.xml>
to org.apache.brooklyn/brooklyn-test-support/0.10.0-SNAPSHOT/brooklyn-test-support-0.10.0-SNAPSHOT.pom
[JENKINS] Archiving <https://builds.apache.org/job/brooklyn-server-master/ws/test-support/target/brooklyn-test-support-0.10.0-SNAPSHOT.jar>
to org.apache.brooklyn/brooklyn-test-support/0.10.0-SNAPSHOT/brooklyn-test-support-0.10.0-SNAPSHOT.jar
[JENKINS] Archiving <https://builds.apache.org/job/brooklyn-server-master/ws/test-support/target/brooklyn-test-support-0.10.0-SNAPSHOT-sources.jar>
to org.apache.brooklyn/brooklyn-test-support/0.10.0-SNAPSHOT/brooklyn-test-support-0.10.0-SNAPSHOT-sources.jar
[JENKINS] Archiving <https://builds.apache.org/job/brooklyn-server-master/ws/test-support/target/brooklyn-test-support-0.10.0-SNAPSHOT-test-sources.jar>
to org.apache.brooklyn/brooklyn-test-support/0.10.0-SNAPSHOT/brooklyn-test-support-0.10.0-SNAPSHOT-test-sources.jar
No artifacts from brooklyn-server-master » Brooklyn Test Support #64 to compare, so performing
full copy of artifacts
[JENKINS] Archiving <https://builds.apache.org/job/brooklyn-server-master/ws/karaf/pom.xml>
to org.apache.brooklyn/brooklyn-karaf/0.10.0-SNAPSHOT/brooklyn-karaf-0.10.0-SNAPSHOT.pom
[JENKINS] Archiving <https://builds.apache.org/job/brooklyn-server-master/ws/utils/rt-felix/pom.xml>
to org.apache.brooklyn/brooklyn-rt-felix/0.10.0-SNAPSHOT/brooklyn-rt-felix-0.10.0-SNAPSHOT.pom
[JENKINS] Archiving <https://builds.apache.org/job/brooklyn-server-master/ws/utils/rt-felix/target/brooklyn-rt-felix-0.10.0-SNAPSHOT.jar>
to org.apache.brooklyn/brooklyn-rt-felix/0.10.0-SNAPSHOT/brooklyn-rt-felix-0.10.0-SNAPSHOT.jar
[JENKINS] Archiving <https://builds.apache.org/job/brooklyn-server-master/ws/utils/rt-felix/target/brooklyn-rt-felix-0.10.0-SNAPSHOT-tests.jar>
to org.apache.brooklyn/brooklyn-rt-felix/0.10.0-SNAPSHOT/brooklyn-rt-felix-0.10.0-SNAPSHOT-tests.jar
[JENKINS] Archiving <https://builds.apache.org/job/brooklyn-server-master/ws/utils/rt-felix/target/brooklyn-rt-felix-0.10.0-SNAPSHOT-sources.jar>
to org.apache.brooklyn/brooklyn-rt-felix/0.10.0-SNAPSHOT/brooklyn-rt-felix-0.10.0-SNAPSHOT-sources.jar
[JENKINS] Archiving <https://builds.apache.org/job/brooklyn-server-master/ws/utils/rt-felix/target/brooklyn-rt-felix-0.10.0-SNAPSHOT-test-sources.jar>
to org.apache.brooklyn/brooklyn-rt-felix/0.10.0-SNAPSHOT/brooklyn-rt-felix-0.10.0-SNAPSHOT-test-sources.jar
No artifacts from brooklyn-server-master » Brooklyn Felix Runtime #64 to compare, so performing
full copy of artifacts
[JENKINS] Archiving <https://builds.apache.org/job/brooklyn-server-master/ws/karaf/itest/pom.xml>
to org.apache.brooklyn/brooklyn-itest/0.10.0-SNAPSHOT/brooklyn-itest-0.10.0-SNAPSHOT.pom
[JENKINS] Archiving <https://builds.apache.org/job/brooklyn-server-master/ws/software/winrm/pom.xml>
to org.apache.brooklyn/brooklyn-software-winrm/0.10.0-SNAPSHOT/brooklyn-software-winrm-0.10.0-SNAPSHOT.pom
[JENKINS] Archiving <https://builds.apache.org/job/brooklyn-server-master/ws/software/winrm/target/brooklyn-software-winrm-0.10.0-SNAPSHOT.jar>
to org.apache.brooklyn/brooklyn-software-winrm/0.10.0-SNAPSHOT/brooklyn-software-winrm-0.10.0-SNAPSHOT.jar
[JENKINS] Archiving <https://builds.apache.org/job/brooklyn-server-master/ws/software/winrm/target/brooklyn-software-winrm-0.10.0-SNAPSHOT-tests.jar>
to org.apache.brooklyn/brooklyn-software-winrm/0.10.0-SNAPSHOT/brooklyn-software-winrm-0.10.0-SNAPSHOT-tests.jar
[JENKINS] Archiving <https://builds.apache.org/job/brooklyn-server-master/ws/software/winrm/target/brooklyn-software-winrm-0.10.0-SNAPSHOT-sources.jar>
to org.apache.brooklyn/brooklyn-software-winrm/0.10.0-SNAPSHOT/brooklyn-software-winrm-0.10.0-SNAPSHOT-sources.jar
[JENKINS] Archiving <https://builds.apache.org/job/brooklyn-server-master/ws/software/winrm/target/brooklyn-software-winrm-0.10.0-SNAPSHOT-test-sources.jar>
to org.apache.brooklyn/brooklyn-software-winrm/0.10.0-SNAPSHOT/brooklyn-software-winrm-0.10.0-SNAPSHOT-test-sources.jar
No artifacts from brooklyn-server-master » Brooklyn WinRM Software Entities #64 to compare,
so performing full copy of artifacts
[JENKINS] Archiving <https://builds.apache.org/job/brooklyn-server-master/ws/rest/rest-server/pom.xml>
to org.apache.brooklyn/brooklyn-rest-server/0.10.0-SNAPSHOT/brooklyn-rest-server-0.10.0-SNAPSHOT.pom
[JENKINS] Archiving <https://builds.apache.org/job/brooklyn-server-master/ws/camp/camp-base/pom.xml>
to org.apache.brooklyn.camp/camp-base/0.10.0-SNAPSHOT/camp-base-0.10.0-SNAPSHOT.pom
[JENKINS] Archiving <https://builds.apache.org/job/brooklyn-server-master/ws/camp/camp-base/target/camp-base-0.10.0-SNAPSHOT.jar>
to org.apache.brooklyn.camp/camp-base/0.10.0-SNAPSHOT/camp-base-0.10.0-SNAPSHOT.jar
[JENKINS] Archiving <https://builds.apache.org/job/brooklyn-server-master/ws/camp/camp-base/target/camp-base-0.10.0-SNAPSHOT-tests.jar>
to org.apache.brooklyn.camp/camp-base/0.10.0-SNAPSHOT/camp-base-0.10.0-SNAPSHOT-tests.jar
[JENKINS] Archiving <https://builds.apache.org/job/brooklyn-server-master/ws/camp/camp-base/target/camp-base-0.10.0-SNAPSHOT-sources.jar>
to org.apache.brooklyn.camp/camp-base/0.10.0-SNAPSHOT/camp-base-0.10.0-SNAPSHOT-sources.jar
[JENKINS] Archiving <https://builds.apache.org/job/brooklyn-server-master/ws/camp/camp-base/target/camp-base-0.10.0-SNAPSHOT-test-sources.jar>
to org.apache.brooklyn.camp/camp-base/0.10.0-SNAPSHOT/camp-base-0.10.0-SNAPSHOT-test-sources.jar
No artifacts from brooklyn-server-master » CAMP Base #64 to compare, so performing full copy
of artifacts
[JENKINS] Archiving <https://builds.apache.org/job/brooklyn-server-master/ws/rest/rest-client/pom.xml>
to org.apache.brooklyn/brooklyn-rest-client/0.10.0-SNAPSHOT/brooklyn-rest-client-0.10.0-SNAPSHOT.pom
[JENKINS] Archiving <https://builds.apache.org/job/brooklyn-server-master/ws/karaf/apache-brooklyn/pom.xml>
to org.apache.brooklyn/apache-brooklyn/0.10.0-SNAPSHOT/apache-brooklyn-0.10.0-SNAPSHOT.pom
[JENKINS] Archiving <https://builds.apache.org/job/brooklyn-server-master/ws/utils/jmx/jmxmp-ssl-agent/pom.xml>
to org.apache.brooklyn/brooklyn-jmxmp-agent/0.10.0-SNAPSHOT/brooklyn-jmxmp-agent-0.10.0-SNAPSHOT.pom
[JENKINS] Archiving <https://builds.apache.org/job/brooklyn-server-master/ws/utils/jmx/jmxmp-ssl-agent/target/brooklyn-jmxmp-agent-0.10.0-SNAPSHOT.jar>
to org.apache.brooklyn/brooklyn-jmxmp-agent/0.10.0-SNAPSHOT/brooklyn-jmxmp-agent-0.10.0-SNAPSHOT.jar
[JENKINS] Archiving <https://builds.apache.org/job/brooklyn-server-master/ws/utils/jmx/jmxmp-ssl-agent/target/brooklyn-jmxmp-agent-0.10.0-SNAPSHOT-tests.jar>
to org.apache.brooklyn/brooklyn-jmxmp-agent/0.10.0-SNAPSHOT/brooklyn-jmxmp-agent-0.10.0-SNAPSHOT-tests.jar
[JENKINS] Archiving <https://builds.apache.org/job/brooklyn-server-master/ws/utils/jmx/jmxmp-ssl-agent/target/brooklyn-jmxmp-agent-shaded-0.10.0-SNAPSHOT.jar>
to org.apache.brooklyn/brooklyn-jmxmp-agent/0.10.0-SNAPSHOT/brooklyn-jmxmp-agent-0.10.0-SNAPSHOT-with-dependencies.jar
[JENKINS] Archiving <https://builds.apache.org/job/brooklyn-server-master/ws/utils/jmx/jmxmp-ssl-agent/target/brooklyn-jmxmp-agent-0.10.0-SNAPSHOT-sources.jar>
to org.apache.brooklyn/brooklyn-jmxmp-agent/0.10.0-SNAPSHOT/brooklyn-jmxmp-agent-0.10.0-SNAPSHOT-sources.jar
[JENKINS] Archiving <https://builds.apache.org/job/brooklyn-server-master/ws/utils/jmx/jmxmp-ssl-agent/target/brooklyn-jmxmp-agent-0.10.0-SNAPSHOT-test-sources.jar>
to org.apache.brooklyn/brooklyn-jmxmp-agent/0.10.0-SNAPSHOT/brooklyn-jmxmp-agent-0.10.0-SNAPSHOT-test-sources.jar
No artifacts from brooklyn-server-master » Brooklyn Secure JMXMP Agent #64 to compare, so
performing full copy of artifacts
[JENKINS] Archiving <https://builds.apache.org/job/brooklyn-server-master/ws/utils/jmx/jmxrmi-agent/pom.xml>
to org.apache.brooklyn/brooklyn-jmxrmi-agent/0.10.0-SNAPSHOT/brooklyn-jmxrmi-agent-0.10.0-SNAPSHOT.pom
[JENKINS] Archiving <https://builds.apache.org/job/brooklyn-server-master/ws/utils/jmx/jmxrmi-agent/target/brooklyn-jmxrmi-agent-0.10.0-SNAPSHOT.jar>
to org.apache.brooklyn/brooklyn-jmxrmi-agent/0.10.0-SNAPSHOT/brooklyn-jmxrmi-agent-0.10.0-SNAPSHOT.jar
[JENKINS] Archiving <https://builds.apache.org/job/brooklyn-server-master/ws/utils/jmx/jmxrmi-agent/target/brooklyn-jmxrmi-agent-0.10.0-SNAPSHOT-tests.jar>
to org.apache.brooklyn/brooklyn-jmxrmi-agent/0.10.0-SNAPSHOT/brooklyn-jmxrmi-agent-0.10.0-SNAPSHOT-tests.jar
[JENKINS] Archiving <https://builds.apache.org/job/brooklyn-server-master/ws/utils/jmx/jmxrmi-agent/target/brooklyn-jmxrmi-agent-0.10.0-SNAPSHOT-sources.jar>
to org.apache.brooklyn/brooklyn-jmxrmi-agent/0.10.0-SNAPSHOT/brooklyn-jmxrmi-agent-0.10.0-SNAPSHOT-sources.jar
[JENKINS] Archiving <https://builds.apache.org/job/brooklyn-server-master/ws/utils/jmx/jmxrmi-agent/target/brooklyn-jmxrmi-agent-0.10.0-SNAPSHOT-test-sources.jar>
to org.apache.brooklyn/brooklyn-jmxrmi-agent/0.10.0-SNAPSHOT/brooklyn-jmxrmi-agent-0.10.0-SNAPSHOT-test-sources.jar
No artifacts from brooklyn-server-master » Brooklyn JMX RMI Agent #64 to compare, so performing
full copy of artifacts
[JENKINS] Archiving <https://builds.apache.org/job/brooklyn-server-master/ws/camp/camp-brooklyn/pom.xml>
to org.apache.brooklyn/brooklyn-camp/0.10.0-SNAPSHOT/brooklyn-camp-0.10.0-SNAPSHOT.pom
[JENKINS] Archiving <https://builds.apache.org/job/brooklyn-server-master/ws/parent/pom.xml>
to org.apache.brooklyn/brooklyn-parent/0.10.0-SNAPSHOT/brooklyn-parent-0.10.0-SNAPSHOT.pom
No artifacts from brooklyn-server-master » Brooklyn Parent Project #64 to compare, so performing
full copy of artifacts
[JENKINS] Archiving <https://builds.apache.org/job/brooklyn-server-master/ws/server-cli/pom.xml>
to org.apache.brooklyn/brooklyn-cli/0.10.0-SNAPSHOT/brooklyn-cli-0.10.0-SNAPSHOT.pom
[JENKINS] Archiving <https://builds.apache.org/job/brooklyn-server-master/ws/software/base/pom.xml>
to org.apache.brooklyn/brooklyn-software-base/0.10.0-SNAPSHOT/brooklyn-software-base-0.10.0-SNAPSHOT.pom
[JENKINS] Archiving <https://builds.apache.org/job/brooklyn-server-master/ws/logging/logback-includes/pom.xml>
to org.apache.brooklyn/brooklyn-logback-includes/0.10.0-SNAPSHOT/brooklyn-logback-includes-0.10.0-SNAPSHOT.pom
[JENKINS] Archiving <https://builds.apache.org/job/brooklyn-server-master/ws/logging/logback-includes/target/brooklyn-logback-includes-0.10.0-SNAPSHOT.jar>
to org.apache.brooklyn/brooklyn-logback-includes/0.10.0-SNAPSHOT/brooklyn-logback-includes-0.10.0-SNAPSHOT.jar
[JENKINS] Archiving <https://builds.apache.org/job/brooklyn-server-master/ws/logging/logback-includes/target/brooklyn-logback-includes-0.10.0-SNAPSHOT-sources.jar>
to org.apache.brooklyn/brooklyn-logback-includes/0.10.0-SNAPSHOT/brooklyn-logback-includes-0.10.0-SNAPSHOT-sources.jar
[JENKINS] Archiving <https://builds.apache.org/job/brooklyn-server-master/ws/logging/logback-includes/target/brooklyn-logback-includes-0.10.0-SNAPSHOT-test-sources.jar>
to org.apache.brooklyn/brooklyn-logback-includes/0.10.0-SNAPSHOT/brooklyn-logback-includes-0.10.0-SNAPSHOT-test-sources.jar
No artifacts from brooklyn-server-master » Brooklyn Logback Includable Configuration #64
to compare, so performing full copy of artifacts
[JENKINS] Archiving <https://builds.apache.org/job/brooklyn-server-master/ws/launcher/pom.xml>
to org.apache.brooklyn/brooklyn-launcher/0.10.0-SNAPSHOT/brooklyn-launcher-0.10.0-SNAPSHOT.pom
[JENKINS] Archiving <https://builds.apache.org/job/brooklyn-server-master/ws/karaf/jetty-config/pom.xml>
to org.apache.brooklyn/brooklyn-karaf-jetty-config/0.10.0-SNAPSHOT/brooklyn-karaf-jetty-config-0.10.0-SNAPSHOT.pom
[JENKINS] Archiving <https://builds.apache.org/job/brooklyn-server-master/ws/utils/rest-swagger/pom.xml>
to org.apache.brooklyn/brooklyn-utils-rest-swagger/0.10.0-SNAPSHOT/brooklyn-utils-rest-swagger-0.10.0-SNAPSHOT.pom
[JENKINS] Archiving <https://builds.apache.org/job/brooklyn-server-master/ws/utils/rest-swagger/target/brooklyn-utils-rest-swagger-0.10.0-SNAPSHOT.jar>
to org.apache.brooklyn/brooklyn-utils-rest-swagger/0.10.0-SNAPSHOT/brooklyn-utils-rest-swagger-0.10.0-SNAPSHOT.jar
[JENKINS] Archiving <https://builds.apache.org/job/brooklyn-server-master/ws/utils/rest-swagger/target/brooklyn-utils-rest-swagger-0.10.0-SNAPSHOT-sources.jar>
to org.apache.brooklyn/brooklyn-utils-rest-swagger/0.10.0-SNAPSHOT/brooklyn-utils-rest-swagger-0.10.0-SNAPSHOT-sources.jar
[JENKINS] Archiving <https://builds.apache.org/job/brooklyn-server-master/ws/utils/rest-swagger/target/brooklyn-utils-rest-swagger-0.10.0-SNAPSHOT-test-sources.jar>
to org.apache.brooklyn/brooklyn-utils-rest-swagger/0.10.0-SNAPSHOT/brooklyn-utils-rest-swagger-0.10.0-SNAPSHOT-test-sources.jar
No artifacts from brooklyn-server-master » Brooklyn REST Swagger Apidoc Utilities #64 to
compare, so performing full copy of artifacts
[JENKINS] Archiving <https://builds.apache.org/job/brooklyn-server-master/ws/utils/test-support/pom.xml>
to org.apache.brooklyn/brooklyn-utils-test-support/0.10.0-SNAPSHOT/brooklyn-utils-test-support-0.10.0-SNAPSHOT.pom
[JENKINS] Archiving <https://builds.apache.org/job/brooklyn-server-master/ws/utils/test-support/target/brooklyn-utils-test-support-0.10.0-SNAPSHOT.jar>
to org.apache.brooklyn/brooklyn-utils-test-support/0.10.0-SNAPSHOT/brooklyn-utils-test-support-0.10.0-SNAPSHOT.jar
[JENKINS] Archiving <https://builds.apache.org/job/brooklyn-server-master/ws/utils/test-support/target/brooklyn-utils-test-support-0.10.0-SNAPSHOT-sources.jar>
to org.apache.brooklyn/brooklyn-utils-test-support/0.10.0-SNAPSHOT/brooklyn-utils-test-support-0.10.0-SNAPSHOT-sources.jar
[JENKINS] Archiving <https://builds.apache.org/job/brooklyn-server-master/ws/utils/test-support/target/brooklyn-utils-test-support-0.10.0-SNAPSHOT-test-sources.jar>
to org.apache.brooklyn/brooklyn-utils-test-support/0.10.0-SNAPSHOT/brooklyn-utils-test-support-0.10.0-SNAPSHOT-test-sources.jar
No artifacts from brooklyn-server-master » Brooklyn Test Support Utilities #64 to compare,
so performing full copy of artifacts
[JENKINS] Archiving <https://builds.apache.org/job/brooklyn-server-master/ws/camp/pom.xml>
to org.apache.brooklyn.camp/camp-parent/0.10.0-SNAPSHOT/camp-parent-0.10.0-SNAPSHOT.pom
No artifacts from brooklyn-server-master » CAMP Server Parent Project #64 to compare, so
performing full copy of artifacts
[JENKINS] Archiving <https://builds.apache.org/job/brooklyn-server-master/ws/api/pom.xml>
to org.apache.brooklyn/brooklyn-api/0.10.0-SNAPSHOT/brooklyn-api-0.10.0-SNAPSHOT.pom
[JENKINS] Archiving <https://builds.apache.org/job/brooklyn-server-master/ws/api/target/brooklyn-api-0.10.0-SNAPSHOT.jar>
to org.apache.brooklyn/brooklyn-api/0.10.0-SNAPSHOT/brooklyn-api-0.10.0-SNAPSHOT.jar
[JENKINS] Archiving <https://builds.apache.org/job/brooklyn-server-master/ws/api/target/brooklyn-api-0.10.0-SNAPSHOT-sources.jar>
to org.apache.brooklyn/brooklyn-api/0.10.0-SNAPSHOT/brooklyn-api-0.10.0-SNAPSHOT-sources.jar
[JENKINS] Archiving <https://builds.apache.org/job/brooklyn-server-master/ws/api/target/brooklyn-api-0.10.0-SNAPSHOT-test-sources.jar>
to org.apache.brooklyn/brooklyn-api/0.10.0-SNAPSHOT/brooklyn-api-0.10.0-SNAPSHOT-test-sources.jar
No artifacts from brooklyn-server-master » Brooklyn API #64 to compare, so performing full
copy of artifacts
channel stopped

Mime
View raw message