brooklyn-dev mailing list archives

Site index · List index
Message view « Date » · « Thread »
Top « Date » · « Thread »
From Apache Jenkins Server <jenk...@builds.apache.org>
Subject Build failed in Jenkins: brooklyn-server-master #1
Date Fri, 11 Mar 2016 13:50:59 GMT
See <https://builds.apache.org/job/brooklyn-server-master/1/>

------------------------------------------
[...truncated 24949 lines...]
2016-03-11 13:43:23,906 INFO  TESTNG INVOKING CONFIGURATION: "Surefire test" - @BeforeMethod
org.apache.brooklyn.entity.java.JavaOptsTest.setUp()
2016-03-11 13:43:23,939 INFO  TESTNG PASSED CONFIGURATION: "Surefire test" - @BeforeMethod
org.apache.brooklyn.entity.java.JavaOptsTest.setUp() finished in 33 ms
2016-03-11 13:43:23,940 INFO  TESTNG INVOKING: "Surefire test" - org.apache.brooklyn.entity.java.JavaOptsTest.testBasicJmxConfigFromDefault()
2016-03-11 13:43:23,970 INFO  No Camp-YAML parser registered for parsing catalog item DSL;
skipping DSL-parsing
2016-03-11 13:43:23,975 INFO  Starting TestingNoSensorsVanillaJavaAppImpl{id=oRJhMzyr} on
machine SshMachineLocation[SshMachineLocation:WBFR:null@localhost/127.0.0.1:22(id=WBFRb3Bk)]
2016-03-11 13:43:24,356 INFO  TESTNG PASSED: "Surefire test" - org.apache.brooklyn.entity.java.JavaOptsTest.testBasicJmxConfigFromDefault()
finished in 417 ms
2016-03-11 13:43:24,356 INFO  TESTNG INVOKING CONFIGURATION: "Surefire test" - @AfterMethod
org.apache.brooklyn.entity.java.JavaOptsTest.tearDown()
2016-03-11 13:43:24,363 WARN  Setting Application[OZEp5Ux9] on-fire due to problems when expected
running, up=false, not-up-indicators: {service.state=Application stopping}
2016-03-11 13:43:24,365 INFO  Stopping TestingNoSensorsVanillaJavaAppImpl{id=oRJhMzyr} in
[SshMachineLocation[SshMachineLocation:WBFR:jenkins@localhost/127.0.0.1:22(id=WBFRb3Bk)]]
SUREFIRE-859: [GC 252222K->55305K(754176K), 0.0514570 secs]
2016-03-11 13:43:24,450 INFO  TESTNG PASSED CONFIGURATION: "Surefire test" - @AfterMethod
org.apache.brooklyn.entity.java.JavaOptsTest.tearDown() finished in 93 ms
2016-03-11 13:43:24,451 INFO  TESTNG INVOKING CONFIGURATION: "Surefire test" - @BeforeMethod
org.apache.brooklyn.entity.java.JavaOptsTest.setUp()
2016-03-11 13:43:24,466 WARN  Task Task[LSM.publish(EmptySoftwareProcessImpl{id=loPem3KD}.Sensor:
service.state (org.apache.brooklyn.core.entity.lifecycle.Lifecycle)=stopped @ 1457703680412);[subscription-delivery-entity-loPem3KD[EmptySoftwareProcessImpl{id=loPem3KD}]]]@GtZqwKCT
is being finalized before completion
2016-03-11 13:43:24,479 INFO  TESTNG PASSED CONFIGURATION: "Surefire test" - @BeforeMethod
org.apache.brooklyn.entity.java.JavaOptsTest.setUp() finished in 28 ms
2016-03-11 13:43:24,480 INFO  TESTNG INVOKING: "Surefire test" - org.apache.brooklyn.entity.java.JavaOptsTest.testBasicJmxFromConfig()
2016-03-11 13:43:24,511 INFO  No Camp-YAML parser registered for parsing catalog item DSL;
skipping DSL-parsing
2016-03-11 13:43:24,517 INFO  Starting TestingNoSensorsVanillaJavaAppImpl{id=akoPVvNP} on
machine SshMachineLocation[SshMachineLocation:Xp54:null@localhost/127.0.0.1:22(id=Xp5411wU)]
2016-03-11 13:43:24,819 INFO  TESTNG PASSED: "Surefire test" - org.apache.brooklyn.entity.java.JavaOptsTest.testBasicJmxFromConfig()
finished in 339 ms
2016-03-11 13:43:24,820 INFO  TESTNG INVOKING CONFIGURATION: "Surefire test" - @AfterMethod
org.apache.brooklyn.entity.java.JavaOptsTest.tearDown()
2016-03-11 13:43:24,830 INFO  Stopping TestingNoSensorsVanillaJavaAppImpl{id=akoPVvNP} in
[SshMachineLocation[SshMachineLocation:Xp54:jenkins@localhost/127.0.0.1:22(id=Xp5411wU)]]
2016-03-11 13:43:24,843 INFO  TESTNG PASSED CONFIGURATION: "Surefire test" - @AfterMethod
org.apache.brooklyn.entity.java.JavaOptsTest.tearDown() finished in 24 ms
2016-03-11 13:43:24,844 INFO  TESTNG INVOKING CONFIGURATION: "Surefire test" - @BeforeMethod
org.apache.brooklyn.entity.java.JavaOptsTest.setUp()
2016-03-11 13:43:24,866 INFO  TESTNG PASSED CONFIGURATION: "Surefire test" - @BeforeMethod
org.apache.brooklyn.entity.java.JavaOptsTest.setUp() finished in 22 ms
2016-03-11 13:43:24,866 INFO  TESTNG INVOKING: "Surefire test" - org.apache.brooklyn.entity.java.JavaOptsTest.testBasicJmxFromFlag()
2016-03-11 13:43:24,901 INFO  No Camp-YAML parser registered for parsing catalog item DSL;
skipping DSL-parsing
2016-03-11 13:43:24,907 INFO  Starting TestingNoSensorsVanillaJavaAppImpl{id=bArtXXQA} on
machine SshMachineLocation[SshMachineLocation:GKGF:null@localhost/127.0.0.1:22(id=GKGF6PNK)]
2016-03-11 13:43:25,132 INFO  TESTNG PASSED: "Surefire test" - org.apache.brooklyn.entity.java.JavaOptsTest.testBasicJmxFromFlag()
finished in 265 ms
2016-03-11 13:43:25,132 INFO  TESTNG INVOKING CONFIGURATION: "Surefire test" - @AfterMethod
org.apache.brooklyn.entity.java.JavaOptsTest.tearDown()
2016-03-11 13:43:25,135 WARN  Setting Application[wnHjH7No] on-fire due to problems when expected
running, up=false, not-up-indicators: {service.state=Application stopping}
2016-03-11 13:43:25,136 INFO  Stopping TestingNoSensorsVanillaJavaAppImpl{id=bArtXXQA} in
[SshMachineLocation[SshMachineLocation:GKGF:jenkins@localhost/127.0.0.1:22(id=GKGF6PNK)]]
2016-03-11 13:43:25,159 INFO  TESTNG PASSED CONFIGURATION: "Surefire test" - @AfterMethod
org.apache.brooklyn.entity.java.JavaOptsTest.tearDown() finished in 27 ms
2016-03-11 13:43:25,160 INFO  TESTNG INVOKING CONFIGURATION: "Surefire test" - @BeforeMethod
org.apache.brooklyn.entity.java.JavaOptsTest.setUp()
2016-03-11 13:43:25,184 INFO  TESTNG PASSED CONFIGURATION: "Surefire test" - @BeforeMethod
org.apache.brooklyn.entity.java.JavaOptsTest.setUp() finished in 24 ms
2016-03-11 13:43:25,185 INFO  TESTNG INVOKING: "Surefire test" - org.apache.brooklyn.entity.java.JavaOptsTest.testPassesJavaArgs()
2016-03-11 13:43:25,216 INFO  No Camp-YAML parser registered for parsing catalog item DSL;
skipping DSL-parsing
2016-03-11 13:43:25,227 INFO  Starting VanillaJavaAppImpl{id=XOvCwhEW} on machine SshMachineLocation[SshMachineLocation:Ialq:null@localhost/127.0.0.1:22(id=Ialq6d2A)]
2016-03-11 13:43:25,470 INFO  TESTNG PASSED: "Surefire test" - org.apache.brooklyn.entity.java.JavaOptsTest.testPassesJavaArgs()
finished in 285 ms
2016-03-11 13:43:25,471 INFO  TESTNG INVOKING CONFIGURATION: "Surefire test" - @AfterMethod
org.apache.brooklyn.entity.java.JavaOptsTest.tearDown()
2016-03-11 13:43:25,475 WARN  Setting Application[LMypwy9R] on-fire due to problems when expected
running, up=false, not-up-indicators: {service.state=Application stopping}
2016-03-11 13:43:25,476 INFO  Stopping VanillaJavaAppImpl{id=XOvCwhEW} in [SshMachineLocation[SshMachineLocation:Ialq:jenkins@localhost/127.0.0.1:22(id=Ialq6d2A)]]
2016-03-11 13:43:25,506 INFO  TESTNG PASSED CONFIGURATION: "Surefire test" - @AfterMethod
org.apache.brooklyn.entity.java.JavaOptsTest.tearDown() finished in 35 ms
2016-03-11 13:43:25,506 INFO  TESTNG INVOKING CONFIGURATION: "Surefire test" - @BeforeMethod
org.apache.brooklyn.entity.java.JavaOptsTest.setUp()
2016-03-11 13:43:25,529 INFO  TESTNG PASSED CONFIGURATION: "Surefire test" - @BeforeMethod
org.apache.brooklyn.entity.java.JavaOptsTest.setUp() finished in 23 ms
2016-03-11 13:43:25,530 INFO  TESTNG INVOKING: "Surefire test" - org.apache.brooklyn.entity.java.JavaOptsTest.testPassesJavaOpts()
2016-03-11 13:43:25,565 INFO  No Camp-YAML parser registered for parsing catalog item DSL;
skipping DSL-parsing
2016-03-11 13:43:25,571 INFO  Starting VanillaJavaAppImpl{id=GUfLmnDJ} on machine SshMachineLocation[SshMachineLocation:ahep:null@localhost/127.0.0.1:22(id=ahepwEl3)]
2016-03-11 13:43:25,809 INFO  TESTNG PASSED: "Surefire test" - org.apache.brooklyn.entity.java.JavaOptsTest.testPassesJavaOpts()
finished in 279 ms
2016-03-11 13:43:25,810 INFO  TESTNG INVOKING CONFIGURATION: "Surefire test" - @AfterMethod
org.apache.brooklyn.entity.java.JavaOptsTest.tearDown()
2016-03-11 13:43:25,814 INFO  Stopping VanillaJavaAppImpl{id=GUfLmnDJ} in [SshMachineLocation[SshMachineLocation:ahep:jenkins@localhost/127.0.0.1:22(id=ahepwEl3)]]
2016-03-11 13:43:25,827 INFO  TESTNG PASSED CONFIGURATION: "Surefire test" - @AfterMethod
org.apache.brooklyn.entity.java.JavaOptsTest.tearDown() finished in 18 ms
2016-03-11 13:43:25,827 INFO  TESTNG INVOKING CONFIGURATION: "Surefire test" - @BeforeMethod
org.apache.brooklyn.entity.java.JavaOptsTest.setUp()
2016-03-11 13:43:25,888 INFO  TESTNG PASSED CONFIGURATION: "Surefire test" - @BeforeMethod
org.apache.brooklyn.entity.java.JavaOptsTest.setUp() finished in 61 ms
2016-03-11 13:43:25,888 INFO  TESTNG INVOKING: "Surefire test" - org.apache.brooklyn.entity.java.JavaOptsTest.testPassesJavaOptsObeyingMutualExclusions()
2016-03-11 13:43:25,918 INFO  No Camp-YAML parser registered for parsing catalog item DSL;
skipping DSL-parsing
2016-03-11 13:43:25,923 INFO  Starting TestingJavaOptsVanillaJavaAppImpl{id=Dv6VMkAB} on machine
SshMachineLocation[SshMachineLocation:wcLW:null@localhost/127.0.0.1:22(id=wcLWpowZ)]
2016-03-11 13:43:26,254 INFO  TESTNG PASSED: "Surefire test" - org.apache.brooklyn.entity.java.JavaOptsTest.testPassesJavaOptsObeyingMutualExclusions()
finished in 366 ms
2016-03-11 13:43:26,254 INFO  TESTNG INVOKING CONFIGURATION: "Surefire test" - @AfterMethod
org.apache.brooklyn.entity.java.JavaOptsTest.tearDown()
2016-03-11 13:43:26,258 INFO  Stopping TestingJavaOptsVanillaJavaAppImpl{id=Dv6VMkAB} in [SshMachineLocation[SshMachineLocation:wcLW:jenkins@localhost/127.0.0.1:22(id=wcLWpowZ)]]
2016-03-11 13:43:26,285 INFO  TESTNG PASSED CONFIGURATION: "Surefire test" - @AfterMethod
org.apache.brooklyn.entity.java.JavaOptsTest.tearDown() finished in 31 ms
2016-03-11 13:43:26,286 INFO  TESTNG INVOKING CONFIGURATION: "Surefire test" - @BeforeMethod
org.apache.brooklyn.entity.java.JavaOptsTest.setUp()
2016-03-11 13:43:26,305 INFO  TESTNG PASSED CONFIGURATION: "Surefire test" - @BeforeMethod
org.apache.brooklyn.entity.java.JavaOptsTest.setUp() finished in 19 ms
2016-03-11 13:43:26,305 INFO  TESTNG INVOKING: "Surefire test" - org.apache.brooklyn.entity.java.JavaOptsTest.testPassesJavaOptsOverridingDefaults()
2016-03-11 13:43:26,336 INFO  No Camp-YAML parser registered for parsing catalog item DSL;
skipping DSL-parsing
2016-03-11 13:43:26,341 INFO  Starting VanillaJavaAppImpl{id=Se7d6ZuX} on machine SshMachineLocation[SshMachineLocation:UqVl:null@localhost/127.0.0.1:22(id=UqVl8z37)]
2016-03-11 13:43:26,577 INFO  TESTNG PASSED: "Surefire test" - org.apache.brooklyn.entity.java.JavaOptsTest.testPassesJavaOptsOverridingDefaults()
finished in 272 ms
2016-03-11 13:43:26,578 INFO  TESTNG INVOKING CONFIGURATION: "Surefire test" - @AfterMethod
org.apache.brooklyn.entity.java.JavaOptsTest.tearDown()
2016-03-11 13:43:26,581 INFO  Stopping VanillaJavaAppImpl{id=Se7d6ZuX} in [SshMachineLocation[SshMachineLocation:UqVl:jenkins@localhost/127.0.0.1:22(id=UqVl8z37)]]
2016-03-11 13:43:26,611 INFO  TESTNG PASSED CONFIGURATION: "Surefire test" - @AfterMethod
org.apache.brooklyn.entity.java.JavaOptsTest.tearDown() finished in 34 ms
2016-03-11 13:43:26,613 INFO  TESTNG INVOKING CONFIGURATION: "Surefire test" - @BeforeMethod
org.apache.brooklyn.entity.java.JavaOptsTest.setUp()
2016-03-11 13:43:26,639 INFO  TESTNG PASSED CONFIGURATION: "Surefire test" - @BeforeMethod
org.apache.brooklyn.entity.java.JavaOptsTest.setUp() finished in 26 ms
2016-03-11 13:43:26,639 INFO  TESTNG INVOKING: "Surefire test" - org.apache.brooklyn.entity.java.JavaOptsTest.testPassesJavaSysProps()
2016-03-11 13:43:26,688 INFO  No Camp-YAML parser registered for parsing catalog item DSL;
skipping DSL-parsing
2016-03-11 13:43:26,695 INFO  Starting VanillaJavaAppImpl{id=BX7pzId8} on machine SshMachineLocation[SshMachineLocation:GYkB:null@localhost/127.0.0.1:22(id=GYkBdbmb)]
2016-03-11 13:43:26,964 INFO  TESTNG PASSED: "Surefire test" - org.apache.brooklyn.entity.java.JavaOptsTest.testPassesJavaSysProps()
finished in 325 ms
2016-03-11 13:43:26,965 INFO  TESTNG INVOKING CONFIGURATION: "Surefire test" - @AfterMethod
org.apache.brooklyn.entity.java.JavaOptsTest.tearDown()
2016-03-11 13:43:26,966 WARN  Setting Application[TugexaVm] on-fire due to problems when expected
running, up=false, not-up-indicators: {service.state=Application stopping}
2016-03-11 13:43:26,968 INFO  Stopping VanillaJavaAppImpl{id=BX7pzId8} in [SshMachineLocation[SshMachineLocation:GYkB:jenkins@localhost/127.0.0.1:22(id=GYkBdbmb)]]
2016-03-11 13:43:26,993 INFO  TESTNG PASSED CONFIGURATION: "Surefire test" - @AfterMethod
org.apache.brooklyn.entity.java.JavaOptsTest.tearDown() finished in 29 ms
2016-03-11 13:43:26,994 INFO  TESTNG INVOKING CONFIGURATION: "Surefire test" - @BeforeMethod
org.apache.brooklyn.entity.java.JavaOptsTest.setUp()
2016-03-11 13:43:27,013 INFO  TESTNG PASSED CONFIGURATION: "Surefire test" - @BeforeMethod
org.apache.brooklyn.entity.java.JavaOptsTest.setUp() finished in 20 ms
2016-03-11 13:43:27,013 INFO  TESTNG INVOKING: "Surefire test" - org.apache.brooklyn.entity.java.JavaOptsTest.testSecureJmxConfigFromDefault()
2016-03-11 13:43:27,049 INFO  No Camp-YAML parser registered for parsing catalog item DSL;
skipping DSL-parsing
2016-03-11 13:43:27,056 INFO  Starting TestingNoSensorsVanillaJavaAppImpl{id=qfZ9BeXH} on
machine SshMachineLocation[SshMachineLocation:J7AG:null@localhost/127.0.0.1:22(id=J7AGCn9F)]
2016-03-11 13:43:27,849 INFO  TESTNG PASSED: "Surefire test" - org.apache.brooklyn.entity.java.JavaOptsTest.testSecureJmxConfigFromDefault()
finished in 836 ms
2016-03-11 13:43:27,850 INFO  TESTNG INVOKING CONFIGURATION: "Surefire test" - @AfterMethod
org.apache.brooklyn.entity.java.JavaOptsTest.tearDown()
2016-03-11 13:43:27,852 INFO  Stopping TestingNoSensorsVanillaJavaAppImpl{id=qfZ9BeXH} in
[SshMachineLocation[SshMachineLocation:J7AG:jenkins@localhost/127.0.0.1:22(id=J7AGCn9F)]]
2016-03-11 13:43:27,877 INFO  TESTNG PASSED CONFIGURATION: "Surefire test" - @AfterMethod
org.apache.brooklyn.entity.java.JavaOptsTest.tearDown() finished in 27 ms
2016-03-11 13:43:27,878 INFO  TESTNG INVOKING CONFIGURATION: "Surefire test" - @BeforeMethod
org.apache.brooklyn.entity.java.JavaOptsTest.setUp()
2016-03-11 13:43:27,906 INFO  TESTNG PASSED CONFIGURATION: "Surefire test" - @BeforeMethod
org.apache.brooklyn.entity.java.JavaOptsTest.setUp() finished in 29 ms
2016-03-11 13:43:27,907 INFO  TESTNG INVOKING: "Surefire test" - org.apache.brooklyn.entity.java.JavaOptsTest.testSimpleLaunchesJavaProcess()
2016-03-11 13:43:27,940 INFO  No Camp-YAML parser registered for parsing catalog item DSL;
skipping DSL-parsing
2016-03-11 13:43:27,947 INFO  Starting VanillaJavaAppImpl{id=T0ZVnyKa} on machine SshMachineLocation[SshMachineLocation:VZ1x:null@localhost/127.0.0.1:22(id=VZ1xmigC)]
SUREFIRE-859: [GC 253961K->54724K(756736K), 0.0563950 secs]
2016-03-11 13:43:28,230 INFO  TESTNG PASSED: "Surefire test" - org.apache.brooklyn.entity.java.JavaOptsTest.testSimpleLaunchesJavaProcess()
finished in 323 ms
2016-03-11 13:43:28,231 INFO  TESTNG INVOKING CONFIGURATION: "Surefire test" - @AfterMethod
org.apache.brooklyn.entity.java.JavaOptsTest.tearDown()
2016-03-11 13:43:28,234 INFO  Stopping VanillaJavaAppImpl{id=T0ZVnyKa} in [SshMachineLocation[SshMachineLocation:VZ1x:jenkins@localhost/127.0.0.1:22(id=VZ1xmigC)]]
2016-03-11 13:43:28,248 INFO  TESTNG PASSED CONFIGURATION: "Surefire test" - @AfterMethod
org.apache.brooklyn.entity.java.JavaOptsTest.tearDown() finished in 18 ms
2016-03-11 13:43:28,307 INFO  TESTNG 
===============================================
    Surefire test
    Tests run: 151, Failures: 1, Skips: 0
===============================================
2016-03-11 13:43:28,308 INFO  BrooklynLeakListener.onFinish attempting to terminate all extant
ManagementContexts: name=Surefire test; includedGroups=[]; excludedGroups=[Integration, Acceptance,
Live, Broken, WIP]; suiteName=Surefire suite; outDir=<https://builds.apache.org/job/brooklyn-server-master/ws/software/base/target/surefire-reports/Surefire>
suite: no org.apache.brooklyn.core.management.internal.LocalManagementContext available, so
skipped
Tests run: 151, Failures: 1, Errors: 0, Skipped: 0, Time elapsed: 202.311 sec <<<
FAILURE! - in TestSuite
testPersistenceVolumeFastNoTrigger(org.apache.brooklyn.entity.software.base.SoftwareProcessPersisterInMemorySizeIntegrationTest)
 Time elapsed: 0.302 sec  <<< FAILURE!
java.lang.AssertionError: should have written less than 150k, wrote 153397 expected [true]
but found [false]
	at org.testng.Assert.fail(Assert.java:94)
	at org.testng.Assert.failNotEquals(Assert.java:494)
	at org.testng.Assert.assertTrue(Assert.java:42)
	at org.apache.brooklyn.core.mgmt.persist.BrooklynMementoPersisterInMemorySizeIntegrationTest.doTestPersistenceVolume(BrooklynMementoPersisterInMemorySizeIntegrationTest.java:82)
	at org.apache.brooklyn.core.mgmt.persist.BrooklynMementoPersisterInMemorySizeIntegrationTest.testPersistenceVolumeFastNoTrigger(BrooklynMementoPersisterInMemorySizeIntegrationTest.java:67)
	at sun.reflect.NativeMethodAccessorImpl.invoke0(Native Method)
	at sun.reflect.NativeMethodAccessorImpl.invoke(NativeMethodAccessorImpl.java:57)
	at sun.reflect.DelegatingMethodAccessorImpl.invoke(DelegatingMethodAccessorImpl.java:43)
	at java.lang.reflect.Method.invoke(Method.java:606)
	at org.testng.internal.MethodInvocationHelper.invokeMethod(MethodInvocationHelper.java:84)
	at org.testng.internal.Invoker.invokeMethod(Invoker.java:714)
	at org.testng.internal.Invoker.invokeTestMethod(Invoker.java:901)
	at org.testng.internal.Invoker.invokeTestMethods(Invoker.java:1231)
	at org.testng.internal.TestMethodWorker.invokeTestMethods(TestMethodWorker.java:127)
	at org.testng.internal.TestMethodWorker.run(TestMethodWorker.java:111)
	at org.testng.TestRunner.privateRun(TestRunner.java:767)
	at org.testng.TestRunner.run(TestRunner.java:617)
	at org.testng.SuiteRunner.runTest(SuiteRunner.java:348)
	at org.testng.SuiteRunner.runSequentially(SuiteRunner.java:343)
	at org.testng.SuiteRunner.privateRun(SuiteRunner.java:305)
	at org.testng.SuiteRunner.run(SuiteRunner.java:254)
	at org.testng.SuiteRunnerWorker.runSuite(SuiteRunnerWorker.java:52)
	at org.testng.SuiteRunnerWorker.run(SuiteRunnerWorker.java:86)
	at org.testng.TestNG.runSuitesSequentially(TestNG.java:1224)
	at org.testng.TestNG.runSuitesLocally(TestNG.java:1149)
	at org.testng.TestNG.run(TestNG.java:1057)
	at org.apache.maven.surefire.testng.TestNGExecutor.run(TestNGExecutor.java:115)
	at org.apache.maven.surefire.testng.TestNGDirectoryTestSuite.executeMulti(TestNGDirectoryTestSuite.java:205)
	at org.apache.maven.surefire.testng.TestNGDirectoryTestSuite.execute(TestNGDirectoryTestSuite.java:108)
	at org.apache.maven.surefire.testng.TestNGProvider.invoke(TestNGProvider.java:111)
	at org.apache.maven.surefire.booter.ForkedBooter.invokeProviderInSameClassLoader(ForkedBooter.java:203)
	at org.apache.maven.surefire.booter.ForkedBooter.runSuitesInProcess(ForkedBooter.java:155)
	at org.apache.maven.surefire.booter.ForkedBooter.main(ForkedBooter.java:103)


Results :

Failed tests: 
  SoftwareProcessPersisterInMemorySizeIntegrationTest>BrooklynMementoPersisterInMemorySizeIntegrationTest.testPersistenceVolumeFastNoTrigger:67->BrooklynMementoPersisterInMemorySizeIntegrationTest.doTestPersistenceVolume:82
should have written less than 150k, wrote 153397 expected [true] but found [false]

Tests run: 151, Failures: 1, Errors: 0, Skipped: 0

[JENKINS] Recording test results
[JENKINS] Archiving disabled
[JENKINS] Archiving disabled
[JENKINS] Archiving disabled
[JENKINS] Archiving disabled
[JENKINS] Archiving disabled
[JENKINS] Archiving disabled
[JENKINS] Archiving disabled
[JENKINS] Archiving disabled
[JENKINS] Archiving disabled
[JENKINS] Archiving disabled
[JENKINS] Archiving disabled
[JENKINS] Archiving disabled
[JENKINS] Archiving disabled
[JENKINS] Archiving disabled
[JENKINS] Archiving disabled
[JENKINS] Archiving disabled
[JENKINS] Archiving disabled
[JENKINS] Archiving disabled
[JENKINS] Archiving disabled
[JENKINS] Archiving disabled
[JENKINS] Archiving disabled
[JENKINS] Archiving disabled
[JENKINS] Archiving disabled
[JENKINS] Archiving disabled
[JENKINS] Archiving disabled
[JENKINS] Archiving disabled
[JENKINS] Archiving disabled
[JENKINS] Archiving disabled
[JENKINS] Archiving disabled
[JENKINS] Archiving disabled
[JENKINS] Archiving disabled
[JENKINS] Archiving disabled
[JENKINS] Archiving disabled
[JENKINS] Archiving disabled
[JENKINS] Archiving disabled
[JENKINS] Archiving disabled
[JENKINS] Archiving disabled
[JENKINS] Archiving disabled[INFO] ------------------------------------------------------------------------
[INFO] Reactor Summary:
[INFO] 
[INFO] Brooklyn Server Root .............................. SUCCESS [  4.385 s]
[INFO] Brooklyn Parent Project ........................... SUCCESS [  7.746 s]
[INFO] Brooklyn Test Support Utilities ................... SUCCESS [ 10.717 s]
[INFO] Brooklyn Logback Includable Configuration ......... SUCCESS [  2.577 s]
[INFO] Brooklyn Common Utilities ......................... SUCCESS [ 33.370 s]
[INFO] Brooklyn API ...................................... SUCCESS [  4.590 s]
[INFO] CAMP Server Parent Project ........................ SUCCESS [  0.925 s]
[INFO] CAMP Base ......................................... SUCCESS [  6.408 s]
[INFO] Brooklyn Test Support ............................. SUCCESS [  3.541 s]
[INFO] Brooklyn REST Swagger Apidoc Utilities ............ SUCCESS [ 25.385 s]
[INFO] Brooklyn Logback Configuration .................... SUCCESS [  2.090 s]
[INFO] CAMP Server ....................................... SUCCESS [ 10.032 s]
[INFO] CAMP Server Jersey ................................ SUCCESS [ 12.354 s]
[INFO] Brooklyn Felix Runtime ............................ SUCCESS [  6.562 s]
[INFO] Brooklyn Groovy Utilities ......................... SUCCESS [  3.581 s]
[INFO] Brooklyn Core ..................................... SUCCESS [05:14 min]
[INFO] Brooklyn Policies ................................. SUCCESS [01:56 min]
[INFO] Brooklyn WinRM Software Entities .................. SUCCESS [ 15.876 s]
[INFO] Brooklyn Secure JMXMP Agent ....................... SUCCESS [ 17.198 s]
[INFO] Brooklyn JMX RMI Agent ............................ SUCCESS [  2.648 s]
[INFO] Brooklyn Jclouds Location Targets ................. SUCCESS [ 31.120 s]
[INFO] Brooklyn Software Base ............................ FAILURE [03:34 min]
[INFO] Brooklyn CAMP REST API ............................ SKIPPED
[INFO] Brooklyn Hazelcast Storage ........................ SKIPPED
[INFO] Brooklyn REST API ................................. SKIPPED
[INFO] Brooklyn REST Resources ........................... SKIPPED
[INFO] Brooklyn REST Server .............................. SKIPPED
[INFO] Brooklyn Launcher ................................. SKIPPED
[INFO] Brooklyn Command Line Interface ................... SKIPPED
[INFO] Brooklyn REST Client .............................. SKIPPED
[INFO] Brooklyn REST Server with Jersey dependencies ..... SKIPPED
[INFO] Brooklyn Test Framework ........................... SKIPPED
[INFO] Brooklyn Karaf .................................... SKIPPED
[INFO] Brooklyn Karaf Features ........................... SKIPPED
[INFO] Brooklyn Karaf Distro ............................. SKIPPED
[INFO] Brooklyn Karaf Shell Commands ..................... SKIPPED
[INFO] Brooklyn Karaf pax-exam itest ..................... SKIPPED
[INFO] ------------------------------------------------------------------------
[INFO] BUILD FAILURE
[INFO] ------------------------------------------------------------------------
[INFO] Total time: 14:32 min
[INFO] Finished at: 2016-03-11T13:43:36+00:00

[INFO] Final Memory: 130M/651M
[INFO] ------------------------------------------------------------------------
Waiting for Jenkins to finish collecting data[ERROR] Failed to execute goal org.apache.maven.plugins:maven-surefire-plugin:2.18.1:test
(default-test) on project brooklyn-software-base: There are test failures.
[ERROR] 
[ERROR] Please refer to <https://builds.apache.org/job/brooklyn-server-master/ws/software/base/target/surefire-reports>
for the individual test results.
[ERROR] -> [Help 1]
[ERROR] 
[ERROR] To see the full stack trace of the errors, re-run Maven with the -e switch.
[ERROR] Re-run Maven using the -X switch to enable full debug logging.
[ERROR] 
[ERROR] For more information about the errors and possible solutions, please read the following
articles:
[ERROR] [Help 1] http://cwiki.apache.org/confluence/display/MAVEN/MojoFailureException
[ERROR] 
[ERROR] After correcting the problems, you can resume the build with the command
[ERROR]   mvn <goals> -rf :brooklyn-software-base

channel stopped

Mime
View raw message