brooklyn-dev mailing list archives

Site index · List index
Message view « Date » · « Thread »
Top « Date » · « Thread »
From Apache Jenkins Server <jenk...@builds.apache.org>
Subject Build failed in Jenkins: brooklyn-client-master #2
Date Mon, 14 Mar 2016 10:11:47 GMT
See <https://builds.apache.org/job/brooklyn-client-master/2/>

------------------------------------------
Started by user svet
[EnvInject] - Loading node environment variables.
Building remotely on ubuntu-us1 (Ubuntu ubuntu ubuntu-us golang-ppa) in workspace <https://builds.apache.org/job/brooklyn-client-master/ws/>
Cloning the remote Git repository
Cloning repository https://git-wip-us.apache.org/repos/asf/brooklyn-client.git
 > git init <https://builds.apache.org/job/brooklyn-client-master/ws/> # timeout=10
Fetching upstream changes from https://git-wip-us.apache.org/repos/asf/brooklyn-client.git
 > git --version # timeout=10
 > git -c core.askpass=true fetch --tags --progress https://git-wip-us.apache.org/repos/asf/brooklyn-client.git
+refs/heads/*:refs/remotes/origin/*
 > git config remote.origin.url https://git-wip-us.apache.org/repos/asf/brooklyn-client.git
# timeout=10
 > git config --add remote.origin.fetch +refs/heads/*:refs/remotes/origin/* # timeout=10
 > git config remote.origin.url https://git-wip-us.apache.org/repos/asf/brooklyn-client.git
# timeout=10
Fetching upstream changes from https://git-wip-us.apache.org/repos/asf/brooklyn-client.git
 > git -c core.askpass=true fetch --tags --progress https://git-wip-us.apache.org/repos/asf/brooklyn-client.git
+refs/heads/*:refs/remotes/origin/*
 > git rev-parse origin/master^{commit} # timeout=10
Checking out Revision 02b1fc6ad0556c301f4ce2736a2c8b481d26e319 (origin/master)
 > git config core.sparsecheckout # timeout=10
 > git checkout -f 02b1fc6ad0556c301f4ce2736a2c8b481d26e319
 > git rev-list 02b1fc6ad0556c301f4ce2736a2c8b481d26e319 # timeout=10
Parsing POMs
Established TCP socket on 48967
maven32-agent.jar already up to date
maven32-interceptor.jar already up to date
maven3-interceptor-commons.jar already up to date
[brooklyn-client-master] $ /usr/lib/jvm/java-7-openjdk-amd64//bin/java -Xmx1024m -Xms512m
-XX:MaxPermSize=512m -cp /home/jenkins/jenkins-slave/maven32-agent.jar:/home/jenkins/jenkins-slave/tools/hudson.tasks.Maven_MavenInstallation/maven-3.2.1/boot/plexus-classworlds-2.5.1.jar:/home/jenkins/jenkins-slave/tools/hudson.tasks.Maven_MavenInstallation/maven-3.2.1/conf/logging
jenkins.maven3.agent.Maven32Main /home/jenkins/jenkins-slave/tools/hudson.tasks.Maven_MavenInstallation/maven-3.2.1
/home/jenkins/jenkins-slave/slave.jar /home/jenkins/jenkins-slave/maven32-interceptor.jar
/home/jenkins/jenkins-slave/maven3-interceptor-commons.jar 48967
<===[JENKINS REMOTING CAPACITY]===>   channel started
Executing Maven:  -B -f <https://builds.apache.org/job/brooklyn-client-master/ws/pom.xml>
-Dmaven.repo.local=/home/jenkins/jenkins-slave/maven-repositories/0 clean install
[INFO] Scanning for projects...
[INFO] 
[INFO] Using the builder org.apache.maven.lifecycle.internal.builder.singlethreaded.SingleThreadedBuilder
with a thread count of 1
[INFO]                                                                         
[INFO] ------------------------------------------------------------------------
[INFO] Building Brooklyn Client Command Line Interface 0.9.0-SNAPSHOT
[INFO] ------------------------------------------------------------------------
[INFO] 
[INFO] --- maven-clean-plugin:2.5:clean (default-clean) @ brooklyn-client-cli ---
[INFO] 
[INFO] --- maven-antrun-plugin:1.8:run (process-build-all) @ brooklyn-client-cli ---
[INFO] Executing tasks

main:

all:
     [exec] Starting build.sh (brooklyn-client go build script)
     [exec] <https://builds.apache.org/job/brooklyn-client-master/ws/release/build.sh>:
153: <https://builds.apache.org/job/brooklyn-client-master/ws/release/build.sh>: 6:
not found
     [exec] 
     [exec] ERROR: Incompatible Go language version: go1.6
     [exec] 
     [exec] Go version 1.6 or higher is required to build the brooklyn-client CLI.
     [exec] See golang.org for more information, or run maven with '-Dno-go-client' to skip.
     [exec] 
[INFO] ------------------------------------------------------------------------
[INFO] BUILD FAILURE
[INFO] ------------------------------------------------------------------------
[INFO] Total time: 7.368 s
[INFO] Finished at: 2016-03-14T10:11:47+00:00
[INFO] Final Memory: 14M/491M
[INFO] ------------------------------------------------------------------------
[ERROR] Failed to execute goal org.apache.maven.plugins:maven-antrun-plugin:1.8:run (process-build-all)
on project brooklyn-client-cli: An Ant BuildException has occured: The following error occurred
while executing this line:
[ERROR] <https://builds.apache.org/job/brooklyn-client-master/ws/build.xml>:23: exec
returned: 1
[ERROR] around Ant part ...<ant target="all"/>... @ 4:22 in <https://builds.apache.org/job/brooklyn-client-master/ws/target/antrun/build-main.xml>
[ERROR] -> [Help 1]
[ERROR] 
[ERROR] To see the full stack trace of the errors, re-run Maven with the -e switch.
[ERROR] Re-run Maven using the -X switch to enable full debug logging.
[ERROR] 
[ERROR] For more information about the errors and possible solutions, please read the following
articles:
[ERROR] [Help 1] http://cwiki.apache.org/confluence/display/MAVEN/MojoExecutionException
[JENKINS] Archiving <https://builds.apache.org/job/brooklyn-client-master/ws/pom.xml>
to org.apache.brooklyn/brooklyn-client-cli/0.9.0-SNAPSHOT/brooklyn-client-cli-0.9.0-SNAPSHOT.pom
No prior successful build to compare, so performing full copy of artifacts
channel stopped

Mime
View raw message