brooklyn-dev mailing list archives

Site index · List index
Message view « Date » · « Thread »
Top « Date » · « Thread »
From Apache Jenkins Server <>
Subject Build failed in Jenkins: brooklyn-client-master #3
Date Mon, 14 Mar 2016 13:53:46 GMT
See <>


[geoff.macartney] Ensure explicit use of bash

[geoff.macartney] Fix typo

[geoff.macartney] Add recursive listing

Started by an SCM change
[EnvInject] - Loading node environment variables.
Building remotely on H11 (docker Ubuntu ubuntu yahoo-not-h2) in workspace <>
Cloning the remote Git repository
Cloning repository
 > git init <> # timeout=10
Fetching upstream changes from
 > git --version # timeout=10
 > git -c core.askpass=true fetch --tags --progress
 > git config remote.origin.url
# timeout=10
 > git config --add remote.origin.fetch +refs/heads/*:refs/remotes/origin/* # timeout=10
 > git config remote.origin.url
# timeout=10
Fetching upstream changes from
 > git -c core.askpass=true fetch --tags --progress
 > git rev-parse origin/master^{commit} # timeout=10
Checking out Revision ad86b5851323e99de22378c6229061cb541ba985 (origin/master)
 > git config core.sparsecheckout # timeout=10
 > git checkout -f ad86b5851323e99de22378c6229061cb541ba985
 > git rev-list 02b1fc6ad0556c301f4ce2736a2c8b481d26e319 # timeout=10
Parsing POMs
Established TCP socket on 55962
maven32-agent.jar already up to date
maven32-interceptor.jar already up to date
maven3-interceptor-commons.jar already up to date
[brooklyn-client-master] $ /usr/lib/jvm/java-7-openjdk-amd64//bin/java -Xmx1024m -Xms512m
-XX:MaxPermSize=512m -cp /home/jenkins/jenkins-slave/maven32-agent.jar:/home/jenkins/jenkins-slave/tools/hudson.tasks.Maven_MavenInstallation/maven-3.2.1/boot/plexus-classworlds-2.5.1.jar:/home/jenkins/jenkins-slave/tools/hudson.tasks.Maven_MavenInstallation/maven-3.2.1/conf/logging
jenkins.maven3.agent.Maven32Main /home/jenkins/jenkins-slave/tools/hudson.tasks.Maven_MavenInstallation/maven-3.2.1
/home/jenkins/jenkins-slave/slave.jar /home/jenkins/jenkins-slave/maven32-interceptor.jar
/home/jenkins/jenkins-slave/maven3-interceptor-commons.jar 55962
<===[JENKINS REMOTING CAPACITY]===>   channel started
Executing Maven:  -B -f <>
-Dmaven.repo.local=/home/jenkins/jenkins-slave/maven-repositories/1 clean install
[INFO] Scanning for projects...
[INFO] Using the builder org.apache.maven.lifecycle.internal.builder.singlethreaded.SingleThreadedBuilder
with a thread count of 1
[INFO] ------------------------------------------------------------------------
[INFO] Building Brooklyn Client Command Line Interface 0.9.0-SNAPSHOT
[INFO] ------------------------------------------------------------------------
[INFO] --- maven-clean-plugin:2.5:clean (default-clean) @ brooklyn-client-cli ---
[INFO] --- maven-antrun-plugin:1.8:run (process-build-all) @ brooklyn-client-cli ---
[INFO] Executing tasks


     [exec] Starting (brooklyn-client go build script)
     [exec] ERROR: Incompatible Go language version: go1.2.1
     [exec] Go version 1.6 or higher is required to build the brooklyn-client CLI.
     [exec] See for more information, or run maven with '-Dno-go-client' to skip.
[INFO] ------------------------------------------------------------------------
[INFO] ------------------------------------------------------------------------
[INFO] Total time: 3.461 s
[INFO] Finished at: 2016-03-14T13:53:47+00:00
[INFO] Final Memory: 14M/491M
[INFO] ------------------------------------------------------------------------
[ERROR] Failed to execute goal org.apache.maven.plugins:maven-antrun-plugin:1.8:run (process-build-all)
on project brooklyn-client-cli: An Ant BuildException has occured: The following error occurred
while executing this line:
[ERROR] <>:23: exec
returned: 1
[ERROR] around Ant part ...<ant target="all"/>... @ 4:22 in <>
[ERROR] -> [Help 1]
[ERROR] To see the full stack trace of the errors, re-run Maven with the -e switch.
[ERROR] Re-run Maven using the -X switch to enable full debug logging.
[ERROR] For more information about the errors and possible solutions, please read the following
[ERROR] [Help 1]
[JENKINS] Archiving <>
to org.apache.brooklyn/brooklyn-client-cli/0.9.0-SNAPSHOT/brooklyn-client-cli-0.9.0-SNAPSHOT.pom
No prior successful build to compare, so performing full copy of artifacts
channel stopped

View raw message