brooklyn-dev mailing list archives

Site index · List index
Message view « Date » · « Thread »
Top « Date » · « Thread »
From Apache Jenkins Server <jenk...@builds.apache.org>
Subject Build failed in Jenkins: incubator-brooklyn-master-windows #431
Date Thu, 10 Mar 2016 01:44:38 GMT
See <https://builds.apache.org/job/incubator-brooklyn-master-windows/431/>

------------------------------------------
[...truncated 2296 lines...]
[INFO] [INFO] Final Memory: 11M/243M
[INFO] [INFO] ------------------------------------------------------------------------
[INFO] [ERROR] Failed to execute goal on project brooklyn-sample: Could not resolve dependencies
for project com.acme.sample:brooklyn-sample:jar:0.1.0-SNAPSHOT: Failed to collect dependencies
for [org.apache.brooklyn:brooklyn-all:jar:0.9.0-SNAPSHOT (compile), org.apache.brooklyn:brooklyn-test-support:jar:0.9.0-SNAPSHOT
(test), org.apache.brooklyn:brooklyn-logback-xml:jar:0.9.0-SNAPSHOT (compile), org.apache.brooklyn:brooklyn-utils-test-support:jar:0.9.0-SNAPSHOT
(test)]: Failed to read artifact descriptor for org.osgi:org.osgi.core:jar:${org.osgi.core.version}:
Could not transfer artifact org.osgi:org.osgi.core:pom:${org.osgi.core.version} from/to central
(http://repo.maven.apache.org/maven2): Illegal character in path at index 60: http://repo.maven.apache.org/maven2/org/osgi/org.osgi.core/${org.osgi.core.version}/org.osgi.core-${org.osgi.core.version}.pom
-> [Help 1]
[INFO] org.apache.maven.lifecycle.LifecycleExecutionException: Failed to execute goal on project
brooklyn-sample: Could not resolve dependencies for project com.acme.sample:brooklyn-sample:jar:0.1.0-SNAPSHOT:
Failed to collect dependencies for [org.apache.brooklyn:brooklyn-all:jar:0.9.0-SNAPSHOT (compile),
org.apache.brooklyn:brooklyn-test-support:jar:0.9.0-SNAPSHOT (test), org.apache.brooklyn:brooklyn-logback-xml:jar:0.9.0-SNAPSHOT
(compile), org.apache.brooklyn:brooklyn-utils-test-support:jar:0.9.0-SNAPSHOT (test)]
[INFO] 	at org.apache.maven.lifecycle.internal.LifecycleDependencyResolver.getDependencies(LifecycleDependencyResolver.java:210)
[INFO] 	at org.apache.maven.lifecycle.internal.LifecycleDependencyResolver.resolveProjectDependencies(LifecycleDependencyResolver.java:117)
[INFO] 	at org.apache.maven.lifecycle.internal.MojoExecutor.ensureDependenciesAreResolved(MojoExecutor.java:258)
[INFO] 	at org.apache.maven.lifecycle.internal.MojoExecutor.execute(MojoExecutor.java:201)
[INFO] 	at org.apache.maven.lifecycle.internal.MojoExecutor.execute(MojoExecutor.java:153)
[INFO] 	at org.apache.maven.lifecycle.internal.MojoExecutor.execute(MojoExecutor.java:145)
[INFO] 	at org.apache.maven.lifecycle.internal.LifecycleModuleBuilder.buildProject(LifecycleModuleBuilder.java:84)
[INFO] 	at org.apache.maven.lifecycle.internal.LifecycleModuleBuilder.buildProject(LifecycleModuleBuilder.java:59)
[INFO] 	at org.apache.maven.lifecycle.internal.LifecycleStarter.singleThreadedBuild(LifecycleStarter.java:183)
[INFO] 	at org.apache.maven.lifecycle.internal.LifecycleStarter.execute(LifecycleStarter.java:161)
[INFO] 	at org.apache.maven.DefaultMaven.doExecute(DefaultMaven.java:320)
[INFO] 	at org.apache.maven.DefaultMaven.execute(DefaultMaven.java:156)
[INFO] 	at org.apache.maven.cli.MavenCli.execute(MavenCli.java:537)
[INFO] 	at org.apache.maven.cli.MavenCli.doMain(MavenCli.java:196)
[INFO] 	at org.apache.maven.cli.MavenCli.main(MavenCli.java:141)
[INFO] 	at sun.reflect.NativeMethodAccessorImpl.invoke0(Native Method)
[INFO] 	at sun.reflect.NativeMethodAccessorImpl.invoke(NativeMethodAccessorImpl.java:57)
[INFO] 	at sun.reflect.DelegatingMethodAccessorImpl.invoke(DelegatingMethodAccessorImpl.java:43)
[INFO] 	at java.lang.reflect.Method.invoke(Method.java:601)
[INFO] 	at org.codehaus.plexus.classworlds.launcher.Launcher.launchEnhanced(Launcher.java:290)
[INFO] 	at org.codehaus.plexus.classworlds.launcher.Launcher.launch(Launcher.java:230)
[INFO] 	at org.codehaus.plexus.classworlds.launcher.Launcher.mainWithExitCode(Launcher.java:409)
[INFO] 	at org.codehaus.plexus.classworlds.launcher.Launcher.main(Launcher.java:352)
[INFO] Caused by: org.apache.maven.project.DependencyResolutionException: Could not resolve
dependencies for project com.acme.sample:brooklyn-sample:jar:0.1.0-SNAPSHOT: Failed to collect
dependencies for [org.apache.brooklyn:brooklyn-all:jar:0.9.0-SNAPSHOT (compile), org.apache.brooklyn:brooklyn-test-support:jar:0.9.0-SNAPSHOT
(test), org.apache.brooklyn:brooklyn-logback-xml:jar:0.9.0-SNAPSHOT (compile), org.apache.brooklyn:brooklyn-utils-test-support:jar:0.9.0-SNAPSHOT
(test)]
[INFO] 	at org.apache.maven.project.DefaultProjectDependenciesResolver.resolve(DefaultProjectDependenciesResolver.java:158)
[INFO] 	at org.apache.maven.lifecycle.internal.LifecycleDependencyResolver.getDependencies(LifecycleDependencyResolver.java:185)
[INFO] 	... 22 more
[INFO] Caused by: org.sonatype.aether.collection.DependencyCollectionException: Failed to
collect dependencies for [org.apache.brooklyn:brooklyn-all:jar:0.9.0-SNAPSHOT (compile), org.apache.brooklyn:brooklyn-test-support:jar:0.9.0-SNAPSHOT
(test), org.apache.brooklyn:brooklyn-logback-xml:jar:0.9.0-SNAPSHOT (compile), org.apache.brooklyn:brooklyn-utils-test-support:jar:0.9.0-SNAPSHOT
(test)]
[INFO] 	at org.sonatype.aether.impl.internal.DefaultDependencyCollector.collectDependencies(DefaultDependencyCollector.java:258)
[INFO] 	at org.sonatype.aether.impl.internal.DefaultRepositorySystem.collectDependencies(DefaultRepositorySystem.java:308)
[INFO] 	at org.apache.maven.project.DefaultProjectDependenciesResolver.resolve(DefaultProjectDependenciesResolver.java:150)
[INFO] 	... 23 more
[INFO] Caused by: org.sonatype.aether.resolution.ArtifactDescriptorException: Failed to read
artifact descriptor for org.osgi:org.osgi.core:jar:${org.osgi.core.version}
[INFO] 	at org.apache.maven.repository.internal.DefaultArtifactDescriptorReader.loadPom(DefaultArtifactDescriptorReader.java:296)
[INFO] 	at org.apache.maven.repository.internal.DefaultArtifactDescriptorReader.readArtifactDescriptor(DefaultArtifactDescriptorReader.java:186)
[INFO] 	at org.sonatype.aether.impl.internal.DefaultDependencyCollector.process(DefaultDependencyCollector.java:412)
[INFO] 	at org.sonatype.aether.impl.internal.DefaultDependencyCollector.process(DefaultDependencyCollector.java:544)
[INFO] 	at org.sonatype.aether.impl.internal.DefaultDependencyCollector.process(DefaultDependencyCollector.java:544)
[INFO] 	at org.sonatype.aether.impl.internal.DefaultDependencyCollector.process(DefaultDependencyCollector.java:544)
[INFO] 	at org.sonatype.aether.impl.internal.DefaultDependencyCollector.process(DefaultDependencyCollector.java:544)
[INFO] 	at org.sonatype.aether.impl.internal.DefaultDependencyCollector.process(DefaultDependencyCollector.java:544)
[INFO] 	at org.sonatype.aether.impl.internal.DefaultDependencyCollector.collectDependencies(DefaultDependencyCollector.java:240)
[INFO] 	... 25 more
[INFO] Caused by: org.sonatype.aether.resolution.ArtifactResolutionException: Could not transfer
artifact org.osgi:org.osgi.core:pom:${org.osgi.core.version} from/to central (http://repo.maven.apache.org/maven2):
Illegal character in path at index 60: http://repo.maven.apache.org/maven2/org/osgi/org.osgi.core/${org.osgi.core.version}/org.osgi.core-${org.osgi.core.version}.pom
[INFO] 	at org.sonatype.aether.impl.internal.DefaultArtifactResolver.resolve(DefaultArtifactResolver.java:538)
[INFO] 	at org.sonatype.aether.impl.internal.DefaultArtifactResolver.resolveArtifacts(DefaultArtifactResolver.java:216)
[INFO] 	at org.sonatype.aether.impl.internal.DefaultArtifactResolver.resolveArtifact(DefaultArtifactResolver.java:193)
[INFO] 	at org.apache.maven.repository.internal.DefaultArtifactDescriptorReader.loadPom(DefaultArtifactDescriptorReader.java:281)
[INFO] 	... 33 more
[INFO] Caused by: org.sonatype.aether.transfer.ArtifactTransferException: Could not transfer
artifact org.osgi:org.osgi.core:pom:${org.osgi.core.version} from/to central (http://repo.maven.apache.org/maven2):
Illegal character in path at index 60: http://repo.maven.apache.org/maven2/org/osgi/org.osgi.core/${org.osgi.core.version}/org.osgi.core-${org.osgi.core.version}.pom
[INFO] 	at org.sonatype.aether.connector.wagon.WagonRepositoryConnector$4.wrap(WagonRepositoryConnector.java:951)
[INFO] 	at org.sonatype.aether.connector.wagon.WagonRepositoryConnector$4.wrap(WagonRepositoryConnector.java:941)
[INFO] 	at org.sonatype.aether.connector.wagon.WagonRepositoryConnector$GetTask.run(WagonRepositoryConnector.java:669)
[INFO] 	at org.sonatype.aether.util.concurrency.RunnableErrorForwarder$1.run(RunnableErrorForwarder.java:60)
[INFO] 	at java.util.concurrent.ThreadPoolExecutor.runWorker(ThreadPoolExecutor.java:1110)
[INFO] 	at java.util.concurrent.ThreadPoolExecutor$Worker.run(ThreadPoolExecutor.java:603)
[INFO] 	at java.lang.Thread.run(Thread.java:722)
[INFO] Caused by: java.lang.IllegalArgumentException: Illegal character in path at index 60:
http://repo.maven.apache.org/maven2/org/osgi/org.osgi.core/${org.osgi.core.version}/org.osgi.core-${org.osgi.core.version}.pom
[INFO] 	at java.net.URI.create(URI.java:859)
[INFO] 	at org.apache.maven.wagon.providers.http.httpclient.client.methods.HttpGet.<init>(HttpGet.java:69)
[INFO] 	at org.apache.maven.wagon.shared.http4.AbstractHttpClientWagon.fillInputData(AbstractHttpClientWagon.java:778)
[INFO] 	at org.apache.maven.wagon.StreamWagon.getInputStream(StreamWagon.java:116)
[INFO] 	at org.apache.maven.wagon.StreamWagon.getIfNewer(StreamWagon.java:88)
[INFO] 	at org.apache.maven.wagon.StreamWagon.get(StreamWagon.java:61)
[INFO] 	at org.sonatype.aether.connector.wagon.WagonRepositoryConnector$GetTask.run(WagonRepositoryConnector.java:601)
[INFO] 	... 4 more
[INFO] Caused by: java.net.URISyntaxException: Illegal character in path at index 60: http://repo.maven.apache.org/maven2/org/osgi/org.osgi.core/${org.osgi.core.version}/org.osgi.core-${org.osgi.core.version}.pom
[INFO] 	at java.net.URI$Parser.fail(URI.java:2827)
[INFO] 	at java.net.URI$Parser.checkChars(URI.java:3000)
[INFO] 	at java.net.URI$Parser.parseHierarchical(URI.java:3084)
[INFO] 	at java.net.URI$Parser.parse(URI.java:3032)
[INFO] 	at java.net.URI.<init>(URI.java:595)
[INFO] 	at java.net.URI.create(URI.java:857)
[INFO] 	... 10 more
[INFO] [ERROR] 
[INFO] [ERROR] Re-run Maven using the -X switch to enable full debug logging.
[INFO] [ERROR] 
[INFO] [ERROR] For more information about the errors and possible solutions, please read the
following articles:
[INFO] [ERROR] [Help 1] http://cwiki.apache.org/confluence/display/MAVEN/DependencyResolutionException
[INFO] Post-archetype-generation invoker exit code: 1
[JENKINS] Recording test results
[JENKINS] Archiving disabled
[INFO]                                                                         
[INFO] ------------------------------------------------------------------------
[INFO] Building Brooklyn Root 0.9.0-SNAPSHOT
[INFO] ------------------------------------------------------------------------
[INFO] 
[INFO] --- maven-clean-plugin:2.5:clean (default-clean) @ brooklyn ---
[INFO] Deleting <https://builds.apache.org/job/incubator-brooklyn-master-windows/ws/target>
[INFO] 
[INFO] --- maven-remote-resources-plugin:1.5:process (default) @ brooklyn ---
[INFO] 
[INFO] --- maven-site-plugin:3.4:attach-descriptor (attach-descriptor) @ brooklyn ---
[INFO] 
[INFO] --- maven-install-plugin:2.5.2:install (default-install) @ brooklyn ---
[INFO] Installing <https://builds.apache.org/job/incubator-brooklyn-master-windows/ws/pom.xml>
to f:\hudson\hudson-slave\maven-repositories\0\org\apache\brooklyn\brooklyn\0.9.0-SNAPSHOT\brooklyn-0.9.0-SNAPSHOT.pom
[JENKINS] Archiving disabled
[INFO] ------------------------------------------------------------------------
[INFO] Reactor Summary:
[INFO] 
[INFO] Brooklyn REST JavaScript Web GUI .................. SUCCESS [47.415s]
[INFO] Brooklyn Server Root .............................. SUCCESS [0.319s]
[INFO] Brooklyn Parent Project ........................... SUCCESS [7.764s]
[INFO] Brooklyn Test Support Utilities ................... FAILURE [1.927s]
[INFO] Brooklyn Logback Includable Configuration ......... FAILURE [1.366s]
[INFO] Brooklyn Common Utilities ......................... SKIPPED
[INFO] Brooklyn API ...................................... SKIPPED
[INFO] CAMP Server Parent Project ........................ SUCCESS [0.773s]
[INFO] CAMP Base ......................................... SKIPPED
[INFO] Brooklyn Test Support ............................. SKIPPED
[INFO] Brooklyn REST Swagger Apidoc Utilities ............ SKIPPED
[INFO] Brooklyn Logback Configuration .................... FAILURE [1.337s]
[INFO] CAMP Server ....................................... SKIPPED
[INFO] Brooklyn OSGi Utils ............................... SKIPPED
[INFO] Brooklyn Felix Runtime ............................ SKIPPED
[INFO] Brooklyn Groovy Utilities ......................... SKIPPED
[INFO] Brooklyn Core ..................................... SKIPPED
[INFO] Brooklyn Policies ................................. SKIPPED
[INFO] Brooklyn WinRM Software Entities .................. SKIPPED
[INFO] Brooklyn Secure JMXMP Agent ....................... SKIPPED
[INFO] Brooklyn JMX RMI Agent ............................ SKIPPED
[INFO] Brooklyn Jclouds Location Targets ................. SKIPPED
[INFO] Brooklyn Software Base ............................ SKIPPED
[INFO] Brooklyn CAMP REST API ............................ SKIPPED
[INFO] Brooklyn Hazelcast Storage ........................ SKIPPED
[INFO] Brooklyn REST API ................................. SKIPPED
[INFO] Brooklyn REST Server .............................. SKIPPED
[INFO] Brooklyn Launcher ................................. SKIPPED
[INFO] Brooklyn Command Line Interface ................... SKIPPED
[INFO] Brooklyn REST Client .............................. SKIPPED
[INFO] Brooklyn Test Framework ........................... SKIPPED
[INFO] Brooklyn Karaf .................................... SUCCESS [0.079s]
[INFO] Brooklyn Karaf Features ........................... SUCCESS [4.888s]
[INFO] Brooklyn Karaf Distro ............................. SUCCESS [43.483s]
[INFO] Brooklyn Karaf Shell Commands ..................... SUCCESS [5.309s]
[INFO] Brooklyn Karaf pax-exam itest ..................... SUCCESS [3:22.262s]
[INFO] Brooklyn Library Root ............................. SUCCESS [2.955s]
[INFO] Brooklyn Network Software Entities ................ SKIPPED
[INFO] Brooklyn OSGi Software Entities ................... SKIPPED
[INFO] Brooklyn Database Software Entities ............... SKIPPED
[INFO] Brooklyn Web App Software Entities ................ SKIPPED
[INFO] Brooklyn Messaging Software Entities .............. SKIPPED
[INFO] Brooklyn NoSQL Data Store Software Entities ....... SKIPPED
[INFO] Brooklyn Monitoring Software Entities ............. SKIPPED
[INFO] Brooklyn QA ....................................... SKIPPED
[INFO] Brooklyn Examples Aggregator Project .............. SUCCESS [0.374s]
[INFO] Brooklyn Examples Aggregator Project - Webapps .... SUCCESS [0.334s]
[INFO] hello-world-webapp Maven Webapp ................... SUCCESS [4.555s]
[INFO] hello-world-sql-webapp Maven Webapp ............... SUCCESS [3.703s]
[INFO] Brooklyn Simple Web Cluster Example ............... SKIPPED
[INFO] Brooklyn Global Web Fabric Example ................ SKIPPED
[INFO] Brooklyn Simple Messaging Publish-Subscribe Example  SKIPPED
[INFO] Brooklyn NoSQL Cluster Examples ................... SKIPPED
[INFO] Brooklyn Downstream Project Parent ................ SKIPPED
[INFO] Brooklyn Dist Root ................................ SUCCESS [1.025s]
[INFO] Brooklyn All Things ............................... SKIPPED
[INFO] Brooklyn Distribution ............................. SKIPPED
[INFO] Brooklyn Vagrant Getting Started Environment ...... FAILURE [2.333s]
[INFO] Brooklyn Quick-Start Project Archetype ............ FAILURE [49.275s]
[INFO] Brooklyn Root ..................................... SUCCESS [0.096s]
[INFO] ------------------------------------------------------------------------
[INFO] BUILD FAILURE
[INFO] ------------------------------------------------------------------------
[INFO] Total time: 6:34.358s
[INFO] Finished at: Thu Mar 10 01:40:06 GMT 2016
[INFO] Final Memory: 73M/244M
[INFO] ------------------------------------------------------------------------
[JENKINS] Archiving disabled
[JENKINS] Archiving disabled
[JENKINS] Archiving disabled
[JENKINS] Archiving disabled
[JENKINS] Archiving disabled
[JENKINS] Archiving disabled
[JENKINS] Archiving disabled
[JENKINS] Archiving disabled
[JENKINS] Archiving disabled
[JENKINS] Archiving disabled
[JENKINS] Archiving disabled
[JENKINS] Archiving disabled
[JENKINS] Archiving disabled
[JENKINS] Archiving disabled
[JENKINS] Archiving disabled
[JENKINS] Archiving disabled
[JENKINS] Archiving disabled
[JENKINS] Archiving disabled
[JENKINS] Archiving disabled
[JENKINS] Archiving disabled
[JENKINS] Archiving disabled
[JENKINS] Archiving disabled
[JENKINS] Archiving disabled
[JENKINS] Archiving disabled
[JENKINS] Archiving disabled
[JENKINS] Archiving disabled
[JENKINS] Archiving disabled
[JENKINS] Archiving disabled
[JENKINS] Archiving disabled
[JENKINS] Archiving disabled
[JENKINS] Archiving disabled
[JENKINS] Archiving disabled
[JENKINS] Archiving disabled
[JENKINS] Archiving disabled
[JENKINS] Archiving disabled
[JENKINS] Archiving disabled
[JENKINS] Archiving disabled
[JENKINS] Archiving disabled
[JENKINS] Archiving disabled
[JENKINS] Archiving disabled
[JENKINS] Archiving disabled
[JENKINS] Archiving disabled
[JENKINS] Archiving disabled
[JENKINS] Archiving disabled
[JENKINS] Archiving disabled
[JENKINS] Archiving disabled
[JENKINS] Archiving disabled
[JENKINS] Archiving disabled
[JENKINS] Archiving disabled
[JENKINS] Archiving disabled
[JENKINS] Archiving disabled
[JENKINS] Archiving disabled
[JENKINS] Archiving disabled
[JENKINS] Archiving disabled
[JENKINS] Archiving disabled
[JENKINS] Archiving disabled
[JENKINS] Archiving disabled
[JENKINS] Archiving disabled
[JENKINS] Archiving disabled
[JENKINS] Archiving disabled
Waiting for Jenkins to finish collecting data
[ERROR] Failed to execute goal org.apache.maven.plugins:maven-clean-plugin:2.6.1:clean (default-clean)
on project brooklyn-utils-test-support: Failed to clean project: Failed to delete F:\hudson\hudson-slave\workspace\incubator-brooklyn-master-windows\brooklyn-server\utils\test-support\target\brooklyn-utils-test-support-0.9.0-SNAPSHOT.jar
-> [Help 1]
[ERROR] Failed to execute goal org.apache.maven.plugins:maven-clean-plugin:2.6.1:clean (default-clean)
on project brooklyn-logback-includes: Failed to clean project: Failed to delete F:\hudson\hudson-slave\workspace\incubator-brooklyn-master-windows\brooklyn-server\logging\logback-includes\target\brooklyn-logback-includes-0.9.0-SNAPSHOT.jar
-> [Help 1]
[ERROR] Failed to execute goal org.apache.maven.plugins:maven-clean-plugin:2.6.1:clean (default-clean)
on project brooklyn-logback-xml: Failed to clean project: Failed to delete F:\hudson\hudson-slave\workspace\incubator-brooklyn-master-windows\brooklyn-server\logging\logback-xml\target\brooklyn-logback-xml-0.9.0-SNAPSHOT.jar
-> [Help 1]
[ERROR] Failed to execute goal org.apache.maven.plugins:maven-assembly-plugin:2.5.4:single
(build-distribution-archive) on project brooklyn-vagrant: Failed to create assembly: Error
creating assembly archive dist: Problem creating zip: Execution exception (and the archive
is probably corrupt but I could not delete it): There is not enough space on the disk ->
[Help 1]
[ERROR] Failed to execute goal org.apache.maven.plugins:maven-archetype-plugin:2.3:integration-test
(default-integration-test) on project brooklyn-archetype-quickstart:
[ERROR] Archetype IT 'integration-test-1' failed: Execution failure: exit code = 1
[ERROR] -> [Help 1]
[ERROR] 
[ERROR] To see the full stack trace of the errors, re-run Maven with the -e switch.
[ERROR] Re-run Maven using the -X switch to enable full debug logging.
[ERROR] 
[ERROR] For more information about the errors and possible solutions, please read the following
articles:
[ERROR] [Help 1] http://cwiki.apache.org/confluence/display/MAVEN/MojoExecutionException
[ERROR] 
[ERROR] After correcting the problems, you can resume the build with the command
[ERROR]   mvn <goals> -rf :brooklyn-utils-test-support
channel stopped

Mime
View raw message