brooklyn-dev mailing list archives

Site index · List index
Message view « Date » · « Thread »
Top « Date » · « Thread »
From Apache Jenkins Server <jenk...@builds.apache.org>
Subject Build failed in Jenkins: brooklyn-dist-master #5
Date Mon, 14 Mar 2016 20:15:43 GMT
See <https://builds.apache.org/job/brooklyn-dist-master/5/>

------------------------------------------
[...truncated 391 lines...]
-------------------------------------------------------
Running TestSuite
Configuring TestNG with: TestNG652Configurator
2016-03-14 20:13:54,846 INFO  TESTNG RUNNING: Suite: "Surefire test" containing "0" Tests
(config: null)
2016-03-14 20:13:54,855 INFO  BrooklynLeakListener.onStart attempting to terminate all extant
ManagementContexts: name=Surefire test; includedGroups=[]; excludedGroups=[Integration, Acceptance,
Live, Broken, WIP]; suiteName=Surefire suite; outDir=<https://builds.apache.org/job/brooklyn-dist-master/ws/dist/target/surefire-reports/Surefire>
suite: no org.apache.brooklyn.core.management.internal.LocalManagementContext available, so
skipped
2016-03-14 20:13:54,884 INFO  TESTNG 
===============================================
    Surefire test
    Tests run: 0, Failures: 0, Skips: 0
===============================================
2016-03-14 20:13:54,886 INFO  BrooklynLeakListener.onFinish attempting to terminate all extant
ManagementContexts: name=Surefire test; includedGroups=[]; excludedGroups=[Integration, Acceptance,
Live, Broken, WIP]; suiteName=Surefire suite; outDir=<https://builds.apache.org/job/brooklyn-dist-master/ws/dist/target/surefire-reports/Surefire>
suite: no org.apache.brooklyn.core.management.internal.LocalManagementContext available, so
skipped
Tests run: 0, Failures: 0, Errors: 0, Skipped: 0, Time elapsed: 1.435 sec - in TestSuite

Results :

Tests run: 0, Failures: 0, Errors: 0, Skipped: 0

[JENKINS] Recording test results
[INFO] 
[INFO] --- maven-dependency-plugin:2.8:unpack (unpack-client-cli) @ brooklyn-dist ---
[INFO] Configured Artifact: org.apache.brooklyn:brooklyn-client-cli:bin:0.9.0-SNAPSHOT:zip
[INFO] Downloading: http://repository.apache.org/snapshots/org/apache/brooklyn/brooklyn-client-cli/0.9.0-SNAPSHOT/maven-metadata.xml
[INFO] Downloaded: http://repository.apache.org/snapshots/org/apache/brooklyn/brooklyn-client-cli/0.9.0-SNAPSHOT/maven-metadata.xml
(825 B at 2.1 KB/sec)
[INFO] Downloading: http://repository.apache.org/snapshots/org/apache/brooklyn/brooklyn-client-cli/0.9.0-SNAPSHOT/brooklyn-client-cli-0.9.0-20160314.174123-1-bin.zip
[INFO] Downloaded: http://repository.apache.org/snapshots/org/apache/brooklyn/brooklyn-client-cli/0.9.0-SNAPSHOT/brooklyn-client-cli-0.9.0-20160314.174123-1-bin.zip
(24634 KB at 9936.9 KB/sec)
[INFO] Unpacking /jenkins/maven-repositories/0/org/apache/brooklyn/brooklyn-client-cli/0.9.0-SNAPSHOT/brooklyn-client-cli-0.9.0-SNAPSHOT-bin.zip
to <https://builds.apache.org/job/brooklyn-dist-master/ws/dist/target/brooklyn-client-cli-unpacked>
with includes "" and excludes ""
[INFO] 
[INFO] --- maven-jar-plugin:2.6:jar (default-jar) @ brooklyn-dist ---
[INFO] Building jar: <https://builds.apache.org/job/brooklyn-dist-master/ws/dist/target/brooklyn-dist-0.9.0-SNAPSHOT.jar>
[INFO] 
[INFO] --- maven-site-plugin:3.4:attach-descriptor (attach-descriptor) @ brooklyn-dist ---
[INFO] 
[INFO] --- maven-jar-plugin:2.6:test-jar (test-jar-creation) @ brooklyn-dist ---
[INFO] Building jar: <https://builds.apache.org/job/brooklyn-dist-master/ws/dist/target/brooklyn-dist-0.9.0-SNAPSHOT-tests.jar>
[INFO] 
[INFO] --- maven-assembly-plugin:2.5.4:single (build-distribution-dir) @ brooklyn-dist ---
[INFO] Downloading: http://repo.maven.apache.org/maven2/org/codehaus/plexus/plexus-interpolation/1.22/plexus-interpolation-1.22.pom
[INFO] Downloaded: http://repo.maven.apache.org/maven2/org/codehaus/plexus/plexus-interpolation/1.22/plexus-interpolation-1.22.pom
(2 KB at 125.2 KB/sec)
[INFO] Downloading: http://repo.maven.apache.org/maven2/org/codehaus/plexus/plexus-archiver/2.10/plexus-archiver-2.10.pom
[INFO] Downloaded: http://repo.maven.apache.org/maven2/org/codehaus/plexus/plexus-archiver/2.10/plexus-archiver-2.10.pom
(6 KB at 479.6 KB/sec)
[INFO] Downloading: http://repo.maven.apache.org/maven2/org/codehaus/plexus/plexus-io/2.6/plexus-io-2.6.pom
[INFO] Downloaded: http://repo.maven.apache.org/maven2/org/codehaus/plexus/plexus-io/2.6/plexus-io-2.6.pom
(4 KB at 350.5 KB/sec)
[INFO] Downloading: http://repo.maven.apache.org/maven2/org/apache/maven/shared/maven-filtering/1.3/maven-filtering-1.3.pom
[INFO] Downloaded: http://repo.maven.apache.org/maven2/org/apache/maven/shared/maven-filtering/1.3/maven-filtering-1.3.pom
(7 KB at 550.2 KB/sec)
[INFO] Downloading: http://repo.maven.apache.org/maven2/org/codehaus/plexus/plexus-utils/3.0.21/plexus-utils-3.0.21.pom
[INFO] Downloaded: http://repo.maven.apache.org/maven2/org/codehaus/plexus/plexus-utils/3.0.21/plexus-utils-3.0.21.pom
(4 KB at 372.1 KB/sec)
[INFO] Downloading: http://repo.maven.apache.org/maven2/org/apache/maven/shared/maven-repository-builder/1.0/maven-repository-builder-1.0.pom
[INFO] Downloaded: http://repo.maven.apache.org/maven2/org/apache/maven/shared/maven-repository-builder/1.0/maven-repository-builder-1.0.pom
(5 KB at 404.3 KB/sec)
[INFO] Downloading: http://repo.maven.apache.org/maven2/org/codehaus/plexus/plexus-interpolation/1.22/plexus-interpolation-1.22.jar
[INFO] Downloading: http://repo.maven.apache.org/maven2/org/codehaus/plexus/plexus-archiver/2.10/plexus-archiver-2.10.jar
[INFO] Downloading: http://repo.maven.apache.org/maven2/org/apache/maven/shared/maven-filtering/1.3/maven-filtering-1.3.jar
[INFO] Downloading: http://repo.maven.apache.org/maven2/org/codehaus/plexus/plexus-io/2.6/plexus-io-2.6.jar
[INFO] Downloading: http://repo.maven.apache.org/maven2/org/codehaus/plexus/plexus-utils/3.0.21/plexus-utils-3.0.21.jar
[INFO] Downloaded: http://repo.maven.apache.org/maven2/org/codehaus/plexus/plexus-interpolation/1.22/plexus-interpolation-1.22.jar
(76 KB at 5004.3 KB/sec)
[INFO] Downloading: http://repo.maven.apache.org/maven2/org/apache/maven/shared/maven-repository-builder/1.0/maven-repository-builder-1.0.jar
[INFO] Downloaded: http://repo.maven.apache.org/maven2/org/codehaus/plexus/plexus-archiver/2.10/plexus-archiver-2.10.jar
(363 KB at 13958.6 KB/sec)
[INFO] Downloaded: http://repo.maven.apache.org/maven2/org/apache/maven/shared/maven-repository-builder/1.0/maven-repository-builder-1.0.jar
(22 KB at 1962.1 KB/sec)
[INFO] Downloaded: http://repo.maven.apache.org/maven2/org/apache/maven/shared/maven-filtering/1.3/maven-filtering-1.3.jar
(50 KB at 617.1 KB/sec)
[INFO] Downloaded: http://repo.maven.apache.org/maven2/org/codehaus/plexus/plexus-io/2.6/plexus-io-2.6.jar
(83 KB at 902.8 KB/sec)
[INFO] Downloaded: http://repo.maven.apache.org/maven2/org/codehaus/plexus/plexus-utils/3.0.21/plexus-utils-3.0.21.jar
(240 KB at 2320.7 KB/sec)
[INFO] Reading assembly descriptor: src/main/config/build-distribution.xml
[INFO] Copying files to <https://builds.apache.org/job/brooklyn-dist-master/ws/dist/target/brooklyn-dist>
[INFO] 
[INFO] --- maven-assembly-plugin:2.5.4:single (build-distribution-archive) @ brooklyn-dist
---
[INFO] Reading assembly descriptor: src/main/config/build-distribution.xml
[INFO] Building tar: <https://builds.apache.org/job/brooklyn-dist-master/ws/dist/target/brooklyn-dist-0.9.0-SNAPSHOT-dist.tar.gz>
[INFO] Building zip: <https://builds.apache.org/job/brooklyn-dist-master/ws/dist/target/brooklyn-dist-0.9.0-SNAPSHOT-dist.zip>
[INFO] 
[INFO] --- apache-rat-plugin:0.11:check (default) @ brooklyn-dist ---
[INFO] 51 implicit excludes (use -debug for more details).
[INFO] Exclude: sandbox/**
[INFO] Exclude: release/**
[INFO] Exclude: README.md
[INFO] Exclude: **/nbactions.xml
[INFO] Exclude: **/nb-configuration.xml
[INFO] Exclude: **/.git/**
[INFO] Exclude: **/.gitignore
[INFO] Exclude: **/.repository/**
[INFO] Exclude: **/.idea/**
[INFO] Exclude: **/*.iml
[INFO] Exclude: **/.classpath/**
[INFO] Exclude: **/.project
[INFO] Exclude: **/.settings/**
[INFO] Exclude: **/*.log
[INFO] Exclude: **/brooklyn*.log.*
[INFO] Exclude: **/target/**
[INFO] Exclude: ignored/**
[INFO] Exclude: LICENSE.md
[INFO] Exclude: **/src/main/license/**
[INFO] Exclude: **/src/test/license/**
[INFO] Exclude: **/MANIFEST.MF
[INFO] Exclude: **/test-output/**
[INFO] Exclude: **/*.pem.pub
[INFO] Exclude: **/*.pem
[INFO] Exclude: **/*_rsa.pub
[INFO] Exclude: **/*_rsa
[INFO] Exclude: **/*.svg
[INFO] Exclude: **/*.crt
[INFO] Exclude: **/*.csr
[INFO] Exclude: **/*.key
[INFO] Exclude: **/*.key.org
[INFO] Exclude: **/*.psd
[INFO] Exclude: **/*.json
[INFO] Exclude: **/*.plxarc
[INFO] Exclude: **/src/test/resources/org/apache/brooklyn/entity/software/base/template_with_extra_substitutions.txt
[INFO] Exclude: **/src/main/resources/banner.txt
[INFO] Exclude: **/src/test/resources/ssl/certs/localhost/info.txt
[INFO] Exclude: **/src/main/history/dependencies.xml
[INFO] Exclude: **/sandbox/examples/src/main/scripts/amis.txt
[INFO] Exclude: docs/**
[INFO] Exclude: scripts/README.md
[INFO] Exclude: src/main/dist/conf/**
[INFO] Exclude: src/main/dist/README.md
[INFO] Exclude: licensing/licenses/**
[INFO] Exclude: licensing/README.md
[INFO] Exclude: licensing/*LICENSE*
[INFO] Exclude: licensing/*.autogenerated
[INFO] Exclude: licensing/projects-with-custom-licenses
[INFO] Exclude: licensing/extras-files
[INFO] 10 resources included (use -debug for more details)
[INFO] Rat check: Summary of files. Unapproved: 0 unknown: 0 generated: 0 approved: 10 licence.
[INFO] 
[INFO] --- maven-source-plugin:2.4:jar-no-fork (attach-sources) @ brooklyn-dist ---
[INFO] Building jar: <https://builds.apache.org/job/brooklyn-dist-master/ws/dist/target/brooklyn-dist-0.9.0-SNAPSHOT-sources.jar>
[INFO] 
[INFO] --- maven-source-plugin:2.4:test-jar-no-fork (attach-sources) @ brooklyn-dist ---
[INFO] Building jar: <https://builds.apache.org/job/brooklyn-dist-master/ws/dist/target/brooklyn-dist-0.9.0-SNAPSHOT-test-sources.jar>
[INFO] 
[INFO] --- maven-install-plugin:2.5.2:install (default-install) @ brooklyn-dist ---
[INFO] Installing <https://builds.apache.org/job/brooklyn-dist-master/ws/dist/target/brooklyn-dist-0.9.0-SNAPSHOT.jar>
to /jenkins/maven-repositories/0/org/apache/brooklyn/brooklyn-dist/0.9.0-SNAPSHOT/brooklyn-dist-0.9.0-SNAPSHOT.jar
[INFO] Installing <https://builds.apache.org/job/brooklyn-dist-master/ws/dist/pom.xml>
to /jenkins/maven-repositories/0/org/apache/brooklyn/brooklyn-dist/0.9.0-SNAPSHOT/brooklyn-dist-0.9.0-SNAPSHOT.pom
[INFO] Installing <https://builds.apache.org/job/brooklyn-dist-master/ws/dist/target/brooklyn-dist-0.9.0-SNAPSHOT-tests.jar>
to /jenkins/maven-repositories/0/org/apache/brooklyn/brooklyn-dist/0.9.0-SNAPSHOT/brooklyn-dist-0.9.0-SNAPSHOT-tests.jar
[INFO] Installing <https://builds.apache.org/job/brooklyn-dist-master/ws/dist/target/brooklyn-dist-0.9.0-SNAPSHOT-dist.tar.gz>
to /jenkins/maven-repositories/0/org/apache/brooklyn/brooklyn-dist/0.9.0-SNAPSHOT/brooklyn-dist-0.9.0-SNAPSHOT-dist.tar.gz
[INFO] Installing <https://builds.apache.org/job/brooklyn-dist-master/ws/dist/target/brooklyn-dist-0.9.0-SNAPSHOT-dist.zip>
to /jenkins/maven-repositories/0/org/apache/brooklyn/brooklyn-dist/0.9.0-SNAPSHOT/brooklyn-dist-0.9.0-SNAPSHOT-dist.zip
[INFO] Installing <https://builds.apache.org/job/brooklyn-dist-master/ws/dist/target/brooklyn-dist-0.9.0-SNAPSHOT-sources.jar>
to /jenkins/maven-repositories/0/org/apache/brooklyn/brooklyn-dist/0.9.0-SNAPSHOT/brooklyn-dist-0.9.0-SNAPSHOT-sources.jar
[INFO] Installing <https://builds.apache.org/job/brooklyn-dist-master/ws/dist/target/brooklyn-dist-0.9.0-SNAPSHOT-test-sources.jar>
to /jenkins/maven-repositories/0/org/apache/brooklyn/brooklyn-dist/0.9.0-SNAPSHOT/brooklyn-dist-0.9.0-SNAPSHOT-test-sources.jar
[INFO]                                                                         
[INFO] ------------------------------------------------------------------------
[INFO] Building Brooklyn RPM Package 0.9.0-SNAPSHOT
[INFO] ------------------------------------------------------------------------
[INFO] Downloading: http://repo.maven.apache.org/maven2/org/codehaus/mojo/rpm-maven-plugin/2.1.5/rpm-maven-plugin-2.1.5.pom
[INFO] Downloaded: http://repo.maven.apache.org/maven2/org/codehaus/mojo/rpm-maven-plugin/2.1.5/rpm-maven-plugin-2.1.5.pom
(9 KB at 164.2 KB/sec)
[INFO] Downloading: http://repo.maven.apache.org/maven2/org/codehaus/mojo/mojo-parent/38/mojo-parent-38.pom
[INFO] Downloaded: http://repo.maven.apache.org/maven2/org/codehaus/mojo/mojo-parent/38/mojo-parent-38.pom
(33 KB at 922.9 KB/sec)
[INFO] Downloading: http://repo.maven.apache.org/maven2/org/codehaus/mojo/rpm-maven-plugin/2.1.5/rpm-maven-plugin-2.1.5.jar
[INFO] Downloaded: http://repo.maven.apache.org/maven2/org/codehaus/mojo/rpm-maven-plugin/2.1.5/rpm-maven-plugin-2.1.5.jar
(75 KB at 1900.6 KB/sec)
[INFO] 
[INFO] --- maven-clean-plugin:2.6.1:clean (default-clean) @ brooklyn-packaging ---
[INFO] Deleting <https://builds.apache.org/job/brooklyn-dist-master/ws/packaging> (includes
= [brooklyn*.log, brooklyn*.log.*, stacktrace.log, test-output, prodDb.*], excludes = [])
[INFO] 
[INFO] --- maven-replacer-plugin:1.4.1:replace (fix-eclipse-dot-classpath-mangling) @ brooklyn-packaging
---
[INFO] Ignoring missing file
[INFO] Replacement run on 0 file.
[INFO] 
[INFO] --- buildnumber-maven-plugin:1.3:create (default) @ brooklyn-packaging ---
[INFO] 
[INFO] --- maven-enforcer-plugin:1.4.1:enforce (brooklyn-build-req) @ brooklyn-packaging ---
[INFO] 
[INFO] --- maven-remote-resources-plugin:1.5:process (default) @ brooklyn-packaging ---
[INFO] 
[INFO] --- maven-checkstyle-plugin:2.13:check (verify-style) @ brooklyn-packaging ---
[INFO] 
[INFO] 
[INFO] >>> maven-bundle-plugin:2.5.4:manifest (bundle-manifest) @ brooklyn-packaging
>>>
[INFO] 
[INFO] --- buildnumber-maven-plugin:1.3:create (default) @ brooklyn-packaging ---
[INFO] 
[INFO] --- maven-enforcer-plugin:1.4.1:enforce (brooklyn-build-req) @ brooklyn-packaging ---
[INFO] 
[INFO] --- maven-remote-resources-plugin:1.5:process (default) @ brooklyn-packaging ---
[INFO] 
[INFO] --- maven-checkstyle-plugin:2.13:check (verify-style) @ brooklyn-packaging ---
[INFO] 
[WARNING] Failed to getClass for org.apache.felix.bundleplugin.ManifestPlugin
[INFO] 
[INFO] <<< maven-bundle-plugin:2.5.4:manifest (bundle-manifest) @ brooklyn-packaging
<<<
[INFO] 
[INFO] --- maven-bundle-plugin:2.5.4:manifest (bundle-manifest) @ brooklyn-packaging ---
[WARNING] Ignoring project type pom - supportedProjectTypes = [jar]
[INFO] 
[INFO] --- maven-site-plugin:3.4:attach-descriptor (attach-descriptor) @ brooklyn-packaging
---
[INFO] 
[INFO] --- rpm-maven-plugin:2.1.5:attached-rpm (generate-rpm) @ brooklyn-packaging ---
[INFO] Downloading: http://repo.maven.apache.org/maven2/org/codehaus/plexus/plexus-archiver/3.0.3/plexus-archiver-3.0.3.pom
[INFO] Downloaded: http://repo.maven.apache.org/maven2/org/codehaus/plexus/plexus-archiver/3.0.3/plexus-archiver-3.0.3.pom
(5 KB at 123.3 KB/sec)
[INFO] Downloading: http://repo.maven.apache.org/maven2/org/codehaus/plexus/plexus-io/2.7/plexus-io-2.7.pom
[INFO] Downloaded: http://repo.maven.apache.org/maven2/org/codehaus/plexus/plexus-io/2.7/plexus-io-2.7.pom
(5 KB at 133.3 KB/sec)
[INFO] Downloading: http://repo.maven.apache.org/maven2/org/iq80/snappy/snappy/0.4/snappy-0.4.pom
[INFO] Downloaded: http://repo.maven.apache.org/maven2/org/iq80/snappy/snappy/0.4/snappy-0.4.pom
(15 KB at 394.3 KB/sec)
[INFO] Downloading: http://repo.maven.apache.org/maven2/org/sonatype/plexus/plexus-sec-dispatcher/1.4/plexus-sec-dispatcher-1.4.pom
[INFO] Downloaded: http://repo.maven.apache.org/maven2/org/sonatype/plexus/plexus-sec-dispatcher/1.4/plexus-sec-dispatcher-1.4.pom
(3 KB at 82.6 KB/sec)
[INFO] Downloading: http://repo.maven.apache.org/maven2/org/codehaus/plexus/plexus-archiver/3.0.3/plexus-archiver-3.0.3.jar
[INFO] Downloading: http://repo.maven.apache.org/maven2/org/codehaus/plexus/plexus-io/2.7/plexus-io-2.7.jar
[INFO] Downloading: http://repo.maven.apache.org/maven2/org/iq80/snappy/snappy/0.4/snappy-0.4.jar
[INFO] Downloading: http://repo.maven.apache.org/maven2/org/sonatype/plexus/plexus-sec-dispatcher/1.4/plexus-sec-dispatcher-1.4.jar
[INFO] Downloaded: http://repo.maven.apache.org/maven2/org/sonatype/plexus/plexus-sec-dispatcher/1.4/plexus-sec-dispatcher-1.4.jar
(28 KB at 2254.5 KB/sec)
[INFO] Downloaded: http://repo.maven.apache.org/maven2/org/iq80/snappy/snappy/0.4/snappy-0.4.jar
(57 KB at 1179.1 KB/sec)
[INFO] Downloaded: http://repo.maven.apache.org/maven2/org/codehaus/plexus/plexus-archiver/3.0.3/plexus-archiver-3.0.3.jar
(173 KB at 3450.8 KB/sec)
[INFO] Downloaded: http://repo.maven.apache.org/maven2/org/codehaus/plexus/plexus-io/2.7/plexus-io-2.7.jar
(84 KB at 1468.1 KB/sec)
[WARNING] rpm version string truncated to 0.9.0
[INFO] ------------------------------------------------------------------------
[INFO] Reactor Summary:
[INFO] 
[INFO] Brooklyn Downstream Project Parent ................ SUCCESS [  5.131 s]
[INFO] Brooklyn Dist Root ................................ SUCCESS [  5.420 s]
[INFO] Brooklyn All Things ............................... SUCCESS [ 19.865 s]
[INFO] Brooklyn Distribution ............................. SUCCESS [01:05 min]
[INFO] Brooklyn RPM Package .............................. FAILURE [  6.034 s]
[INFO] Brooklyn Vagrant Getting Started Environment ...... SKIPPED
[INFO] Brooklyn Quick-Start Project Archetype ............ SKIPPED
[INFO] ------------------------------------------------------------------------
[INFO] BUILD FAILURE
[INFO] ------------------------------------------------------------------------
[INFO] Total time: 01:56 min
[INFO] Finished at: 2016-03-14T20:14:59+00:00
[INFO] Final Memory: 68M/638M
[INFO] ------------------------------------------------------------------------
Waiting for Jenkins to finish collecting data
[ERROR] Failed to execute goal org.codehaus.mojo:rpm-maven-plugin:2.1.5:attached-rpm (generate-rpm)
on project brooklyn-packaging: Unable to query for default vendor from RPM: Error while executing
process. Cannot run program "rpm": error=2, No such file or directory -> [Help 1]
[ERROR] 
[ERROR] To see the full stack trace of the errors, re-run Maven with the -e switch.
[ERROR] Re-run Maven using the -X switch to enable full debug logging.
[ERROR] 
[ERROR] For more information about the errors and possible solutions, please read the following
articles:
[ERROR] [Help 1] http://cwiki.apache.org/confluence/display/MAVEN/MojoExecutionException
[ERROR] 
[ERROR] After correcting the problems, you can resume the build with the command
[ERROR]   mvn <goals> -rf :brooklyn-packaging
[JENKINS] Archiving <https://builds.apache.org/job/brooklyn-dist-master/ws/packaging/pom.xml>
to org.apache.brooklyn/brooklyn-packaging/0.9.0-SNAPSHOT/brooklyn-packaging-0.9.0-SNAPSHOT.pom
No prior successful build to compare, so performing full copy of artifacts
[JENKINS] Archiving <https://builds.apache.org/job/brooklyn-dist-master/ws/dist/pom.xml>
to org.apache.brooklyn/brooklyn-dist/0.9.0-SNAPSHOT/brooklyn-dist-0.9.0-SNAPSHOT.pom
[JENKINS] Archiving <https://builds.apache.org/job/brooklyn-dist-master/ws/dist/target/brooklyn-dist-0.9.0-SNAPSHOT.jar>
to org.apache.brooklyn/brooklyn-dist/0.9.0-SNAPSHOT/brooklyn-dist-0.9.0-SNAPSHOT.jar
[JENKINS] Archiving <https://builds.apache.org/job/brooklyn-dist-master/ws/dist/target/brooklyn-dist-0.9.0-SNAPSHOT-tests.jar>
to org.apache.brooklyn/brooklyn-dist/0.9.0-SNAPSHOT/brooklyn-dist-0.9.0-SNAPSHOT-tests.jar
[JENKINS] Archiving <https://builds.apache.org/job/brooklyn-dist-master/ws/dist/target/brooklyn-dist-0.9.0-SNAPSHOT-dist.tar.gz>
to org.apache.brooklyn/brooklyn-dist/0.9.0-SNAPSHOT/brooklyn-dist-0.9.0-SNAPSHOT-dist.tar.gz
[JENKINS] Archiving <https://builds.apache.org/job/brooklyn-dist-master/ws/dist/target/brooklyn-dist-0.9.0-SNAPSHOT-dist.zip>
to org.apache.brooklyn/brooklyn-dist/0.9.0-SNAPSHOT/brooklyn-dist-0.9.0-SNAPSHOT-dist.zip
[JENKINS] Archiving <https://builds.apache.org/job/brooklyn-dist-master/ws/dist/target/brooklyn-dist-0.9.0-SNAPSHOT-sources.jar>
to org.apache.brooklyn/brooklyn-dist/0.9.0-SNAPSHOT/brooklyn-dist-0.9.0-SNAPSHOT-sources.jar
[JENKINS] Archiving <https://builds.apache.org/job/brooklyn-dist-master/ws/dist/target/brooklyn-dist-0.9.0-SNAPSHOT-test-sources.jar>
to org.apache.brooklyn/brooklyn-dist/0.9.0-SNAPSHOT/brooklyn-dist-0.9.0-SNAPSHOT-test-sources.jar
No prior successful build to compare, so performing full copy of artifacts
[JENKINS] Archiving <https://builds.apache.org/job/brooklyn-dist-master/ws/archetypes/quickstart/pom.xml>
to org.apache.brooklyn/brooklyn-archetype-quickstart/0.9.0-SNAPSHOT/brooklyn-archetype-quickstart-0.9.0-SNAPSHOT.pom
No prior successful build to compare, so performing full copy of artifacts
[JENKINS] Archiving <https://builds.apache.org/job/brooklyn-dist-master/ws/vagrant/pom.xml>
to org.apache.brooklyn/brooklyn-vagrant/0.9.0-SNAPSHOT/brooklyn-vagrant-0.9.0-SNAPSHOT.pom
No prior successful build to compare, so performing full copy of artifacts
[JENKINS] Archiving <https://builds.apache.org/job/brooklyn-dist-master/ws/pom.xml>
to org.apache.brooklyn/brooklyn-dist-root/0.9.0-SNAPSHOT/brooklyn-dist-root-0.9.0-SNAPSHOT.pom
[JENKINS] Archiving <https://builds.apache.org/job/brooklyn-dist-master/ws/downstream-parent/pom.xml>
to org.apache.brooklyn/brooklyn-downstream-parent/0.9.0-SNAPSHOT/brooklyn-downstream-parent-0.9.0-SNAPSHOT.pom
[JENKINS] Archiving <https://builds.apache.org/job/brooklyn-dist-master/ws/all/pom.xml>
to org.apache.brooklyn/brooklyn-all/0.9.0-SNAPSHOT/brooklyn-all-0.9.0-SNAPSHOT.pom
[JENKINS] Archiving <https://builds.apache.org/job/brooklyn-dist-master/ws/all/target/brooklyn-all-0.9.0-SNAPSHOT.jar>
to org.apache.brooklyn/brooklyn-all/0.9.0-SNAPSHOT/brooklyn-all-0.9.0-SNAPSHOT.jar
[JENKINS] Archiving <https://builds.apache.org/job/brooklyn-dist-master/ws/all/target/brooklyn-all-0.9.0-SNAPSHOT-sources.jar>
to org.apache.brooklyn/brooklyn-all/0.9.0-SNAPSHOT/brooklyn-all-0.9.0-SNAPSHOT-sources.jar
[JENKINS] Archiving <https://builds.apache.org/job/brooklyn-dist-master/ws/all/target/brooklyn-all-0.9.0-SNAPSHOT-test-sources.jar>
to org.apache.brooklyn/brooklyn-all/0.9.0-SNAPSHOT/brooklyn-all-0.9.0-SNAPSHOT-test-sources.jar
channel stopped

Mime
View raw message