brooklyn-dev mailing list archives

Site index · List index
Message view « Date » · « Thread »
Top « Date » · « Thread »
From Apache Jenkins Server <jenk...@builds.apache.org>
Subject Build failed in Jenkins: brooklyn-server-master #24
Date Sun, 27 Mar 2016 16:14:01 GMT
See <https://builds.apache.org/job/brooklyn-server-master/24/changes>

Changes:

[bostko] Parametrize number of retries of network failures

------------------------------------------
[...truncated 23685 lines...]
2016-03-27 16:12:55,396 WARN  Task Task[LSM.publish(Application[frQeiSKh].Sensor: service.notUp.indicators
(java.util.Map)={service.state=Application stopped} @ 1459095172540);[subscription-delivery-entity-frQeiSKh[Application[frQeiSKh]]]]@dC7YNPVN
is being finalized before completion
2016-03-27 16:12:55,396 WARN  Task Task[LSM.publish(Application[frQeiSKh].Sensor: service.state.expected
(org.apache.brooklyn.core.entity.lifecycle.Lifecycle$Transition)=stopped @ 1459095172540 /
Sun Mar 27 16:12:52 UTC 2016 @ 1459095172540);[subscription-delivery-entity-frQeiSKh[Application[frQeiSKh]]]]@BHCH5h7h
is being finalized before completion
2016-03-27 16:12:55,396 WARN  Task Task[LSM.publish(Application[frQeiSKh].Sensor: entity.children.removed
(org.apache.brooklyn.api.entity.Entity)=TestEntityImpl{id=L0AFX1M7} @ 1459095172540);[subscription-delivery-entity-frQeiSKh[Application[frQeiSKh]]]]@x82Xrygb
is being finalized before completion
2016-03-27 16:12:55,540 INFO  Test class org.apache.brooklyn.policy.enricher.RebindEnricherTest
persisting to /tmp/RebindEnricherTest-tnZ9
2016-03-27 16:12:55,540 INFO  TESTNG PASSED CONFIGURATION: "Surefire test" - @BeforeMethod
org.apache.brooklyn.core.mgmt.rebind.RebindTestFixture.setUp() finished in 178 ms
2016-03-27 16:12:55,541 INFO  TESTNG INVOKING: "Surefire test" - org.apache.brooklyn.policy.enricher.RebindEnricherTest.testRollingTimeWindowMeanEnricher()
2016-03-27 16:12:55,580 INFO  Rebinding app, using mementoDir /tmp/RebindEnricherTest-tnZ9;
object store null
2016-03-27 16:12:55,925 INFO  Rebinding from /tmp/RebindEnricherTest-tnZ9 for master vc3Yy3JD...
2016-03-27 16:12:55,993 INFO  Rebind complete (MASTER) in 382ms: 1 app, 1 entity, 0 locations,
0 policies, 1 enricher, 0 feeds, 0 catalog items
2016-03-27 16:12:56,019 INFO  TESTNG PASSED: "Surefire test" - org.apache.brooklyn.policy.enricher.RebindEnricherTest.testRollingTimeWindowMeanEnricher()
finished in 478 ms
2016-03-27 16:12:56,020 INFO  TESTNG INVOKING CONFIGURATION: "Surefire test" - @AfterMethod
org.apache.brooklyn.policy.enricher.RebindEnricherTest.tearDown()
2016-03-27 16:12:56,046 INFO  TESTNG PASSED CONFIGURATION: "Surefire test" - @AfterMethod
org.apache.brooklyn.policy.enricher.RebindEnricherTest.tearDown() finished in 26 ms
2016-03-27 16:12:56,047 INFO  TESTNG INVOKING CONFIGURATION: "Surefire test" - @BeforeMethod
org.apache.brooklyn.core.mgmt.rebind.RebindTestFixture.setUp()
2016-03-27 16:12:56,090 INFO  Test class org.apache.brooklyn.policy.enricher.RebindEnricherTest
persisting to /tmp/RebindEnricherTest-QDuI
2016-03-27 16:12:56,090 INFO  TESTNG PASSED CONFIGURATION: "Surefire test" - @BeforeMethod
org.apache.brooklyn.core.mgmt.rebind.RebindTestFixture.setUp() finished in 43 ms
2016-03-27 16:12:56,092 INFO  TESTNG INVOKING: "Surefire test" - org.apache.brooklyn.policy.enricher.RebindEnricherTest.testTimeFractionDeltaEnricher()
2016-03-27 16:12:56,132 INFO  Rebinding app, using mementoDir /tmp/RebindEnricherTest-QDuI;
object store null
2016-03-27 16:12:56,175 INFO  Rebinding from /tmp/RebindEnricherTest-QDuI for master kE4EBL9o...
2016-03-27 16:12:56,230 INFO  Rebind complete (MASTER) in 96ms: 1 app, 1 entity, 0 locations,
0 policies, 1 enricher, 0 feeds, 0 catalog items
2016-03-27 16:12:56,248 INFO  TESTNG PASSED: "Surefire test" - org.apache.brooklyn.policy.enricher.RebindEnricherTest.testTimeFractionDeltaEnricher()
finished in 158 ms
2016-03-27 16:12:56,248 INFO  TESTNG INVOKING CONFIGURATION: "Surefire test" - @AfterMethod
org.apache.brooklyn.policy.enricher.RebindEnricherTest.tearDown()
2016-03-27 16:12:56,322 INFO  TESTNG PASSED CONFIGURATION: "Surefire test" - @AfterMethod
org.apache.brooklyn.policy.enricher.RebindEnricherTest.tearDown() finished in 73 ms
2016-03-27 16:12:56,322 INFO  TESTNG INVOKING CONFIGURATION: "Surefire test" - @BeforeMethod
org.apache.brooklyn.core.mgmt.rebind.RebindTestFixture.setUp()
2016-03-27 16:12:56,394 INFO  Test class org.apache.brooklyn.policy.enricher.RebindEnricherTest
persisting to /tmp/RebindEnricherTest-lIiC
2016-03-27 16:12:56,394 INFO  TESTNG PASSED CONFIGURATION: "Surefire test" - @BeforeMethod
org.apache.brooklyn.core.mgmt.rebind.RebindTestFixture.setUp() finished in 72 ms
2016-03-27 16:12:56,397 INFO  TESTNG INVOKING: "Surefire test" - org.apache.brooklyn.policy.enricher.RebindEnricherTest.testTimeWeightedDeltaEnricher()
2016-03-27 16:12:56,454 INFO  Rebinding app, using mementoDir /tmp/RebindEnricherTest-lIiC;
object store null
2016-03-27 16:12:56,492 INFO  Rebinding from /tmp/RebindEnricherTest-lIiC for master Wsaz6THF...
2016-03-27 16:12:56,573 INFO  Rebind complete (MASTER) in 116ms: 1 app, 1 entity, 0 locations,
0 policies, 1 enricher, 0 feeds, 0 catalog items
2016-03-27 16:12:56,596 INFO  TESTNG PASSED: "Surefire test" - org.apache.brooklyn.policy.enricher.RebindEnricherTest.testTimeWeightedDeltaEnricher()
finished in 202 ms
2016-03-27 16:12:56,596 INFO  TESTNG INVOKING CONFIGURATION: "Surefire test" - @AfterMethod
org.apache.brooklyn.policy.enricher.RebindEnricherTest.tearDown()
2016-03-27 16:12:56,645 INFO  TESTNG PASSED CONFIGURATION: "Surefire test" - @AfterMethod
org.apache.brooklyn.policy.enricher.RebindEnricherTest.tearDown() finished in 49 ms
2016-03-27 16:12:56,823 INFO  TESTNG 
===============================================
    Surefire test
    Tests run: 229, Failures: 1, Skips: 0
===============================================
2016-03-27 16:12:56,824 INFO  BrooklynLeakListener.onFinish attempting to terminate all extant
ManagementContexts: name=Surefire test; includedGroups=[]; excludedGroups=[Integration, Acceptance,
Live, Broken, WIP]; suiteName=Surefire suite; outDir=<https://builds.apache.org/job/brooklyn-server-master/ws/policy/target/surefire-reports/Surefire>
suite: no org.apache.brooklyn.core.management.internal.LocalManagementContext available, so
skipped
Tests run: 229, Failures: 1, Errors: 0, Skipped: 0, Time elapsed: 249.3 sec <<< FAILURE!
- in TestSuite
testLoadBalancingQuickTest(org.apache.brooklyn.policy.loadbalancing.LoadBalancingPolicySoakTest)
 Time elapsed: 40.764 sec  <<< FAILURE!
org.apache.brooklyn.util.exceptions.PropagatedRuntimeException: failed succeeds-eventually,
89 attempts, 40002ms elapsed: AssertionError: extras=[]; missing=[MockItem[item-4]]; duplicates=[];
actualSize=4; expectedSize=5; actual=[MockItem[item-5], MockItem[item-2], MockItem[item-3],
MockItem[item-1.1.1]]; expected=[MockItem[item-1.1.1], MockItem[item-2], MockItem[item-3],
MockItem[item-4], MockItem[item-5]]; containers=[MockContainer[container-1], MockContainer[container-2],
MockContainer[container-3], MockContainer[container-4.1.1], MockContainer[container-5]]; containerRates=[288.0,
281.0, 285.0, 0.0, 571.0]; itemDistributionByContainer={MockContainer[container-1]=[MockItem[item-3]],
MockContainer[container-2]=[MockItem[item-2]], MockContainer[container-3]=[MockItem[item-5]],
MockContainer[container-4.1.1]=[], MockContainer[container-5]=[MockItem[item-4], MockItem[item-1.1.1]]};
itemDistributionByItem={MockItem[item-1.1.1]=MockContainer[container-5], MockItem[item-2]=MockContainer[container-2],
MockItem[item-3]=MockContainer[container-1], MockItem[item-4]=MockContainer[container-5],
MockItem[item-5]=MockContainer[container-3]}; model=Container 'MockContainer[container-3]':

	Item 'MockItem[item-5]' (285.0)
Container 'MockContainer[container-2]': 
	Item 'MockItem[item-2]' (281.0)
Container 'MockContainer[container-4.1.1]': 
Container 'MockContainer[container-1]': 
	Item 'MockItem[item-3]' (288.0)
Container 'MockContainer[container-5]': 
	Item 'MockItem[item-1.1.1]' (283.0)
; totalMoves=11; lastMoveTime=2016-03-27 16:09:53.617; itemRates=[283, 281, 288, 288, 285]
	at org.apache.brooklyn.test.Asserts.fail(Asserts.java:721)
	at org.apache.brooklyn.test.Asserts.assertTrue(Asserts.java:703)
	at org.apache.brooklyn.test.Asserts.assertEqualsIgnoringOrder(Asserts.java:742)
	at org.apache.brooklyn.policy.loadbalancing.LoadBalancingPolicySoakTest$1.run(LoadBalancingPolicySoakTest.java:203)
	at org.apache.brooklyn.test.Asserts$RunnableAdapter.call(Asserts.java:1277)
	at org.apache.brooklyn.test.Asserts.succeedsEventually(Asserts.java:930)
	at org.apache.brooklyn.test.Asserts.succeedsEventually(Asserts.java:854)
	at org.apache.brooklyn.policy.loadbalancing.LoadBalancingPolicySoakTest.runLoadBalancingSoakTest(LoadBalancingPolicySoakTest.java:178)
	at org.apache.brooklyn.policy.loadbalancing.LoadBalancingPolicySoakTest.testLoadBalancingQuickTest(LoadBalancingPolicySoakTest.java:57)


Results :

Failed tests: 
  LoadBalancingPolicySoakTest.testLoadBalancingQuickTest:57->runLoadBalancingSoakTest:178
» PropagatedRuntime

Tests run: 229, Failures: 1, Errors: 0, Skipped: 0

[JENKINS] Recording test results
[INFO] ------------------------------------------------------------------------
[INFO] Reactor Summary:
[INFO] 
[INFO] Brooklyn Server Root ............................... SUCCESS [ 11.846 s]
[INFO] Brooklyn Parent Project ............................ SUCCESS [ 15.351 s]
[INFO] Brooklyn Test Support Utilities .................... SUCCESS [ 26.690 s]
[INFO] Brooklyn Logback Includable Configuration .......... SUCCESS [ 11.636 s]
[INFO] Brooklyn Common Utilities .......................... SUCCESS [01:28 min]
[INFO] Brooklyn API ....................................... SUCCESS [ 11.929 s]
[INFO] CAMP Server Parent Project ......................... SUCCESS [  2.522 s]
[INFO] CAMP Base .......................................... SUCCESS [ 19.651 s]
[INFO] Brooklyn Test Support .............................. SUCCESS [ 11.545 s]
[INFO] Brooklyn REST Swagger Apidoc Utilities ............. SUCCESS [01:01 min]
[INFO] Brooklyn Logback Configuration ..................... SUCCESS [  7.807 s]
[INFO] CAMP Server ........................................ SUCCESS [ 27.464 s]
[INFO] CAMP Server Jersey ................................. SUCCESS [ 29.674 s]
[INFO] Brooklyn Felix Runtime ............................. SUCCESS [ 14.715 s]
[INFO] Brooklyn Groovy Utilities .......................... SUCCESS [ 10.529 s]
[INFO] Brooklyn Core ...................................... SUCCESS [11:08 min]
[INFO] Brooklyn Policies .................................. FAILURE [04:28 min]
[INFO] Brooklyn WinRM Software Entities ................... SKIPPED
[INFO] Brooklyn Secure JMXMP Agent ........................ SKIPPED
[INFO] Brooklyn JMX RMI Agent ............................. SKIPPED
[INFO] Brooklyn Jclouds Location Targets .................. SKIPPED
[INFO] Brooklyn Software Base ............................. SKIPPED
[INFO] Brooklyn CAMP REST API ............................. SKIPPED
[INFO] Brooklyn Hazelcast Storage ......................... SKIPPED
[INFO] Brooklyn Launcher Common ........................... SKIPPED
[INFO] Brooklyn REST API .................................. SKIPPED
[INFO] Brooklyn REST Resources ............................ SKIPPED
[INFO] Brooklyn REST Server ............................... SKIPPED
[INFO] Brooklyn Launcher .................................. SKIPPED
[INFO] Brooklyn Command Line Interface .................... SKIPPED
[INFO] Brooklyn REST Client ............................... SKIPPED
[INFO] Brooklyn REST Server with Jersey dependencies ...... SKIPPED
[INFO] Brooklyn Test Framework ............................ SKIPPED
[INFO] Brooklyn OSGi init ................................. SKIPPED
[INFO] Brooklyn Karaf ..................................... SKIPPED
[INFO] Brooklyn Karaf Features ............................ SKIPPED
[INFO] Brooklyn Karaf Distro .............................. SKIPPED
[INFO] Brooklyn Karaf Shell Commands ...................... SKIPPED
[INFO] Brooklyn Karaf pax-exam itest ...................... SKIPPED
[INFO] ------------------------------------------------------------------------
[INFO] BUILD FAILURE
[INFO] ------------------------------------------------------------------------
[INFO] Total time: 22:31 min
[INFO] Finished at: 2016-03-27T16:13:17+00:00
[INFO] Final Memory: 95M/611M
[INFO] ------------------------------------------------------------------------
[ERROR] Failed to execute goal org.apache.maven.plugins:maven-surefire-plugin:2.18.1:test
(default-test) on project brooklyn-policy: There are test failures.
[ERROR] 
[ERROR] Please refer to <https://builds.apache.org/job/brooklyn-server-master/ws/policy/target/surefire-reports>
for the individual test results.
[ERROR] -> [Help 1]
[ERROR] 
[ERROR] To see the full stack trace of the errors, re-run Maven with the -e switch.
[ERROR] Re-run Maven using the -X switch to enable full debug logging.
[ERROR] 
[ERROR] For more information about the errors and possible solutions, please read the following
articles:
[ERROR] [Help 1] http://cwiki.apache.org/confluence/display/MAVEN/MojoFailureException
[ERROR] 
[ERROR] After correcting the problems, you can resume the build with the command
[ERROR]   mvn <goals> -rf :brooklyn-policy
[JENKINS] Archiving <https://builds.apache.org/job/brooklyn-server-master/ws/policy/pom.xml>
to org.apache.brooklyn/brooklyn-policy/0.9.0-SNAPSHOT/brooklyn-policy-0.9.0-SNAPSHOT.pom
No artifacts from brooklyn-server-master » Brooklyn Policies #23 to compare, so performing
full copy of artifacts
[JENKINS] Archiving <https://builds.apache.org/job/brooklyn-server-master/ws/test-framework/pom.xml>
to org.apache.brooklyn/brooklyn-test-framework/0.9.0-SNAPSHOT/brooklyn-test-framework-0.9.0-SNAPSHOT.pom
No artifacts from brooklyn-server-master » Brooklyn Test Framework #23 to compare, so performing
full copy of artifacts
[JENKINS] Archiving <https://builds.apache.org/job/brooklyn-server-master/ws/storage/hazelcast/pom.xml>
to org.apache.brooklyn/brooklyn-storage-hazelcast/0.9.0-SNAPSHOT/brooklyn-storage-hazelcast-0.9.0-SNAPSHOT.pom
No artifacts from brooklyn-server-master » Brooklyn Hazelcast Storage #23 to compare, so
performing full copy of artifacts
[JENKINS] Archiving <https://builds.apache.org/job/brooklyn-server-master/ws/karaf/init/pom.xml>
to org.apache.brooklyn/brooklyn-karaf-init/0.9.0-SNAPSHOT/brooklyn-karaf-init-0.9.0-SNAPSHOT.pom
[JENKINS] Archiving <https://builds.apache.org/job/brooklyn-server-master/ws/pom.xml>
to org.apache.brooklyn/brooklyn-server/0.9.0-SNAPSHOT/brooklyn-server-0.9.0-SNAPSHOT.pom
No artifacts from brooklyn-server-master » Brooklyn Server Root #23 to compare, so performing
full copy of artifacts
[JENKINS] Archiving <https://builds.apache.org/job/brooklyn-server-master/ws/karaf/commands/pom.xml>
to org.apache.brooklyn/brooklyn-commands/0.9.0-SNAPSHOT/brooklyn-commands-0.9.0-SNAPSHOT.pom
[JENKINS] Archiving <https://builds.apache.org/job/brooklyn-server-master/ws/rest/rest-api/pom.xml>
to org.apache.brooklyn/brooklyn-rest-api/0.9.0-SNAPSHOT/brooklyn-rest-api-0.9.0-SNAPSHOT.pom
No artifacts from brooklyn-server-master » Brooklyn REST API #23 to compare, so performing
full copy of artifacts
[JENKINS] Archiving <https://builds.apache.org/job/brooklyn-server-master/ws/core/pom.xml>
to org.apache.brooklyn/brooklyn-core/0.9.0-SNAPSHOT/brooklyn-core-0.9.0-SNAPSHOT.pom
[JENKINS] Archiving <https://builds.apache.org/job/brooklyn-server-master/ws/core/target/brooklyn-core-0.9.0-SNAPSHOT.jar>
to org.apache.brooklyn/brooklyn-core/0.9.0-SNAPSHOT/brooklyn-core-0.9.0-SNAPSHOT.jar
[JENKINS] Archiving <https://builds.apache.org/job/brooklyn-server-master/ws/core/target/brooklyn-core-0.9.0-SNAPSHOT-tests.jar>
to org.apache.brooklyn/brooklyn-core/0.9.0-SNAPSHOT/brooklyn-core-0.9.0-SNAPSHOT-tests.jar
[JENKINS] Archiving <https://builds.apache.org/job/brooklyn-server-master/ws/core/target/brooklyn-core-0.9.0-SNAPSHOT-sources.jar>
to org.apache.brooklyn/brooklyn-core/0.9.0-SNAPSHOT/brooklyn-core-0.9.0-SNAPSHOT-sources.jar
[JENKINS] Archiving <https://builds.apache.org/job/brooklyn-server-master/ws/core/target/brooklyn-core-0.9.0-SNAPSHOT-test-sources.jar>
to org.apache.brooklyn/brooklyn-core/0.9.0-SNAPSHOT/brooklyn-core-0.9.0-SNAPSHOT-test-sources.jar
No artifacts from brooklyn-server-master » Brooklyn Core #23 to compare, so performing full
copy of artifacts
[JENKINS] Archiving <https://builds.apache.org/job/brooklyn-server-master/ws/logging/logback-xml/pom.xml>
to org.apache.brooklyn/brooklyn-logback-xml/0.9.0-SNAPSHOT/brooklyn-logback-xml-0.9.0-SNAPSHOT.pom
[JENKINS] Archiving <https://builds.apache.org/job/brooklyn-server-master/ws/logging/logback-xml/target/brooklyn-logback-xml-0.9.0-SNAPSHOT.jar>
to org.apache.brooklyn/brooklyn-logback-xml/0.9.0-SNAPSHOT/brooklyn-logback-xml-0.9.0-SNAPSHOT.jar
[JENKINS] Archiving <https://builds.apache.org/job/brooklyn-server-master/ws/logging/logback-xml/target/brooklyn-logback-xml-0.9.0-SNAPSHOT-sources.jar>
to org.apache.brooklyn/brooklyn-logback-xml/0.9.0-SNAPSHOT/brooklyn-logback-xml-0.9.0-SNAPSHOT-sources.jar
[JENKINS] Archiving <https://builds.apache.org/job/brooklyn-server-master/ws/logging/logback-xml/target/brooklyn-logback-xml-0.9.0-SNAPSHOT-test-sources.jar>
to org.apache.brooklyn/brooklyn-logback-xml/0.9.0-SNAPSHOT/brooklyn-logback-xml-0.9.0-SNAPSHOT-test-sources.jar
No artifacts from brooklyn-server-master » Brooklyn Logback Configuration #23 to compare,
so performing full copy of artifacts
[JENKINS] Archiving <https://builds.apache.org/job/brooklyn-server-master/ws/karaf/features/pom.xml>
to org.apache.brooklyn/brooklyn-features/0.9.0-SNAPSHOT/brooklyn-features-0.9.0-SNAPSHOT.pom
[JENKINS] Archiving <https://builds.apache.org/job/brooklyn-server-master/ws/rest/rest-resources/pom.xml>
to org.apache.brooklyn/brooklyn-rest-resources/0.9.0-SNAPSHOT/brooklyn-rest-resources-0.9.0-SNAPSHOT.pom
No artifacts from brooklyn-server-master » Brooklyn REST Resources #23 to compare, so performing
full copy of artifacts
[JENKINS] Archiving <https://builds.apache.org/job/brooklyn-server-master/ws/camp/camp-server/pom.xml>
to org.apache.brooklyn.camp/camp-server/0.9.0-SNAPSHOT/camp-server-0.9.0-SNAPSHOT.pom
[JENKINS] Archiving <https://builds.apache.org/job/brooklyn-server-master/ws/camp/camp-server/target/camp-server-0.9.0-SNAPSHOT.jar>
to org.apache.brooklyn.camp/camp-server/0.9.0-SNAPSHOT/camp-server-0.9.0-SNAPSHOT.jar
[JENKINS] Archiving <https://builds.apache.org/job/brooklyn-server-master/ws/camp/camp-server/target/camp-server-0.9.0-SNAPSHOT-tests.jar>
to org.apache.brooklyn.camp/camp-server/0.9.0-SNAPSHOT/camp-server-0.9.0-SNAPSHOT-tests.jar
[JENKINS] Archiving <https://builds.apache.org/job/brooklyn-server-master/ws/camp/camp-server/target/camp-server-0.9.0-SNAPSHOT-sources.jar>
to org.apache.brooklyn.camp/camp-server/0.9.0-SNAPSHOT/camp-server-0.9.0-SNAPSHOT-sources.jar
[JENKINS] Archiving <https://builds.apache.org/job/brooklyn-server-master/ws/camp/camp-server/target/camp-server-0.9.0-SNAPSHOT-test-sources.jar>
to org.apache.brooklyn.camp/camp-server/0.9.0-SNAPSHOT/camp-server-0.9.0-SNAPSHOT-test-sources.jar
No artifacts from brooklyn-server-master » CAMP Server #23 to compare, so performing full
copy of artifacts
[JENKINS] Archiving <https://builds.apache.org/job/brooklyn-server-master/ws/launcher-common/pom.xml>
to org.apache.brooklyn/brooklyn-launcher-common/0.9.0-SNAPSHOT/brooklyn-launcher-common-0.9.0-SNAPSHOT.pom
No artifacts from brooklyn-server-master » Brooklyn Launcher Common #23 to compare, so performing
full copy of artifacts
[JENKINS] Archiving <https://builds.apache.org/job/brooklyn-server-master/ws/utils/groovy/pom.xml>
to org.apache.brooklyn/brooklyn-utils-groovy/0.9.0-SNAPSHOT/brooklyn-utils-groovy-0.9.0-SNAPSHOT.pom
[JENKINS] Archiving <https://builds.apache.org/job/brooklyn-server-master/ws/utils/groovy/target/brooklyn-utils-groovy-0.9.0-SNAPSHOT.jar>
to org.apache.brooklyn/brooklyn-utils-groovy/0.9.0-SNAPSHOT/brooklyn-utils-groovy-0.9.0-SNAPSHOT.jar
[JENKINS] Archiving <https://builds.apache.org/job/brooklyn-server-master/ws/utils/groovy/target/brooklyn-utils-groovy-0.9.0-SNAPSHOT-tests.jar>
to org.apache.brooklyn/brooklyn-utils-groovy/0.9.0-SNAPSHOT/brooklyn-utils-groovy-0.9.0-SNAPSHOT-tests.jar
[JENKINS] Archiving <https://builds.apache.org/job/brooklyn-server-master/ws/utils/groovy/target/brooklyn-utils-groovy-0.9.0-SNAPSHOT-sources.jar>
to org.apache.brooklyn/brooklyn-utils-groovy/0.9.0-SNAPSHOT/brooklyn-utils-groovy-0.9.0-SNAPSHOT-sources.jar
[JENKINS] Archiving <https://builds.apache.org/job/brooklyn-server-master/ws/utils/groovy/target/brooklyn-utils-groovy-0.9.0-SNAPSHOT-test-sources.jar>
to org.apache.brooklyn/brooklyn-utils-groovy/0.9.0-SNAPSHOT/brooklyn-utils-groovy-0.9.0-SNAPSHOT-test-sources.jar
No artifacts from brooklyn-server-master » Brooklyn Groovy Utilities #23 to compare, so performing
full copy of artifacts
[JENKINS] Archiving <https://builds.apache.org/job/brooklyn-server-master/ws/utils/common/pom.xml>
to org.apache.brooklyn/brooklyn-utils-common/0.9.0-SNAPSHOT/brooklyn-utils-common-0.9.0-SNAPSHOT.pom
[JENKINS] Archiving <https://builds.apache.org/job/brooklyn-server-master/ws/utils/common/target/brooklyn-utils-common-0.9.0-SNAPSHOT.jar>
to org.apache.brooklyn/brooklyn-utils-common/0.9.0-SNAPSHOT/brooklyn-utils-common-0.9.0-SNAPSHOT.jar
[JENKINS] Archiving <https://builds.apache.org/job/brooklyn-server-master/ws/utils/common/target/brooklyn-utils-common-0.9.0-SNAPSHOT-tests.jar>
to org.apache.brooklyn/brooklyn-utils-common/0.9.0-SNAPSHOT/brooklyn-utils-common-0.9.0-SNAPSHOT-tests.jar
[JENKINS] Archiving <https://builds.apache.org/job/brooklyn-server-master/ws/utils/common/target/brooklyn-utils-common-0.9.0-SNAPSHOT-sources.jar>
to org.apache.brooklyn/brooklyn-utils-common/0.9.0-SNAPSHOT/brooklyn-utils-common-0.9.0-SNAPSHOT-sources.jar
[JENKINS] Archiving <https://builds.apache.org/job/brooklyn-server-master/ws/utils/common/target/brooklyn-utils-common-0.9.0-SNAPSHOT-test-sources.jar>
to org.apache.brooklyn/brooklyn-utils-common/0.9.0-SNAPSHOT/brooklyn-utils-common-0.9.0-SNAPSHOT-test-sources.jar
No artifacts from brooklyn-server-master » Brooklyn Common Utilities #23 to compare, so performing
full copy of artifacts
[JENKINS] Archiving <https://builds.apache.org/job/brooklyn-server-master/ws/locations/jclouds/pom.xml>
to org.apache.brooklyn/brooklyn-locations-jclouds/0.9.0-SNAPSHOT/brooklyn-locations-jclouds-0.9.0-SNAPSHOT.pom
No artifacts from brooklyn-server-master » Brooklyn Jclouds Location Targets #23 to compare,
so performing full copy of artifacts
[JENKINS] Archiving <https://builds.apache.org/job/brooklyn-server-master/ws/test-support/pom.xml>
to org.apache.brooklyn/brooklyn-test-support/0.9.0-SNAPSHOT/brooklyn-test-support-0.9.0-SNAPSHOT.pom
[JENKINS] Archiving <https://builds.apache.org/job/brooklyn-server-master/ws/test-support/target/brooklyn-test-support-0.9.0-SNAPSHOT.jar>
to org.apache.brooklyn/brooklyn-test-support/0.9.0-SNAPSHOT/brooklyn-test-support-0.9.0-SNAPSHOT.jar
[JENKINS] Archiving <https://builds.apache.org/job/brooklyn-server-master/ws/test-support/target/brooklyn-test-support-0.9.0-SNAPSHOT-sources.jar>
to org.apache.brooklyn/brooklyn-test-support/0.9.0-SNAPSHOT/brooklyn-test-support-0.9.0-SNAPSHOT-sources.jar
[JENKINS] Archiving <https://builds.apache.org/job/brooklyn-server-master/ws/test-support/target/brooklyn-test-support-0.9.0-SNAPSHOT-test-sources.jar>
to org.apache.brooklyn/brooklyn-test-support/0.9.0-SNAPSHOT/brooklyn-test-support-0.9.0-SNAPSHOT-test-sources.jar
No artifacts from brooklyn-server-master » Brooklyn Test Support #23 to compare, so performing
full copy of artifacts
[JENKINS] Archiving <https://builds.apache.org/job/brooklyn-server-master/ws/karaf/pom.xml>
to org.apache.brooklyn/brooklyn-karaf/0.9.0-SNAPSHOT/brooklyn-karaf-0.9.0-SNAPSHOT.pom
[JENKINS] Archiving <https://builds.apache.org/job/brooklyn-server-master/ws/utils/rt-felix/pom.xml>
to org.apache.brooklyn/brooklyn-rt-felix/0.9.0-SNAPSHOT/brooklyn-rt-felix-0.9.0-SNAPSHOT.pom
[JENKINS] Archiving <https://builds.apache.org/job/brooklyn-server-master/ws/utils/rt-felix/target/brooklyn-rt-felix-0.9.0-SNAPSHOT.jar>
to org.apache.brooklyn/brooklyn-rt-felix/0.9.0-SNAPSHOT/brooklyn-rt-felix-0.9.0-SNAPSHOT.jar
[JENKINS] Archiving <https://builds.apache.org/job/brooklyn-server-master/ws/utils/rt-felix/target/brooklyn-rt-felix-0.9.0-SNAPSHOT-tests.jar>
to org.apache.brooklyn/brooklyn-rt-felix/0.9.0-SNAPSHOT/brooklyn-rt-felix-0.9.0-SNAPSHOT-tests.jar
[JENKINS] Archiving <https://builds.apache.org/job/brooklyn-server-master/ws/utils/rt-felix/target/brooklyn-rt-felix-0.9.0-SNAPSHOT-sources.jar>
to org.apache.brooklyn/brooklyn-rt-felix/0.9.0-SNAPSHOT/brooklyn-rt-felix-0.9.0-SNAPSHOT-sources.jar
[JENKINS] Archiving <https://builds.apache.org/job/brooklyn-server-master/ws/utils/rt-felix/target/brooklyn-rt-felix-0.9.0-SNAPSHOT-test-sources.jar>
to org.apache.brooklyn/brooklyn-rt-felix/0.9.0-SNAPSHOT/brooklyn-rt-felix-0.9.0-SNAPSHOT-test-sources.jar
No artifacts from brooklyn-server-master » Brooklyn Felix Runtime #23 to compare, so performing
full copy of artifacts
[JENKINS] Archiving <https://builds.apache.org/job/brooklyn-server-master/ws/karaf/itest/pom.xml>
to org.apache.brooklyn/brooklyn-itest/0.9.0-SNAPSHOT/brooklyn-itest-0.9.0-SNAPSHOT.pom
[JENKINS] Archiving <https://builds.apache.org/job/brooklyn-server-master/ws/camp/camp-server-jersey/pom.xml>
to org.apache.brooklyn.camp/camp-server-jersey/0.9.0-SNAPSHOT/camp-server-jersey-0.9.0-SNAPSHOT.pom
[JENKINS] Archiving <https://builds.apache.org/job/brooklyn-server-master/ws/camp/camp-server-jersey/target/camp-server-jersey-0.9.0-SNAPSHOT.jar>
to org.apache.brooklyn.camp/camp-server-jersey/0.9.0-SNAPSHOT/camp-server-jersey-0.9.0-SNAPSHOT.jar
[JENKINS] Archiving <https://builds.apache.org/job/brooklyn-server-master/ws/camp/camp-server-jersey/target/camp-server-jersey-0.9.0-SNAPSHOT-sources.jar>
to org.apache.brooklyn.camp/camp-server-jersey/0.9.0-SNAPSHOT/camp-server-jersey-0.9.0-SNAPSHOT-sources.jar
[JENKINS] Archiving <https://builds.apache.org/job/brooklyn-server-master/ws/camp/camp-server-jersey/target/camp-server-jersey-0.9.0-SNAPSHOT-test-sources.jar>
to org.apache.brooklyn.camp/camp-server-jersey/0.9.0-SNAPSHOT/camp-server-jersey-0.9.0-SNAPSHOT-test-sources.jar
No artifacts from brooklyn-server-master » CAMP Server Jersey #23 to compare, so performing
full copy of artifacts
[JENKINS] Archiving <https://builds.apache.org/job/brooklyn-server-master/ws/software/winrm/pom.xml>
to org.apache.brooklyn/brooklyn-software-winrm/0.9.0-SNAPSHOT/brooklyn-software-winrm-0.9.0-SNAPSHOT.pom
No artifacts from brooklyn-server-master » Brooklyn WinRM Software Entities #23 to compare,
so performing full copy of artifacts
[JENKINS] Archiving <https://builds.apache.org/job/brooklyn-server-master/ws/rest/rest-server/pom.xml>
to org.apache.brooklyn/brooklyn-rest-server/0.9.0-SNAPSHOT/brooklyn-rest-server-0.9.0-SNAPSHOT.pom
No artifacts from brooklyn-server-master » Brooklyn REST Server #23 to compare, so performing
full copy of artifacts
[JENKINS] Archiving <https://builds.apache.org/job/brooklyn-server-master/ws/camp/camp-base/pom.xml>
to org.apache.brooklyn.camp/camp-base/0.9.0-SNAPSHOT/camp-base-0.9.0-SNAPSHOT.pom
[JENKINS] Archiving <https://builds.apache.org/job/brooklyn-server-master/ws/camp/camp-base/target/camp-base-0.9.0-SNAPSHOT.jar>
to org.apache.brooklyn.camp/camp-base/0.9.0-SNAPSHOT/camp-base-0.9.0-SNAPSHOT.jar
[JENKINS] Archiving <https://builds.apache.org/job/brooklyn-server-master/ws/camp/camp-base/target/camp-base-0.9.0-SNAPSHOT-tests.jar>
to org.apache.brooklyn.camp/camp-base/0.9.0-SNAPSHOT/camp-base-0.9.0-SNAPSHOT-tests.jar
[JENKINS] Archiving <https://builds.apache.org/job/brooklyn-server-master/ws/camp/camp-base/target/camp-base-0.9.0-SNAPSHOT-sources.jar>
to org.apache.brooklyn.camp/camp-base/0.9.0-SNAPSHOT/camp-base-0.9.0-SNAPSHOT-sources.jar
[JENKINS] Archiving <https://builds.apache.org/job/brooklyn-server-master/ws/camp/camp-base/target/camp-base-0.9.0-SNAPSHOT-test-sources.jar>
to org.apache.brooklyn.camp/camp-base/0.9.0-SNAPSHOT/camp-base-0.9.0-SNAPSHOT-test-sources.jar
No artifacts from brooklyn-server-master » CAMP Base #23 to compare, so performing full copy
of artifacts
[JENKINS] Archiving <https://builds.apache.org/job/brooklyn-server-master/ws/rest/rest-client/pom.xml>
to org.apache.brooklyn/brooklyn-rest-client/0.9.0-SNAPSHOT/brooklyn-rest-client-0.9.0-SNAPSHOT.pom
No artifacts from brooklyn-server-master » Brooklyn REST Client #23 to compare, so performing
full copy of artifacts
[JENKINS] Archiving <https://builds.apache.org/job/brooklyn-server-master/ws/karaf/apache-brooklyn/pom.xml>
to org.apache.brooklyn/apache-brooklyn/0.9.0-SNAPSHOT/apache-brooklyn-0.9.0-SNAPSHOT.pom
[JENKINS] Archiving <https://builds.apache.org/job/brooklyn-server-master/ws/utils/jmx/jmxmp-ssl-agent/pom.xml>
to org.apache.brooklyn/brooklyn-jmxmp-agent/0.9.0-SNAPSHOT/brooklyn-jmxmp-agent-0.9.0-SNAPSHOT.pom
No artifacts from brooklyn-server-master » Brooklyn Secure JMXMP Agent #23 to compare, so
performing full copy of artifacts
[JENKINS] Archiving <https://builds.apache.org/job/brooklyn-server-master/ws/utils/jmx/jmxrmi-agent/pom.xml>
to org.apache.brooklyn/brooklyn-jmxrmi-agent/0.9.0-SNAPSHOT/brooklyn-jmxrmi-agent-0.9.0-SNAPSHOT.pom
No artifacts from brooklyn-server-master » Brooklyn JMX RMI Agent #23 to compare, so performing
full copy of artifacts
[JENKINS] Archiving <https://builds.apache.org/job/brooklyn-server-master/ws/camp/camp-brooklyn/pom.xml>
to org.apache.brooklyn/brooklyn-camp/0.9.0-SNAPSHOT/brooklyn-camp-0.9.0-SNAPSHOT.pom
No artifacts from brooklyn-server-master » Brooklyn CAMP REST API #23 to compare, so performing
full copy of artifacts
[JENKINS] Archiving <https://builds.apache.org/job/brooklyn-server-master/ws/parent/pom.xml>
to org.apache.brooklyn/brooklyn-parent/0.9.0-SNAPSHOT/brooklyn-parent-0.9.0-SNAPSHOT.pom
No artifacts from brooklyn-server-master » Brooklyn Parent Project #23 to compare, so performing
full copy of artifacts
[JENKINS] Archiving <https://builds.apache.org/job/brooklyn-server-master/ws/server-cli/pom.xml>
to org.apache.brooklyn/brooklyn-cli/0.9.0-SNAPSHOT/brooklyn-cli-0.9.0-SNAPSHOT.pom
No artifacts from brooklyn-server-master » Brooklyn Command Line Interface #23 to compare,
so performing full copy of artifacts
[JENKINS] Archiving <https://builds.apache.org/job/brooklyn-server-master/ws/software/base/pom.xml>
to org.apache.brooklyn/brooklyn-software-base/0.9.0-SNAPSHOT/brooklyn-software-base-0.9.0-SNAPSHOT.pom
No artifacts from brooklyn-server-master » Brooklyn Software Base #23 to compare, so performing
full copy of artifacts
[JENKINS] Archiving <https://builds.apache.org/job/brooklyn-server-master/ws/logging/logback-includes/pom.xml>
to org.apache.brooklyn/brooklyn-logback-includes/0.9.0-SNAPSHOT/brooklyn-logback-includes-0.9.0-SNAPSHOT.pom
[JENKINS] Archiving <https://builds.apache.org/job/brooklyn-server-master/ws/logging/logback-includes/target/brooklyn-logback-includes-0.9.0-SNAPSHOT.jar>
to org.apache.brooklyn/brooklyn-logback-includes/0.9.0-SNAPSHOT/brooklyn-logback-includes-0.9.0-SNAPSHOT.jar
[JENKINS] Archiving <https://builds.apache.org/job/brooklyn-server-master/ws/logging/logback-includes/target/brooklyn-logback-includes-0.9.0-SNAPSHOT-sources.jar>
to org.apache.brooklyn/brooklyn-logback-includes/0.9.0-SNAPSHOT/brooklyn-logback-includes-0.9.0-SNAPSHOT-sources.jar
[JENKINS] Archiving <https://builds.apache.org/job/brooklyn-server-master/ws/logging/logback-includes/target/brooklyn-logback-includes-0.9.0-SNAPSHOT-test-sources.jar>
to org.apache.brooklyn/brooklyn-logback-includes/0.9.0-SNAPSHOT/brooklyn-logback-includes-0.9.0-SNAPSHOT-test-sources.jar
No artifacts from brooklyn-server-master » Brooklyn Logback Includable Configuration #23
to compare, so performing full copy of artifacts
[JENKINS] Archiving <https://builds.apache.org/job/brooklyn-server-master/ws/launcher/pom.xml>
to org.apache.brooklyn/brooklyn-launcher/0.9.0-SNAPSHOT/brooklyn-launcher-0.9.0-SNAPSHOT.pom
No artifacts from brooklyn-server-master » Brooklyn Launcher #23 to compare, so performing
full copy of artifacts
[JENKINS] Archiving <https://builds.apache.org/job/brooklyn-server-master/ws/utils/rest-swagger/pom.xml>
to org.apache.brooklyn/brooklyn-utils-rest-swagger/0.9.0-SNAPSHOT/brooklyn-utils-rest-swagger-0.9.0-SNAPSHOT.pom
[JENKINS] Archiving <https://builds.apache.org/job/brooklyn-server-master/ws/utils/rest-swagger/target/brooklyn-utils-rest-swagger-0.9.0-SNAPSHOT.jar>
to org.apache.brooklyn/brooklyn-utils-rest-swagger/0.9.0-SNAPSHOT/brooklyn-utils-rest-swagger-0.9.0-SNAPSHOT.jar
[JENKINS] Archiving <https://builds.apache.org/job/brooklyn-server-master/ws/utils/rest-swagger/target/brooklyn-utils-rest-swagger-0.9.0-SNAPSHOT-sources.jar>
to org.apache.brooklyn/brooklyn-utils-rest-swagger/0.9.0-SNAPSHOT/brooklyn-utils-rest-swagger-0.9.0-SNAPSHOT-sources.jar
[JENKINS] Archiving <https://builds.apache.org/job/brooklyn-server-master/ws/utils/rest-swagger/target/brooklyn-utils-rest-swagger-0.9.0-SNAPSHOT-test-sources.jar>
to org.apache.brooklyn/brooklyn-utils-rest-swagger/0.9.0-SNAPSHOT/brooklyn-utils-rest-swagger-0.9.0-SNAPSHOT-test-sources.jar
No artifacts from brooklyn-server-master » Brooklyn REST Swagger Apidoc Utilities #23 to
compare, so performing full copy of artifacts
[JENKINS] Archiving <https://builds.apache.org/job/brooklyn-server-master/ws/utils/test-support/pom.xml>
to org.apache.brooklyn/brooklyn-utils-test-support/0.9.0-SNAPSHOT/brooklyn-utils-test-support-0.9.0-SNAPSHOT.pom
[JENKINS] Archiving <https://builds.apache.org/job/brooklyn-server-master/ws/utils/test-support/target/brooklyn-utils-test-support-0.9.0-SNAPSHOT.jar>
to org.apache.brooklyn/brooklyn-utils-test-support/0.9.0-SNAPSHOT/brooklyn-utils-test-support-0.9.0-SNAPSHOT.jar
[JENKINS] Archiving <https://builds.apache.org/job/brooklyn-server-master/ws/utils/test-support/target/brooklyn-utils-test-support-0.9.0-SNAPSHOT-sources.jar>
to org.apache.brooklyn/brooklyn-utils-test-support/0.9.0-SNAPSHOT/brooklyn-utils-test-support-0.9.0-SNAPSHOT-sources.jar
[JENKINS] Archiving <https://builds.apache.org/job/brooklyn-server-master/ws/utils/test-support/target/brooklyn-utils-test-support-0.9.0-SNAPSHOT-test-sources.jar>
to org.apache.brooklyn/brooklyn-utils-test-support/0.9.0-SNAPSHOT/brooklyn-utils-test-support-0.9.0-SNAPSHOT-test-sources.jar
No artifacts from brooklyn-server-master » Brooklyn Test Support Utilities #23 to compare,
so performing full copy of artifacts
[JENKINS] Archiving <https://builds.apache.org/job/brooklyn-server-master/ws/camp/pom.xml>
to org.apache.brooklyn.camp/camp-parent/0.9.0-SNAPSHOT/camp-parent-0.9.0-SNAPSHOT.pom
No artifacts from brooklyn-server-master » CAMP Server Parent Project #23 to compare, so
performing full copy of artifacts
[JENKINS] Archiving <https://builds.apache.org/job/brooklyn-server-master/ws/api/pom.xml>
to org.apache.brooklyn/brooklyn-api/0.9.0-SNAPSHOT/brooklyn-api-0.9.0-SNAPSHOT.pom
[JENKINS] Archiving <https://builds.apache.org/job/brooklyn-server-master/ws/api/target/brooklyn-api-0.9.0-SNAPSHOT.jar>
to org.apache.brooklyn/brooklyn-api/0.9.0-SNAPSHOT/brooklyn-api-0.9.0-SNAPSHOT.jar
[JENKINS] Archiving <https://builds.apache.org/job/brooklyn-server-master/ws/api/target/brooklyn-api-0.9.0-SNAPSHOT-sources.jar>
to org.apache.brooklyn/brooklyn-api/0.9.0-SNAPSHOT/brooklyn-api-0.9.0-SNAPSHOT-sources.jar
[JENKINS] Archiving <https://builds.apache.org/job/brooklyn-server-master/ws/api/target/brooklyn-api-0.9.0-SNAPSHOT-test-sources.jar>
to org.apache.brooklyn/brooklyn-api/0.9.0-SNAPSHOT/brooklyn-api-0.9.0-SNAPSHOT-test-sources.jar
No artifacts from brooklyn-server-master » Brooklyn API #23 to compare, so performing full
copy of artifacts
[JENKINS] Archiving <https://builds.apache.org/job/brooklyn-server-master/ws/rest/rest-server-jersey/pom.xml>
to org.apache.brooklyn/brooklyn-rest-server-jersey/0.9.0-SNAPSHOT/brooklyn-rest-server-jersey-0.9.0-SNAPSHOT.pom
No artifacts from brooklyn-server-master » Brooklyn REST Server with Jersey dependencies
#23 to compare, so performing full copy of artifacts
channel stopped

Mime
View raw message