brooklyn-dev mailing list archives

Site index · List index
Message view « Date » · « Thread »
Top « Date » · « Thread »
From Apache Jenkins Server <jenk...@builds.apache.org>
Subject Build failed in Jenkins: incubator-brooklyn-master-windows #424
Date Fri, 04 Mar 2016 13:07:33 GMT
See <https://builds.apache.org/job/incubator-brooklyn-master-windows/424/>

------------------------------------------
[...truncated 71026 lines...]
[INFO] [INFO] 
[INFO] [INFO] --- maven-jar-plugin:2.6:test-jar (test-jar-creation) @ brooklyn-sample ---
[INFO] [INFO] Building jar: F:\jenkins\jenkins-slave\workspace\incubator-brooklyn-master-windows\brooklyn-dist\archetypes\quickstart\target\test-classes\projects\integration-test-1\project\brooklyn-sample\target\brooklyn-sample-0.1.0-SNAPSHOT-tests.jar
[INFO] [INFO] 
[INFO] [INFO] --- maven-install-plugin:2.5.2:install (default-install) @ brooklyn-sample ---
[INFO] [INFO] Installing F:\jenkins\jenkins-slave\workspace\incubator-brooklyn-master-windows\brooklyn-dist\archetypes\quickstart\target\test-classes\projects\integration-test-1\project\brooklyn-sample\target\brooklyn-sample-0.1.0-SNAPSHOT.jar
to F:\jenkins\jenkins-slave\maven-repositories\0\com\acme\sample\brooklyn-sample\0.1.0-SNAPSHOT\brooklyn-sample-0.1.0-SNAPSHOT.jar
[INFO] [INFO] Installing F:\jenkins\jenkins-slave\workspace\incubator-brooklyn-master-windows\brooklyn-dist\archetypes\quickstart\target\test-classes\projects\integration-test-1\project\brooklyn-sample\pom.xml
to F:\jenkins\jenkins-slave\maven-repositories\0\com\acme\sample\brooklyn-sample\0.1.0-SNAPSHOT\brooklyn-sample-0.1.0-SNAPSHOT.pom
[INFO] [INFO] Installing F:\jenkins\jenkins-slave\workspace\incubator-brooklyn-master-windows\brooklyn-dist\archetypes\quickstart\target\test-classes\projects\integration-test-1\project\brooklyn-sample\target\brooklyn-sample-0.1.0-SNAPSHOT-tests.jar
to F:\jenkins\jenkins-slave\maven-repositories\0\com\acme\sample\brooklyn-sample\0.1.0-SNAPSHOT\brooklyn-sample-0.1.0-SNAPSHOT-tests.jar
[INFO] [INFO] ------------------------------------------------------------------------
[INFO] [INFO] BUILD SUCCESS
[INFO] [INFO] ------------------------------------------------------------------------
[INFO] [INFO] Total time: 38.089s
[INFO] [INFO] Finished at: Fri Mar 04 05:06:46 PST 2016
[INFO] [INFO] Final Memory: 44M/247M
[INFO] [INFO] ------------------------------------------------------------------------
[INFO] Post-archetype-generation invoker exit code: 0
[JENKINS] Recording test results
[INFO] 
[INFO] --- apache-rat-plugin:0.11:check (default) @ brooklyn-archetype-quickstart ---
[INFO] 51 implicit excludes (use -debug for more details).
[INFO] Exclude: sandbox/**
[INFO] Exclude: release/**
[INFO] Exclude: README.md
[INFO] Exclude: **/nbactions.xml
[INFO] Exclude: **/nb-configuration.xml
[INFO] Exclude: **/src/main/resources/archetype-resources/**/*
[INFO] Exclude: **/src/test/resources/projects/integration-test-1/goal.txt
[INFO] Exclude: **/src/test/resources/projects/integration-test-1/reference/**/*
[INFO] Exclude: **/src/main/java/sample/**/*Sample*.java
[INFO] Exclude: **/src/main/resources/logback-custom.xml
[INFO] Exclude: **/src/brooklyn-sample/README.md
[INFO] Exclude: **/src/brooklyn-sample/pom.xml
[INFO] Exclude: **/src/brooklyn-sample/src/main/assembly/files/conf/*
[INFO] Exclude: **/src/brooklyn-sample/src/main/java/**/*.java
[INFO] Exclude: **/src/brooklyn-sample/src/main/resources/logback-custom.xml
[INFO] Exclude: **/src/brooklyn-sample/src/test/java/**/*.java
[INFO] Exclude: **/.git/**
[INFO] Exclude: **/.gitignore
[INFO] Exclude: **/.repository/**
[INFO] Exclude: **/.idea/**
[INFO] Exclude: **/*.iml
[INFO] Exclude: **/.classpath/**
[INFO] Exclude: **/.project
[INFO] Exclude: **/.settings/**
[INFO] Exclude: **/*.log
[INFO] Exclude: **/brooklyn*.log.*
[INFO] Exclude: **/target/**
[INFO] Exclude: ignored/**
[INFO] Exclude: LICENSE.md
[INFO] Exclude: **/src/main/license/**
[INFO] Exclude: **/src/test/license/**
[INFO] Exclude: **/MANIFEST.MF
[INFO] Exclude: **/test-output/**
[INFO] Exclude: **/*.pem.pub
[INFO] Exclude: **/*.pem
[INFO] Exclude: **/*_rsa.pub
[INFO] Exclude: **/*_rsa
[INFO] Exclude: **/*.svg
[INFO] Exclude: **/*.crt
[INFO] Exclude: **/*.csr
[INFO] Exclude: **/*.key
[INFO] Exclude: **/*.key.org
[INFO] Exclude: **/*.psd
[INFO] Exclude: **/*.json
[INFO] Exclude: **/*.plxarc
[INFO] Exclude: **/src/test/resources/org/apache/brooklyn/entity/software/base/template_with_extra_substitutions.txt
[INFO] Exclude: **/src/main/resources/banner.txt
[INFO] Exclude: **/src/test/resources/ssl/certs/localhost/info.txt
[INFO] Exclude: **/src/main/history/dependencies.xml
[INFO] Exclude: **/sandbox/examples/src/main/scripts/amis.txt
[INFO] Exclude: docs/**
[INFO] 9 resources included (use -debug for more details)
[INFO] Rat check: Summary of files. Unapproved: 0 unknown: 0 generated: 0 approved: 7 licence.
[INFO] 
[INFO] --- maven-source-plugin:2.4:jar-no-fork (attach-sources) @ brooklyn-archetype-quickstart
---
[INFO] Building jar: F:\jenkins\jenkins-slave\workspace\incubator-brooklyn-master-windows\brooklyn-dist\archetypes\quickstart\target\brooklyn-archetype-quickstart-0.9.0-SNAPSHOT-sources.jar
[INFO] 
[INFO] --- maven-source-plugin:2.4:test-jar-no-fork (attach-sources) @ brooklyn-archetype-quickstart
---
[INFO] Building jar: F:\jenkins\jenkins-slave\workspace\incubator-brooklyn-master-windows\brooklyn-dist\archetypes\quickstart\target\brooklyn-archetype-quickstart-0.9.0-SNAPSHOT-test-sources.jar
[INFO] 
[INFO] --- maven-install-plugin:2.5.2:install (default-install) @ brooklyn-archetype-quickstart
---
[INFO] Installing F:\jenkins\jenkins-slave\workspace\incubator-brooklyn-master-windows\brooklyn-dist\archetypes\quickstart\target\brooklyn-archetype-quickstart-0.9.0-SNAPSHOT.jar
to f:\jenkins\jenkins-slave\maven-repositories\0\org\apache\brooklyn\brooklyn-archetype-quickstart\0.9.0-SNAPSHOT\brooklyn-archetype-quickstart-0.9.0-SNAPSHOT.jar
[INFO] Installing F:\jenkins\jenkins-slave\workspace\incubator-brooklyn-master-windows\brooklyn-dist\archetypes\quickstart\pom.xml
to f:\jenkins\jenkins-slave\maven-repositories\0\org\apache\brooklyn\brooklyn-archetype-quickstart\0.9.0-SNAPSHOT\brooklyn-archetype-quickstart-0.9.0-SNAPSHOT.pom
[INFO] Installing F:\jenkins\jenkins-slave\workspace\incubator-brooklyn-master-windows\brooklyn-dist\archetypes\quickstart\target\brooklyn-archetype-quickstart-0.9.0-SNAPSHOT-tests.jar
to f:\jenkins\jenkins-slave\maven-repositories\0\org\apache\brooklyn\brooklyn-archetype-quickstart\0.9.0-SNAPSHOT\brooklyn-archetype-quickstart-0.9.0-SNAPSHOT-tests.jar
[INFO] Installing F:\jenkins\jenkins-slave\workspace\incubator-brooklyn-master-windows\brooklyn-dist\archetypes\quickstart\target\brooklyn-archetype-quickstart-0.9.0-SNAPSHOT-sources.jar
to f:\jenkins\jenkins-slave\maven-repositories\0\org\apache\brooklyn\brooklyn-archetype-quickstart\0.9.0-SNAPSHOT\brooklyn-archetype-quickstart-0.9.0-SNAPSHOT-sources.jar
[INFO] Installing F:\jenkins\jenkins-slave\workspace\incubator-brooklyn-master-windows\brooklyn-dist\archetypes\quickstart\target\brooklyn-archetype-quickstart-0.9.0-SNAPSHOT-test-sources.jar
to f:\jenkins\jenkins-slave\maven-repositories\0\org\apache\brooklyn\brooklyn-archetype-quickstart\0.9.0-SNAPSHOT\brooklyn-archetype-quickstart-0.9.0-SNAPSHOT-test-sources.jar
[INFO] 
[INFO] --- maven-archetype-plugin:2.3:update-local-catalog (default-update-local-catalog)
@ brooklyn-archetype-quickstart ---
[JENKINS] Archiving disabled
[INFO]                                                                         
[INFO] ------------------------------------------------------------------------
[INFO] Building Brooklyn Root 0.9.0-SNAPSHOT
[INFO] ------------------------------------------------------------------------
[INFO] 
[INFO] --- maven-clean-plugin:2.5:clean (default-clean) @ brooklyn ---
[INFO] Deleting <https://builds.apache.org/job/incubator-brooklyn-master-windows/ws/target>
[INFO] 
[INFO] --- maven-remote-resources-plugin:1.5:process (default) @ brooklyn ---
[INFO] 
[INFO] --- maven-site-plugin:3.4:attach-descriptor (attach-descriptor) @ brooklyn ---
[INFO] 
[INFO] --- maven-install-plugin:2.5.2:install (default-install) @ brooklyn ---
[INFO] Installing <https://builds.apache.org/job/incubator-brooklyn-master-windows/ws/pom.xml>
to f:\jenkins\jenkins-slave\maven-repositories\0\org\apache\brooklyn\brooklyn\0.9.0-SNAPSHOT\brooklyn-0.9.0-SNAPSHOT.pom
[JENKINS] Archiving disabled
[INFO] ------------------------------------------------------------------------
[INFO] Reactor Summary:
[INFO] 
[INFO] Brooklyn REST JavaScript Web GUI .................. SUCCESS [1:14.862s]
[INFO] Brooklyn Server Root .............................. SUCCESS [0.566s]
[INFO] Brooklyn Parent Project ........................... SUCCESS [9.220s]
[INFO] Brooklyn Test Support Utilities ................... SUCCESS [12.637s]
[INFO] Brooklyn Logback Includable Configuration ......... SUCCESS [2.166s]
[INFO] Brooklyn Common Utilities ......................... SUCCESS [41.427s]
[INFO] Brooklyn API ...................................... SUCCESS [7.282s]
[INFO] CAMP Server Parent Project ........................ SUCCESS [1.336s]
[INFO] CAMP Base ......................................... SUCCESS [5.412s]
[INFO] Brooklyn Test Support ............................. SUCCESS [3.045s]
[INFO] Brooklyn REST Swagger Apidoc Utilities ............ SUCCESS [15.350s]
[INFO] Brooklyn Logback Configuration .................... SUCCESS [2.001s]
[INFO] CAMP Server ....................................... SUCCESS [11.469s]
[INFO] Brooklyn OSGi Utils ............................... SUCCESS [4.032s]
[INFO] Brooklyn Felix Runtime ............................ SUCCESS [5.333s]
[INFO] Brooklyn Groovy Utilities ......................... SUCCESS [3.739s]
[INFO] Brooklyn Core ..................................... SUCCESS [5:46.293s]
[INFO] Brooklyn Policies ................................. SUCCESS [2:23.129s]
[INFO] Brooklyn WinRM Software Entities .................. SUCCESS [9.872s]
[INFO] Brooklyn Secure JMXMP Agent ....................... SUCCESS [13.795s]
[INFO] Brooklyn JMX RMI Agent ............................ SUCCESS [2.008s]
[INFO] Brooklyn Jclouds Location Targets ................. SUCCESS [34.989s]
[INFO] Brooklyn Software Base ............................ SUCCESS [7:01.273s]
[INFO] Brooklyn CAMP REST API ............................ SUCCESS [3:45.880s]
[INFO] Brooklyn Hazelcast Storage ........................ SUCCESS [4.593s]
[INFO] Brooklyn REST API ................................. SUCCESS [20.315s]
[INFO] Brooklyn REST Server .............................. SUCCESS [1:45.408s]
[INFO] Brooklyn Launcher ................................. SUCCESS [56.835s]
[INFO] Brooklyn Command Line Interface ................... SUCCESS [21.976s]
[INFO] Brooklyn REST Client .............................. SUCCESS [22.746s]
[INFO] Brooklyn Test Framework ........................... SUCCESS [1:19.411s]
[INFO] Brooklyn Karaf .................................... SUCCESS [0.148s]
[INFO] Brooklyn Karaf Features ........................... SUCCESS [3.827s]
[INFO] Brooklyn Karaf Distro ............................. SUCCESS [20.758s]
[INFO] Brooklyn Karaf Shell Commands ..................... SUCCESS [7.019s]
[INFO] Brooklyn Karaf pax-exam itest ..................... SUCCESS [1:46.284s]
[INFO] Brooklyn Library Root ............................. SUCCESS [25.671s]
[INFO] Brooklyn Network Software Entities ................ SUCCESS [6.164s]
[INFO] Brooklyn OSGi Software Entities ................... SUCCESS [4.123s]
[INFO] Brooklyn Database Software Entities ............... SUCCESS [6.658s]
[INFO] Brooklyn Web App Software Entities ................ FAILURE [2:30.955s]
[INFO] Brooklyn Messaging Software Entities .............. SUCCESS [10.922s]
[INFO] Brooklyn NoSQL Data Store Software Entities ....... SKIPPED
[INFO] Brooklyn Monitoring Software Entities ............. SUCCESS [5.684s]
[INFO] Brooklyn QA ....................................... SKIPPED
[INFO] Brooklyn Examples Aggregator Project .............. SUCCESS [0.755s]
[INFO] Brooklyn Examples Aggregator Project - Webapps .... SUCCESS [0.564s]
[INFO] hello-world-webapp Maven Webapp ................... SUCCESS [2.284s]
[INFO] hello-world-sql-webapp Maven Webapp ............... SUCCESS [2.903s]
[INFO] Brooklyn Simple Web Cluster Example ............... SKIPPED
[INFO] Brooklyn Global Web Fabric Example ................ SKIPPED
[INFO] Brooklyn Simple Messaging Publish-Subscribe Example  SUCCESS [8.624s]
[INFO] Brooklyn NoSQL Cluster Examples ................... SKIPPED
[INFO] Brooklyn Downstream Project Parent ................ SUCCESS [0.339s]
[INFO] Brooklyn Dist Root ................................ SUCCESS [0.769s]
[INFO] Brooklyn All Things ............................... SKIPPED
[INFO] Brooklyn Distribution ............................. SKIPPED
[INFO] Brooklyn Vagrant Getting Started Environment ...... SUCCESS [2.191s]
[INFO] Brooklyn Quick-Start Project Archetype ............ SUCCESS [42.641s]
[INFO] Brooklyn Root ..................................... SUCCESS [0.089s]
[INFO] ------------------------------------------------------------------------
[INFO] BUILD FAILURE
[INFO] ------------------------------------------------------------------------
[INFO] Total time: 35:43.077s
[INFO] Finished at: Fri Mar 04 05:06:47 PST 2016
[INFO] Final Memory: 124M/247M
[INFO] ------------------------------------------------------------------------
[JENKINS] Archiving disabled
[JENKINS] Archiving disabled
[JENKINS] Archiving disabled
[JENKINS] Archiving disabled
[JENKINS] Archiving disabled
[JENKINS] Archiving disabled
[JENKINS] Archiving disabled
[JENKINS] Archiving disabled
[JENKINS] Archiving disabled
[JENKINS] Archiving disabled
[JENKINS] Archiving disabled
[JENKINS] Archiving disabled
[JENKINS] Archiving disabled
[JENKINS] Archiving disabled
[JENKINS] Archiving disabled
[JENKINS] Archiving disabled
[JENKINS] Archiving disabled
[JENKINS] Archiving disabled
[JENKINS] Archiving disabled
[JENKINS] Archiving disabled
[JENKINS] Archiving disabled
[JENKINS] Archiving disabled
[JENKINS] Archiving disabled
[JENKINS] Archiving disabled
[JENKINS] Archiving disabled
[JENKINS] Archiving disabled
[JENKINS] Archiving disabled
[JENKINS] Archiving disabled
[JENKINS] Archiving disabled
[JENKINS] Archiving disabled
[JENKINS] Archiving disabled
[JENKINS] Archiving disabled
[JENKINS] Archiving disabled
[JENKINS] Archiving disabled
[JENKINS] Archiving disabled
[JENKINS] Archiving disabled
[JENKINS] Archiving disabled
[JENKINS] Archiving disabled
[JENKINS] Archiving disabled
[JENKINS] Archiving disabled
[JENKINS] Archiving disabled
[JENKINS] Archiving disabled
[JENKINS] Archiving disabled
[JENKINS] Archiving disabled
[JENKINS] Archiving disabled
[JENKINS] Archiving disabled
[JENKINS] Archiving disabled
[JENKINS] Archiving disabled
[JENKINS] Archiving disabled
[JENKINS] Archiving disabled
[JENKINS] Archiving disabled
[JENKINS] Archiving disabled
[JENKINS] Archiving disabled
[JENKINS] Archiving disabled
[JENKINS] Archiving disabled
[JENKINS] Archiving disabled
[JENKINS] Archiving disabled
[JENKINS] Archiving disabled
[JENKINS] Archiving disabled
[JENKINS] Archiving disabled
Waiting for Jenkins to finish collecting data
[ERROR] Failed to execute goal org.apache.maven.plugins:maven-surefire-plugin:2.18.1:test
(default-test) on project brooklyn-software-webapp: There are test failures.
[ERROR] 
[ERROR] Please refer to F:\jenkins\jenkins-slave\workspace\incubator-brooklyn-master-windows\brooklyn-library\software\webapp\target\surefire-reports
for the individual test results.
[ERROR] -> [Help 1]
[ERROR] 
[ERROR] To see the full stack trace of the errors, re-run Maven with the -e switch.
[ERROR] Re-run Maven using the -X switch to enable full debug logging.
[ERROR] 
[ERROR] For more information about the errors and possible solutions, please read the following
articles:
[ERROR] [Help 1] http://cwiki.apache.org/confluence/display/MAVEN/MojoFailureException
[ERROR] 
[ERROR] After correcting the problems, you can resume the build with the command
[ERROR]   mvn <goals> -rf :brooklyn-software-webapp
channel stopped

Mime
View raw message