brooklyn-dev mailing list archives

Site index · List index
Message view « Date » · « Thread »
Top « Date » · « Thread »
From Apache Jenkins Server <jenk...@builds.apache.org>
Subject Build failed in Jenkins: brooklyn-master-build #4
Date Fri, 05 Feb 2016 01:22:38 GMT
See <https://builds.apache.org/job/brooklyn-master-build/4/>

------------------------------------------
[...truncated 20315 lines...]
2016-02-05 01:21:34,441 INFO  TESTNG INVOKING: "Surefire test" - org.apache.brooklyn.core.enricher.EnricherConfigTest.testConfigReturnsDefaultValueIfNotSet()
2016-02-05 01:21:34,442 INFO  TESTNG PASSED: "Surefire test" - org.apache.brooklyn.core.enricher.EnricherConfigTest.testConfigReturnsDefaultValueIfNotSet()
finished in 1 ms
2016-02-05 01:21:34,443 INFO  TESTNG INVOKING CONFIGURATION: "Surefire test" - @AfterMethod
org.apache.brooklyn.core.test.BrooklynMgmtUnitTestSupport.tearDown()
2016-02-05 01:21:34,446 INFO  TESTNG PASSED CONFIGURATION: "Surefire test" - @AfterMethod
org.apache.brooklyn.core.test.BrooklynMgmtUnitTestSupport.tearDown() finished in 4 ms
2016-02-05 01:21:34,446 INFO  TESTNG INVOKING CONFIGURATION: "Surefire test" - @BeforeMethod
org.apache.brooklyn.core.test.BrooklynAppUnitTestSupport.setUp()
2016-02-05 01:21:34,465 INFO  TESTNG PASSED CONFIGURATION: "Surefire test" - @BeforeMethod
org.apache.brooklyn.core.test.BrooklynAppUnitTestSupport.setUp() finished in 19 ms
2016-02-05 01:21:34,465 INFO  TESTNG INVOKING: "Surefire test" - org.apache.brooklyn.core.enricher.EnricherConfigTest.testConfigSetToGroovyTruthFalseIsAvailable()
2016-02-05 01:21:34,466 INFO  TESTNG PASSED: "Surefire test" - org.apache.brooklyn.core.enricher.EnricherConfigTest.testConfigSetToGroovyTruthFalseIsAvailable()
finished in 1 ms
2016-02-05 01:21:34,467 INFO  TESTNG INVOKING CONFIGURATION: "Surefire test" - @AfterMethod
org.apache.brooklyn.core.test.BrooklynMgmtUnitTestSupport.tearDown()
2016-02-05 01:21:34,471 INFO  TESTNG PASSED CONFIGURATION: "Surefire test" - @AfterMethod
org.apache.brooklyn.core.test.BrooklynMgmtUnitTestSupport.tearDown() finished in 5 ms
2016-02-05 01:21:34,471 INFO  TESTNG INVOKING CONFIGURATION: "Surefire test" - @BeforeMethod
org.apache.brooklyn.core.test.BrooklynAppUnitTestSupport.setUp()
2016-02-05 01:21:34,490 INFO  TESTNG PASSED CONFIGURATION: "Surefire test" - @BeforeMethod
org.apache.brooklyn.core.test.BrooklynAppUnitTestSupport.setUp() finished in 19 ms
2016-02-05 01:21:34,490 INFO  TESTNG INVOKING: "Surefire test" - org.apache.brooklyn.core.enricher.EnricherConfigTest.testConfigSetToNullIsAvailable()
2016-02-05 01:21:34,491 INFO  TESTNG PASSED: "Surefire test" - org.apache.brooklyn.core.enricher.EnricherConfigTest.testConfigSetToNullIsAvailable()
finished in 1 ms
2016-02-05 01:21:34,492 INFO  TESTNG INVOKING CONFIGURATION: "Surefire test" - @AfterMethod
org.apache.brooklyn.core.test.BrooklynMgmtUnitTestSupport.tearDown()
2016-02-05 01:21:34,496 INFO  TESTNG PASSED CONFIGURATION: "Surefire test" - @AfterMethod
org.apache.brooklyn.core.test.BrooklynMgmtUnitTestSupport.tearDown() finished in 4 ms
2016-02-05 01:21:34,496 INFO  TESTNG INVOKING CONFIGURATION: "Surefire test" - @BeforeMethod
org.apache.brooklyn.core.test.BrooklynAppUnitTestSupport.setUp()
2016-02-05 01:21:34,515 INFO  TESTNG PASSED CONFIGURATION: "Surefire test" - @BeforeMethod
org.apache.brooklyn.core.test.BrooklynAppUnitTestSupport.setUp() finished in 19 ms
2016-02-05 01:21:34,515 INFO  TESTNG INVOKING: "Surefire test" - org.apache.brooklyn.core.enricher.EnricherConfigTest.testConfigSetterOverridesConstructorValue()
2016-02-05 01:21:34,516 INFO  TESTNG PASSED: "Surefire test" - org.apache.brooklyn.core.enricher.EnricherConfigTest.testConfigSetterOverridesConstructorValue()
finished in 1 ms
2016-02-05 01:21:34,516 INFO  TESTNG INVOKING CONFIGURATION: "Surefire test" - @AfterMethod
org.apache.brooklyn.core.test.BrooklynMgmtUnitTestSupport.tearDown()
2016-02-05 01:21:34,520 INFO  TESTNG PASSED CONFIGURATION: "Surefire test" - @AfterMethod
org.apache.brooklyn.core.test.BrooklynMgmtUnitTestSupport.tearDown() finished in 4 ms
2016-02-05 01:21:34,521 INFO  TESTNG INVOKING CONFIGURATION: "Surefire test" - @BeforeMethod
org.apache.brooklyn.core.test.BrooklynAppUnitTestSupport.setUp()
2016-02-05 01:21:34,538 INFO  TESTNG PASSED CONFIGURATION: "Surefire test" - @BeforeMethod
org.apache.brooklyn.core.test.BrooklynAppUnitTestSupport.setUp() finished in 18 ms
2016-02-05 01:21:34,538 INFO  TESTNG INVOKING: "Surefire test" - org.apache.brooklyn.core.enricher.EnricherConfigTest.testUnknownConfigPassedInAtConstructionIsWarnedAndIgnored()
2016-02-05 01:21:34,539 WARN  Unknown configuration key differentkey[ConfigKey:java.lang.String]
for policy MyEnricher{running=true, id=SM018TtJ}; ignoring
2016-02-05 01:21:34,540 INFO  TESTNG PASSED: "Surefire test" - org.apache.brooklyn.core.enricher.EnricherConfigTest.testUnknownConfigPassedInAtConstructionIsWarnedAndIgnored()
finished in 2 ms
2016-02-05 01:21:34,540 INFO  TESTNG INVOKING CONFIGURATION: "Surefire test" - @AfterMethod
org.apache.brooklyn.core.test.BrooklynMgmtUnitTestSupport.tearDown()
2016-02-05 01:21:34,544 INFO  TESTNG PASSED CONFIGURATION: "Surefire test" - @AfterMethod
org.apache.brooklyn.core.test.BrooklynMgmtUnitTestSupport.tearDown() finished in 4 ms
SUREFIRE-859: [GC 543169K->309448K(774144K), 0.0220090 secs]
2016-02-05 01:21:34,737 WARN  Task Task[LSM.publish(Application[HRtbRx1f].Sensor: service.notUp.indicators
(java.util.Map)={service.state=Application stopped} @ 1454635294344);[subscription-delivery-entity-HRtbRx1f[Application[HRtbRx1f]]]]@PKiKIPBB
is being finalized before completion
2016-02-05 01:21:34,738 WARN  Task Task[LSM.publish(Application[HRtbRx1f].Sensor: service.state.expected
(org.apache.brooklyn.core.entity.lifecycle.Lifecycle$Transition)=stopped @ 1454635294344 /
Fri Feb 05 01:21:34 UTC 2016 @ 1454635294344);[subscription-delivery-entity-HRtbRx1f[Application[HRtbRx1f]]]]@tb1IGNLX
is being finalized before completion
2016-02-05 01:21:34,848 INFO  TESTNG 
===============================================
    Surefire test
    Tests run: 1646, Failures: 1, Skips: 0
===============================================
2016-02-05 01:21:34,849 INFO  BrooklynLeakListener.onFinish attempting to terminate all extant
ManagementContexts: name=Surefire test; includedGroups=[]; excludedGroups=[Integration, Acceptance,
Live, Broken, WIP]; suiteName=Surefire suite; outDir=<https://builds.apache.org/job/brooklyn-master-build/ws/brooklyn-server/core/target/surefire-reports/Surefire>
suite: no org.apache.brooklyn.core.management.internal.LocalManagementContext available, so
skipped
SUREFIRE-859: [GC 546504K->310101K(773632K), 0.0237280 secs]
SUREFIRE-859: [GC 546707K->311513K(775168K), 0.0212590 secs]
Tests run: 1646, Failures: 1, Errors: 0, Skipped: 0, Time elapsed: 158.341 sec <<<
FAILURE! - in TestSuite
testInjectCertificateAuthority(org.apache.brooklyn.util.core.crypto.SecureKeysAndSignerTest)
 Time elapsed: 0.624 sec  <<< FAILURE!
java.lang.AssertionError: expected [true] but found [false]
	at org.testng.Assert.fail(Assert.java:94)
	at org.testng.Assert.failNotEquals(Assert.java:494)
	at org.testng.Assert.assertTrue(Assert.java:42)
	at org.testng.Assert.assertTrue(Assert.java:52)
	at org.apache.brooklyn.util.core.crypto.SecureKeysAndSignerTest.testInjectCertificateAuthority(SecureKeysAndSignerTest.java:91)

2016-02-05 01:21:37,575 INFO  Brooklyn shutdown: stopping entities [TestEntityImpl{id=VQmhu2Kb},
TestEntityImpl{id=pw4ixO6Q}, BlockingEntityImpl{id=JwvAu5zv}]

Results :

Failed tests: 
  SecureKeysAndSignerTest.testInjectCertificateAuthority:91 expected [true] but found [false]

Tests run: 1646, Failures: 1, Errors: 0, Skipped: 0

[JENKINS] Recording test results
[INFO] ------------------------------------------------------------------------
[INFO] Reactor Summary:
[INFO] 
[INFO] Brooklyn REST JavaScript Web GUI .................. SUCCESS [1:16.854s]
[INFO] Brooklyn Server Root .............................. SUCCESS [0.748s]
[INFO] Brooklyn Parent Project ........................... SUCCESS [9.380s]
[INFO] Brooklyn Test Support Utilities ................... SUCCESS [10.011s]
[INFO] Brooklyn Logback Includable Configuration ......... SUCCESS [3.379s]
[INFO] Brooklyn Common Utilities ......................... SUCCESS [30.272s]
[INFO] Brooklyn API ...................................... SUCCESS [4.976s]
[INFO] CAMP Server Parent Project ........................ SUCCESS [1.324s]
[INFO] CAMP Base ......................................... SUCCESS [6.820s]
[INFO] Brooklyn Test Support ............................. SUCCESS [4.074s]
[INFO] Brooklyn REST Swagger Apidoc Utilities ............ SUCCESS [17.199s]
[INFO] Brooklyn Logback Configuration .................... SUCCESS [2.699s]
[INFO] CAMP Server ....................................... SUCCESS [11.948s]
[INFO] Brooklyn OSGi Utils ............................... SUCCESS [5.761s]
[INFO] Brooklyn Felix Runtime ............................ SUCCESS [6.996s]
[INFO] Brooklyn Groovy Utilities ......................... SUCCESS [3.528s]
[INFO] Brooklyn Core ..................................... FAILURE [3:29.245s]
[INFO] Brooklyn Policies ................................. SKIPPED
[INFO] Brooklyn WinRM Software Entities .................. SKIPPED
[INFO] Brooklyn Secure JMXMP Agent ....................... SKIPPED
[INFO] Brooklyn JMX RMI Agent ............................ SKIPPED
[INFO] Brooklyn Jclouds Location Targets ................. SKIPPED
[INFO] Brooklyn Software Base ............................ SKIPPED
[INFO] Brooklyn CAMP REST API ............................ SKIPPED
[INFO] Brooklyn Hazelcast Storage ........................ SKIPPED
[INFO] Brooklyn REST API ................................. SKIPPED
[INFO] Brooklyn REST Server .............................. SKIPPED
[INFO] Brooklyn Launcher ................................. SKIPPED
[INFO] Brooklyn Command Line Interface ................... SKIPPED
[INFO] Brooklyn REST Client .............................. SKIPPED
[INFO] Brooklyn Test Framework ........................... SKIPPED
[INFO] Brooklyn Karaf .................................... SKIPPED
[INFO] Brooklyn Karaf Features ........................... SKIPPED
[INFO] Brooklyn Karaf Distro ............................. SKIPPED
[INFO] Brooklyn Karaf Shell Commands ..................... SKIPPED
[INFO] Brooklyn Karaf pax-exam itest ..................... SKIPPED
[INFO] Brooklyn Library Root ............................. SKIPPED
[INFO] Brooklyn Network Software Entities ................ SKIPPED
[INFO] Brooklyn OSGi Software Entities ................... SKIPPED
[INFO] Brooklyn Database Software Entities ............... SKIPPED
[INFO] Brooklyn Web App Software Entities ................ SKIPPED
[INFO] Brooklyn Messaging Software Entities .............. SKIPPED
[INFO] Brooklyn NoSQL Data Store Software Entities ....... SKIPPED
[INFO] Brooklyn Monitoring Software Entities ............. SKIPPED
[INFO] Brooklyn QA ....................................... SKIPPED
[INFO] Brooklyn Examples Aggregator Project .............. SKIPPED
[INFO] Brooklyn Examples Aggregator Project - Webapps .... SKIPPED
[INFO] hello-world-webapp Maven Webapp ................... SKIPPED
[INFO] hello-world-sql-webapp Maven Webapp ............... SKIPPED
[INFO] Brooklyn Simple Web Cluster Example ............... SKIPPED
[INFO] Brooklyn Global Web Fabric Example ................ SKIPPED
[INFO] Brooklyn Simple Messaging Publish-Subscribe Example  SKIPPED
[INFO] Brooklyn NoSQL Cluster Examples ................... SKIPPED
[INFO] Brooklyn Downstream Project Parent ................ SKIPPED
[INFO] Brooklyn Dist Root ................................ SKIPPED
[INFO] Brooklyn All Things ............................... SKIPPED
[INFO] Brooklyn Distribution ............................. SKIPPED
[INFO] Brooklyn Vagrant Getting Started Environment ...... SKIPPED
[INFO] Brooklyn Quick-Start Project Archetype ............ SKIPPED
[INFO] Brooklyn Root ..................................... SKIPPED
[INFO] ------------------------------------------------------------------------
[INFO] BUILD FAILURE
[INFO] ------------------------------------------------------------------------
[INFO] Total time: 7:26.369s
[INFO] Finished at: Fri Feb 05 01:21:40 UTC 2016
[INFO] Final Memory: 94M/500M
[INFO] ------------------------------------------------------------------------
Waiting for Jenkins to finish collecting data
[ERROR] Failed to execute goal org.apache.maven.plugins:maven-surefire-plugin:2.18.1:test
(default-test) on project brooklyn-core: There are test failures.
[ERROR] 
[ERROR] Please refer to <https://builds.apache.org/job/brooklyn-master-build/ws/brooklyn-server/core/target/surefire-reports>
for the individual test results.
[ERROR] -> [Help 1]
[ERROR] 
[ERROR] To see the full stack trace of the errors, re-run Maven with the -e switch.
[ERROR] Re-run Maven using the -X switch to enable full debug logging.
[ERROR] 
[ERROR] For more information about the errors and possible solutions, please read the following
articles:
[ERROR] [Help 1] http://cwiki.apache.org/confluence/display/MAVEN/MojoFailureException
[ERROR] 
[ERROR] After correcting the problems, you can resume the build with the command
[ERROR]   mvn <goals> -rf :brooklyn-core
[JENKINS] Archiving <https://builds.apache.org/job/brooklyn-master-build/ws/brooklyn-server/policy/pom.xml>
to org.apache.brooklyn/brooklyn-policy/0.9.0-SNAPSHOT/brooklyn-policy-0.9.0-SNAPSHOT.pom
[JENKINS] Archiving <https://builds.apache.org/job/brooklyn-master-build/ws/brooklyn-library/software/osgi/pom.xml>
to org.apache.brooklyn/brooklyn-software-osgi/0.9.0-SNAPSHOT/brooklyn-software-osgi-0.9.0-SNAPSHOT.pom
[JENKINS] Archiving <https://builds.apache.org/job/brooklyn-master-build/ws/brooklyn-library/examples/simple-messaging-pubsub/pom.xml>
to org.apache.brooklyn.example/brooklyn-example-simple-messaging-pubsub/0.9.0-SNAPSHOT/brooklyn-example-simple-messaging-pubsub-0.9.0-SNAPSHOT.pom
[JENKINS] Archiving <https://builds.apache.org/job/brooklyn-master-build/ws/brooklyn-server/pom.xml>
to org.apache.brooklyn/brooklyn-server/0.9.0-SNAPSHOT/brooklyn-server-0.9.0-SNAPSHOT.pom
[JENKINS] Archiving <https://builds.apache.org/job/brooklyn-master-build/ws/brooklyn-library/examples/webapps/hello-world-webapp/pom.xml>
to org.apache.brooklyn.example/brooklyn-example-hello-world-webapp/0.9.0-SNAPSHOT/brooklyn-example-hello-world-webapp-0.9.0-SNAPSHOT.pom
[JENKINS] Archiving <https://builds.apache.org/job/brooklyn-master-build/ws/brooklyn-server/core/pom.xml>
to org.apache.brooklyn/brooklyn-core/0.9.0-SNAPSHOT/brooklyn-core-0.9.0-SNAPSHOT.pom
[JENKINS] Archiving <https://builds.apache.org/job/brooklyn-master-build/ws/brooklyn-ui/pom.xml>
to org.apache.brooklyn/brooklyn-jsgui/0.9.0-SNAPSHOT/brooklyn-jsgui-0.9.0-SNAPSHOT.pom
[JENKINS] Archiving <https://builds.apache.org/job/brooklyn-master-build/ws/brooklyn-ui/target/brooklyn-jsgui-0.9.0-SNAPSHOT.war>
to org.apache.brooklyn/brooklyn-jsgui/0.9.0-SNAPSHOT/brooklyn-jsgui-0.9.0-SNAPSHOT.war
Compressed 1.89 MB of artifacts by 29.7% relative to #3
[JENKINS] Archiving <https://builds.apache.org/job/brooklyn-master-build/ws/brooklyn-server/utils/common/pom.xml>
to org.apache.brooklyn/brooklyn-utils-common/0.9.0-SNAPSHOT/brooklyn-utils-common-0.9.0-SNAPSHOT.pom
[JENKINS] Archiving <https://builds.apache.org/job/brooklyn-master-build/ws/brooklyn-server/utils/common/target/brooklyn-utils-common-0.9.0-SNAPSHOT.jar>
to org.apache.brooklyn/brooklyn-utils-common/0.9.0-SNAPSHOT/brooklyn-utils-common-0.9.0-SNAPSHOT.jar
[JENKINS] Archiving <https://builds.apache.org/job/brooklyn-master-build/ws/brooklyn-server/utils/common/target/brooklyn-utils-common-0.9.0-SNAPSHOT-tests.jar>
to org.apache.brooklyn/brooklyn-utils-common/0.9.0-SNAPSHOT/brooklyn-utils-common-0.9.0-SNAPSHOT-tests.jar
[JENKINS] Archiving <https://builds.apache.org/job/brooklyn-master-build/ws/brooklyn-server/utils/common/target/brooklyn-utils-common-0.9.0-SNAPSHOT-sources.jar>
to org.apache.brooklyn/brooklyn-utils-common/0.9.0-SNAPSHOT/brooklyn-utils-common-0.9.0-SNAPSHOT-sources.jar
[JENKINS] Archiving <https://builds.apache.org/job/brooklyn-master-build/ws/brooklyn-server/utils/common/target/brooklyn-utils-common-0.9.0-SNAPSHOT-test-sources.jar>
to org.apache.brooklyn/brooklyn-utils-common/0.9.0-SNAPSHOT/brooklyn-utils-common-0.9.0-SNAPSHOT-test-sources.jar
[JENKINS] Archiving <https://builds.apache.org/job/brooklyn-master-build/ws/brooklyn-server/utils/groovy/pom.xml>
to org.apache.brooklyn/brooklyn-utils-groovy/0.9.0-SNAPSHOT/brooklyn-utils-groovy-0.9.0-SNAPSHOT.pom
[JENKINS] Archiving <https://builds.apache.org/job/brooklyn-master-build/ws/brooklyn-server/utils/groovy/target/brooklyn-utils-groovy-0.9.0-SNAPSHOT.jar>
to org.apache.brooklyn/brooklyn-utils-groovy/0.9.0-SNAPSHOT/brooklyn-utils-groovy-0.9.0-SNAPSHOT.jar
[JENKINS] Archiving <https://builds.apache.org/job/brooklyn-master-build/ws/brooklyn-server/utils/groovy/target/brooklyn-utils-groovy-0.9.0-SNAPSHOT-tests.jar>
to org.apache.brooklyn/brooklyn-utils-groovy/0.9.0-SNAPSHOT/brooklyn-utils-groovy-0.9.0-SNAPSHOT-tests.jar
[JENKINS] Archiving <https://builds.apache.org/job/brooklyn-master-build/ws/brooklyn-server/utils/groovy/target/brooklyn-utils-groovy-0.9.0-SNAPSHOT-sources.jar>
to org.apache.brooklyn/brooklyn-utils-groovy/0.9.0-SNAPSHOT/brooklyn-utils-groovy-0.9.0-SNAPSHOT-sources.jar
[JENKINS] Archiving <https://builds.apache.org/job/brooklyn-master-build/ws/brooklyn-server/utils/groovy/target/brooklyn-utils-groovy-0.9.0-SNAPSHOT-test-sources.jar>
to org.apache.brooklyn/brooklyn-utils-groovy/0.9.0-SNAPSHOT/brooklyn-utils-groovy-0.9.0-SNAPSHOT-test-sources.jar
[JENKINS] Archiving <https://builds.apache.org/job/brooklyn-master-build/ws/brooklyn-library/examples/simple-web-cluster/pom.xml>
to org.apache.brooklyn.example/brooklyn-example-simple-web-cluster/0.9.0-SNAPSHOT/brooklyn-example-simple-web-cluster-0.9.0-SNAPSHOT.pom
[JENKINS] Archiving <https://builds.apache.org/job/brooklyn-master-build/ws/brooklyn-server/locations/jclouds/pom.xml>
to org.apache.brooklyn/brooklyn-locations-jclouds/0.9.0-SNAPSHOT/brooklyn-locations-jclouds-0.9.0-SNAPSHOT.pom
[JENKINS] Archiving <https://builds.apache.org/job/brooklyn-master-build/ws/brooklyn-dist/downstream-parent/pom.xml>
to org.apache.brooklyn/brooklyn-downstream-parent/0.9.0-SNAPSHOT/brooklyn-downstream-parent-0.9.0-SNAPSHOT.pom
[JENKINS] Archiving <https://builds.apache.org/job/brooklyn-master-build/ws/brooklyn-library/software/database/pom.xml>
to org.apache.brooklyn/brooklyn-software-database/0.9.0-SNAPSHOT/brooklyn-software-database-0.9.0-SNAPSHOT.pom
[JENKINS] Archiving <https://builds.apache.org/job/brooklyn-master-build/ws/brooklyn-server/rest/rest-server/pom.xml>
to org.apache.brooklyn/brooklyn-rest-server/0.9.0-SNAPSHOT/brooklyn-rest-server-0.9.0-SNAPSHOT.pom
[JENKINS] Archiving <https://builds.apache.org/job/brooklyn-master-build/ws/brooklyn-library/qa/pom.xml>
to org.apache.brooklyn/brooklyn-qa/0.9.0-SNAPSHOT/brooklyn-qa-0.9.0-SNAPSHOT.pom
[JENKINS] Archiving <https://builds.apache.org/job/brooklyn-master-build/ws/brooklyn-server/rest/rest-client/pom.xml>
to org.apache.brooklyn/brooklyn-rest-client/0.9.0-SNAPSHOT/brooklyn-rest-client-0.9.0-SNAPSHOT.pom
[JENKINS] Archiving <https://builds.apache.org/job/brooklyn-master-build/ws/brooklyn-library/pom.xml>
to org.apache.brooklyn/brooklyn-library/0.9.0-SNAPSHOT/brooklyn-library-0.9.0-SNAPSHOT.pom
[JENKINS] Archiving <https://builds.apache.org/job/brooklyn-master-build/ws/brooklyn-server/utils/jmx/jmxmp-ssl-agent/pom.xml>
to org.apache.brooklyn/brooklyn-jmxmp-agent/0.9.0-SNAPSHOT/brooklyn-jmxmp-agent-0.9.0-SNAPSHOT.pom
[JENKINS] Archiving <https://builds.apache.org/job/brooklyn-master-build/ws/brooklyn-server/karaf/apache-brooklyn/pom.xml>
to org.apache.brooklyn/apache-brooklyn/0.9.0-SNAPSHOT/apache-brooklyn-0.9.0-SNAPSHOT.pom
[JENKINS] Archiving <https://builds.apache.org/job/brooklyn-master-build/ws/brooklyn-server/camp/camp-brooklyn/pom.xml>
to org.apache.brooklyn/brooklyn-camp/0.9.0-SNAPSHOT/brooklyn-camp-0.9.0-SNAPSHOT.pom
[JENKINS] Archiving <https://builds.apache.org/job/brooklyn-master-build/ws/brooklyn-server/utils/jmx/jmxrmi-agent/pom.xml>
to org.apache.brooklyn/brooklyn-jmxrmi-agent/0.9.0-SNAPSHOT/brooklyn-jmxrmi-agent-0.9.0-SNAPSHOT.pom
[JENKINS] Archiving <https://builds.apache.org/job/brooklyn-master-build/ws/brooklyn-library/examples/global-web-fabric/pom.xml>
to org.apache.brooklyn.example/brooklyn-example-global-web-fabric/0.9.0-SNAPSHOT/brooklyn-example-global-web-fabric-0.9.0-SNAPSHOT.pom
[JENKINS] Archiving <https://builds.apache.org/job/brooklyn-master-build/ws/brooklyn-dist/archetypes/quickstart/pom.xml>
to org.apache.brooklyn/brooklyn-archetype-quickstart/0.9.0-SNAPSHOT/brooklyn-archetype-quickstart-0.9.0-SNAPSHOT.pom
[JENKINS] Archiving <https://builds.apache.org/job/brooklyn-master-build/ws/brooklyn-library/software/nosql/pom.xml>
to org.apache.brooklyn/brooklyn-software-nosql/0.9.0-SNAPSHOT/brooklyn-software-nosql-0.9.0-SNAPSHOT.pom
[JENKINS] Archiving <https://builds.apache.org/job/brooklyn-master-build/ws/brooklyn-server/software/base/pom.xml>
to org.apache.brooklyn/brooklyn-software-base/0.9.0-SNAPSHOT/brooklyn-software-base-0.9.0-SNAPSHOT.pom
[JENKINS] Archiving <https://builds.apache.org/job/brooklyn-master-build/ws/brooklyn-dist/vagrant/pom.xml>
to org.apache.brooklyn/brooklyn-vagrant/0.9.0-SNAPSHOT/brooklyn-vagrant-0.9.0-SNAPSHOT.pom
[JENKINS] Archiving <https://builds.apache.org/job/brooklyn-master-build/ws/brooklyn-library/examples/webapps/hello-world-sql/pom.xml>
to org.apache.brooklyn.example/brooklyn-example-hello-world-sql-webapp/0.9.0-SNAPSHOT/brooklyn-example-hello-world-sql-webapp-0.9.0-SNAPSHOT.pom
[JENKINS] Archiving <https://builds.apache.org/job/brooklyn-master-build/ws/brooklyn-server/logging/logback-includes/pom.xml>
to org.apache.brooklyn/brooklyn-logback-includes/0.9.0-SNAPSHOT/brooklyn-logback-includes-0.9.0-SNAPSHOT.pom
[JENKINS] Archiving <https://builds.apache.org/job/brooklyn-master-build/ws/brooklyn-server/logging/logback-includes/target/brooklyn-logback-includes-0.9.0-SNAPSHOT.jar>
to org.apache.brooklyn/brooklyn-logback-includes/0.9.0-SNAPSHOT/brooklyn-logback-includes-0.9.0-SNAPSHOT.jar
[JENKINS] Archiving <https://builds.apache.org/job/brooklyn-master-build/ws/brooklyn-server/logging/logback-includes/target/brooklyn-logback-includes-0.9.0-SNAPSHOT-sources.jar>
to org.apache.brooklyn/brooklyn-logback-includes/0.9.0-SNAPSHOT/brooklyn-logback-includes-0.9.0-SNAPSHOT-sources.jar
[JENKINS] Archiving <https://builds.apache.org/job/brooklyn-master-build/ws/brooklyn-server/logging/logback-includes/target/brooklyn-logback-includes-0.9.0-SNAPSHOT-test-sources.jar>
to org.apache.brooklyn/brooklyn-logback-includes/0.9.0-SNAPSHOT/brooklyn-logback-includes-0.9.0-SNAPSHOT-test-sources.jar
[JENKINS] Archiving <https://builds.apache.org/job/brooklyn-master-build/ws/pom.xml>
to org.apache.brooklyn/brooklyn/0.9.0-SNAPSHOT/brooklyn-0.9.0-SNAPSHOT.pom
[JENKINS] Archiving <https://builds.apache.org/job/brooklyn-master-build/ws/brooklyn-server/utils/test-support/pom.xml>
to org.apache.brooklyn/brooklyn-utils-test-support/0.9.0-SNAPSHOT/brooklyn-utils-test-support-0.9.0-SNAPSHOT.pom
[JENKINS] Archiving <https://builds.apache.org/job/brooklyn-master-build/ws/brooklyn-server/utils/test-support/target/brooklyn-utils-test-support-0.9.0-SNAPSHOT.jar>
to org.apache.brooklyn/brooklyn-utils-test-support/0.9.0-SNAPSHOT/brooklyn-utils-test-support-0.9.0-SNAPSHOT.jar
[JENKINS] Archiving <https://builds.apache.org/job/brooklyn-master-build/ws/brooklyn-server/utils/test-support/target/brooklyn-utils-test-support-0.9.0-SNAPSHOT-sources.jar>
to org.apache.brooklyn/brooklyn-utils-test-support/0.9.0-SNAPSHOT/brooklyn-utils-test-support-0.9.0-SNAPSHOT-sources.jar
[JENKINS] Archiving <https://builds.apache.org/job/brooklyn-master-build/ws/brooklyn-server/utils/test-support/target/brooklyn-utils-test-support-0.9.0-SNAPSHOT-test-sources.jar>
to org.apache.brooklyn/brooklyn-utils-test-support/0.9.0-SNAPSHOT/brooklyn-utils-test-support-0.9.0-SNAPSHOT-test-sources.jar
[JENKINS] Archiving <https://builds.apache.org/job/brooklyn-master-build/ws/brooklyn-library/software/monitoring/pom.xml>
to org.apache.brooklyn/brooklyn-software-monitoring/0.9.0-SNAPSHOT/brooklyn-software-monitoring-0.9.0-SNAPSHOT.pom
[JENKINS] Archiving <https://builds.apache.org/job/brooklyn-master-build/ws/brooklyn-server/test-framework/pom.xml>
to org.apache.brooklyn/brooklyn-test-framework/0.9.0-SNAPSHOT/brooklyn-test-framework-0.9.0-SNAPSHOT.pom
[JENKINS] Archiving <https://builds.apache.org/job/brooklyn-master-build/ws/brooklyn-server/storage/hazelcast/pom.xml>
to org.apache.brooklyn/brooklyn-storage-hazelcast/0.9.0-SNAPSHOT/brooklyn-storage-hazelcast-0.9.0-SNAPSHOT.pom
[JENKINS] Archiving <https://builds.apache.org/job/brooklyn-master-build/ws/brooklyn-server/rest/rest-api/pom.xml>
to org.apache.brooklyn/brooklyn-rest-api/0.9.0-SNAPSHOT/brooklyn-rest-api-0.9.0-SNAPSHOT.pom
[JENKINS] Archiving <https://builds.apache.org/job/brooklyn-master-build/ws/brooklyn-server/karaf/commands/pom.xml>
to org.apache.brooklyn/brooklyn-commands/0.9.0-SNAPSHOT/brooklyn-commands-0.9.0-SNAPSHOT.pom
[JENKINS] Archiving <https://builds.apache.org/job/brooklyn-master-build/ws/brooklyn-library/software/messaging/pom.xml>
to org.apache.brooklyn/brooklyn-software-messaging/0.9.0-SNAPSHOT/brooklyn-software-messaging-0.9.0-SNAPSHOT.pom
[JENKINS] Archiving <https://builds.apache.org/job/brooklyn-master-build/ws/brooklyn-server/utils/rt-osgi/pom.xml>
to org.apache.brooklyn/brooklyn-rt-osgi/0.9.0-SNAPSHOT/brooklyn-rt-osgi-0.9.0-SNAPSHOT.pom
[JENKINS] Archiving <https://builds.apache.org/job/brooklyn-master-build/ws/brooklyn-server/utils/rt-osgi/target/brooklyn-rt-osgi-0.9.0-SNAPSHOT.jar>
to org.apache.brooklyn/brooklyn-rt-osgi/0.9.0-SNAPSHOT/brooklyn-rt-osgi-0.9.0-SNAPSHOT.jar
[JENKINS] Archiving <https://builds.apache.org/job/brooklyn-master-build/ws/brooklyn-server/utils/rt-osgi/target/brooklyn-rt-osgi-0.9.0-SNAPSHOT-tests.jar>
to org.apache.brooklyn/brooklyn-rt-osgi/0.9.0-SNAPSHOT/brooklyn-rt-osgi-0.9.0-SNAPSHOT-tests.jar
[JENKINS] Archiving <https://builds.apache.org/job/brooklyn-master-build/ws/brooklyn-server/utils/rt-osgi/target/brooklyn-rt-osgi-0.9.0-SNAPSHOT-sources.jar>
to org.apache.brooklyn/brooklyn-rt-osgi/0.9.0-SNAPSHOT/brooklyn-rt-osgi-0.9.0-SNAPSHOT-sources.jar
[JENKINS] Archiving <https://builds.apache.org/job/brooklyn-master-build/ws/brooklyn-server/utils/rt-osgi/target/brooklyn-rt-osgi-0.9.0-SNAPSHOT-test-sources.jar>
to org.apache.brooklyn/brooklyn-rt-osgi/0.9.0-SNAPSHOT/brooklyn-rt-osgi-0.9.0-SNAPSHOT-test-sources.jar
[JENKINS] Archiving <https://builds.apache.org/job/brooklyn-master-build/ws/brooklyn-library/examples/simple-nosql-cluster/pom.xml>
to org.apache.brooklyn.example/brooklyn-example-simple-nosql-cluster/0.9.0-SNAPSHOT/brooklyn-example-simple-nosql-cluster-0.9.0-SNAPSHOT.pom
[JENKINS] Archiving <https://builds.apache.org/job/brooklyn-master-build/ws/brooklyn-server/logging/logback-xml/pom.xml>
to org.apache.brooklyn/brooklyn-logback-xml/0.9.0-SNAPSHOT/brooklyn-logback-xml-0.9.0-SNAPSHOT.pom
[JENKINS] Archiving <https://builds.apache.org/job/brooklyn-master-build/ws/brooklyn-server/logging/logback-xml/target/brooklyn-logback-xml-0.9.0-SNAPSHOT.jar>
to org.apache.brooklyn/brooklyn-logback-xml/0.9.0-SNAPSHOT/brooklyn-logback-xml-0.9.0-SNAPSHOT.jar
[JENKINS] Archiving <https://builds.apache.org/job/brooklyn-master-build/ws/brooklyn-server/logging/logback-xml/target/brooklyn-logback-xml-0.9.0-SNAPSHOT-sources.jar>
to org.apache.brooklyn/brooklyn-logback-xml/0.9.0-SNAPSHOT/brooklyn-logback-xml-0.9.0-SNAPSHOT-sources.jar
[JENKINS] Archiving <https://builds.apache.org/job/brooklyn-master-build/ws/brooklyn-server/logging/logback-xml/target/brooklyn-logback-xml-0.9.0-SNAPSHOT-test-sources.jar>
to org.apache.brooklyn/brooklyn-logback-xml/0.9.0-SNAPSHOT/brooklyn-logback-xml-0.9.0-SNAPSHOT-test-sources.jar
[JENKINS] Archiving <https://builds.apache.org/job/brooklyn-master-build/ws/brooklyn-library/examples/webapps/pom.xml>
to org.apache.brooklyn.example/brooklyn-examples-webapps-parent/0.9.0-SNAPSHOT/brooklyn-examples-webapps-parent-0.9.0-SNAPSHOT.pom
[JENKINS] Archiving <https://builds.apache.org/job/brooklyn-master-build/ws/brooklyn-server/karaf/features/pom.xml>
to org.apache.brooklyn/brooklyn-features/0.9.0-SNAPSHOT/brooklyn-features-0.9.0-SNAPSHOT.pom
[JENKINS] Archiving <https://builds.apache.org/job/brooklyn-master-build/ws/brooklyn-server/camp/camp-server/pom.xml>
to org.apache.brooklyn.camp/camp-server/0.9.0-SNAPSHOT/camp-server-0.9.0-SNAPSHOT.pom
[JENKINS] Archiving <https://builds.apache.org/job/brooklyn-master-build/ws/brooklyn-server/camp/camp-server/target/camp-server-0.9.0-SNAPSHOT.jar>
to org.apache.brooklyn.camp/camp-server/0.9.0-SNAPSHOT/camp-server-0.9.0-SNAPSHOT.jar
[JENKINS] Archiving <https://builds.apache.org/job/brooklyn-master-build/ws/brooklyn-server/camp/camp-server/target/camp-server-0.9.0-SNAPSHOT-tests.jar>
to org.apache.brooklyn.camp/camp-server/0.9.0-SNAPSHOT/camp-server-0.9.0-SNAPSHOT-tests.jar
[JENKINS] Archiving <https://builds.apache.org/job/brooklyn-master-build/ws/brooklyn-server/camp/camp-server/target/camp-server-0.9.0-SNAPSHOT-sources.jar>
to org.apache.brooklyn.camp/camp-server/0.9.0-SNAPSHOT/camp-server-0.9.0-SNAPSHOT-sources.jar
[JENKINS] Archiving <https://builds.apache.org/job/brooklyn-master-build/ws/brooklyn-server/camp/camp-server/target/camp-server-0.9.0-SNAPSHOT-test-sources.jar>
to org.apache.brooklyn.camp/camp-server/0.9.0-SNAPSHOT/camp-server-0.9.0-SNAPSHOT-test-sources.jar
[JENKINS] Archiving <https://builds.apache.org/job/brooklyn-master-build/ws/brooklyn-library/examples/pom.xml>
to org.apache.brooklyn.example/brooklyn-examples-parent/0.9.0-SNAPSHOT/brooklyn-examples-parent-0.9.0-SNAPSHOT.pom
[JENKINS] Archiving <https://builds.apache.org/job/brooklyn-master-build/ws/brooklyn-library/software/webapp/pom.xml>
to org.apache.brooklyn/brooklyn-software-webapp/0.9.0-SNAPSHOT/brooklyn-software-webapp-0.9.0-SNAPSHOT.pom
[JENKINS] Archiving <https://builds.apache.org/job/brooklyn-master-build/ws/brooklyn-server/test-support/pom.xml>
to org.apache.brooklyn/brooklyn-test-support/0.9.0-SNAPSHOT/brooklyn-test-support-0.9.0-SNAPSHOT.pom
[JENKINS] Archiving <https://builds.apache.org/job/brooklyn-master-build/ws/brooklyn-server/test-support/target/brooklyn-test-support-0.9.0-SNAPSHOT.jar>
to org.apache.brooklyn/brooklyn-test-support/0.9.0-SNAPSHOT/brooklyn-test-support-0.9.0-SNAPSHOT.jar
[JENKINS] Archiving <https://builds.apache.org/job/brooklyn-master-build/ws/brooklyn-server/test-support/target/brooklyn-test-support-0.9.0-SNAPSHOT-sources.jar>
to org.apache.brooklyn/brooklyn-test-support/0.9.0-SNAPSHOT/brooklyn-test-support-0.9.0-SNAPSHOT-sources.jar
[JENKINS] Archiving <https://builds.apache.org/job/brooklyn-master-build/ws/brooklyn-server/test-support/target/brooklyn-test-support-0.9.0-SNAPSHOT-test-sources.jar>
to org.apache.brooklyn/brooklyn-test-support/0.9.0-SNAPSHOT/brooklyn-test-support-0.9.0-SNAPSHOT-test-sources.jar
[JENKINS] Archiving <https://builds.apache.org/job/brooklyn-master-build/ws/brooklyn-server/karaf/pom.xml>
to org.apache.brooklyn/brooklyn-karaf/0.9.0-SNAPSHOT/brooklyn-karaf-0.9.0-SNAPSHOT.pom
[JENKINS] Archiving <https://builds.apache.org/job/brooklyn-master-build/ws/brooklyn-server/utils/rt-felix/pom.xml>
to org.apache.brooklyn/brooklyn-rt-felix/0.9.0-SNAPSHOT/brooklyn-rt-felix-0.9.0-SNAPSHOT.pom
[JENKINS] Archiving <https://builds.apache.org/job/brooklyn-master-build/ws/brooklyn-server/utils/rt-felix/target/brooklyn-rt-felix-0.9.0-SNAPSHOT.jar>
to org.apache.brooklyn/brooklyn-rt-felix/0.9.0-SNAPSHOT/brooklyn-rt-felix-0.9.0-SNAPSHOT.jar
[JENKINS] Archiving <https://builds.apache.org/job/brooklyn-master-build/ws/brooklyn-server/utils/rt-felix/target/brooklyn-rt-felix-0.9.0-SNAPSHOT-tests.jar>
to org.apache.brooklyn/brooklyn-rt-felix/0.9.0-SNAPSHOT/brooklyn-rt-felix-0.9.0-SNAPSHOT-tests.jar
[JENKINS] Archiving <https://builds.apache.org/job/brooklyn-master-build/ws/brooklyn-server/utils/rt-felix/target/brooklyn-rt-felix-0.9.0-SNAPSHOT-sources.jar>
to org.apache.brooklyn/brooklyn-rt-felix/0.9.0-SNAPSHOT/brooklyn-rt-felix-0.9.0-SNAPSHOT-sources.jar
[JENKINS] Archiving <https://builds.apache.org/job/brooklyn-master-build/ws/brooklyn-server/utils/rt-felix/target/brooklyn-rt-felix-0.9.0-SNAPSHOT-test-sources.jar>
to org.apache.brooklyn/brooklyn-rt-felix/0.9.0-SNAPSHOT/brooklyn-rt-felix-0.9.0-SNAPSHOT-test-sources.jar
[JENKINS] Archiving <https://builds.apache.org/job/brooklyn-master-build/ws/brooklyn-server/karaf/itest/pom.xml>
to org.apache.brooklyn/brooklyn-itest/0.9.0-SNAPSHOT/brooklyn-itest-0.9.0-SNAPSHOT.pom
[JENKINS] Archiving <https://builds.apache.org/job/brooklyn-master-build/ws/brooklyn-server/software/winrm/pom.xml>
to org.apache.brooklyn/brooklyn-software-winrm/0.9.0-SNAPSHOT/brooklyn-software-winrm-0.9.0-SNAPSHOT.pom
[JENKINS] Archiving <https://builds.apache.org/job/brooklyn-master-build/ws/brooklyn-server/camp/camp-base/pom.xml>
to org.apache.brooklyn.camp/camp-base/0.9.0-SNAPSHOT/camp-base-0.9.0-SNAPSHOT.pom
[JENKINS] Archiving <https://builds.apache.org/job/brooklyn-master-build/ws/brooklyn-server/camp/camp-base/target/camp-base-0.9.0-SNAPSHOT.jar>
to org.apache.brooklyn.camp/camp-base/0.9.0-SNAPSHOT/camp-base-0.9.0-SNAPSHOT.jar
[JENKINS] Archiving <https://builds.apache.org/job/brooklyn-master-build/ws/brooklyn-server/camp/camp-base/target/camp-base-0.9.0-SNAPSHOT-tests.jar>
to org.apache.brooklyn.camp/camp-base/0.9.0-SNAPSHOT/camp-base-0.9.0-SNAPSHOT-tests.jar
[JENKINS] Archiving <https://builds.apache.org/job/brooklyn-master-build/ws/brooklyn-server/camp/camp-base/target/camp-base-0.9.0-SNAPSHOT-sources.jar>
to org.apache.brooklyn.camp/camp-base/0.9.0-SNAPSHOT/camp-base-0.9.0-SNAPSHOT-sources.jar
[JENKINS] Archiving <https://builds.apache.org/job/brooklyn-master-build/ws/brooklyn-server/camp/camp-base/target/camp-base-0.9.0-SNAPSHOT-test-sources.jar>
to org.apache.brooklyn.camp/camp-base/0.9.0-SNAPSHOT/camp-base-0.9.0-SNAPSHOT-test-sources.jar
[JENKINS] Archiving <https://builds.apache.org/job/brooklyn-master-build/ws/brooklyn-library/software/network/pom.xml>
to org.apache.brooklyn/brooklyn-software-network/0.9.0-SNAPSHOT/brooklyn-software-network-0.9.0-SNAPSHOT.pom
[JENKINS] Archiving <https://builds.apache.org/job/brooklyn-master-build/ws/brooklyn-dist/dist/pom.xml>
to org.apache.brooklyn/brooklyn-dist/0.9.0-SNAPSHOT/brooklyn-dist-0.9.0-SNAPSHOT.pom
[JENKINS] Archiving <https://builds.apache.org/job/brooklyn-master-build/ws/brooklyn-server/parent/pom.xml>
to org.apache.brooklyn/brooklyn-parent/0.9.0-SNAPSHOT/brooklyn-parent-0.9.0-SNAPSHOT.pom
Compressed 83.65 KB of artifacts by 76.5% relative to #3
[JENKINS] Archiving <https://builds.apache.org/job/brooklyn-master-build/ws/brooklyn-server/server-cli/pom.xml>
to org.apache.brooklyn/brooklyn-cli/0.9.0-SNAPSHOT/brooklyn-cli-0.9.0-SNAPSHOT.pom
[JENKINS] Archiving <https://builds.apache.org/job/brooklyn-master-build/ws/brooklyn-server/launcher/pom.xml>
to org.apache.brooklyn/brooklyn-launcher/0.9.0-SNAPSHOT/brooklyn-launcher-0.9.0-SNAPSHOT.pom
[JENKINS] Archiving <https://builds.apache.org/job/brooklyn-master-build/ws/brooklyn-server/utils/rest-swagger/pom.xml>
to org.apache.brooklyn/brooklyn-utils-rest-swagger/0.9.0-SNAPSHOT/brooklyn-utils-rest-swagger-0.9.0-SNAPSHOT.pom
[JENKINS] Archiving <https://builds.apache.org/job/brooklyn-master-build/ws/brooklyn-server/utils/rest-swagger/target/brooklyn-utils-rest-swagger-0.9.0-SNAPSHOT.jar>
to org.apache.brooklyn/brooklyn-utils-rest-swagger/0.9.0-SNAPSHOT/brooklyn-utils-rest-swagger-0.9.0-SNAPSHOT.jar
[JENKINS] Archiving <https://builds.apache.org/job/brooklyn-master-build/ws/brooklyn-server/utils/rest-swagger/target/brooklyn-utils-rest-swagger-0.9.0-SNAPSHOT-sources.jar>
to org.apache.brooklyn/brooklyn-utils-rest-swagger/0.9.0-SNAPSHOT/brooklyn-utils-rest-swagger-0.9.0-SNAPSHOT-sources.jar
[JENKINS] Archiving <https://builds.apache.org/job/brooklyn-master-build/ws/brooklyn-server/utils/rest-swagger/target/brooklyn-utils-rest-swagger-0.9.0-SNAPSHOT-test-sources.jar>
to org.apache.brooklyn/brooklyn-utils-rest-swagger/0.9.0-SNAPSHOT/brooklyn-utils-rest-swagger-0.9.0-SNAPSHOT-test-sources.jar
[JENKINS] Archiving <https://builds.apache.org/job/brooklyn-master-build/ws/brooklyn-dist/pom.xml>
to org.apache.brooklyn/brooklyn-dist-root/0.9.0-SNAPSHOT/brooklyn-dist-root-0.9.0-SNAPSHOT.pom
[JENKINS] Archiving <https://builds.apache.org/job/brooklyn-master-build/ws/brooklyn-server/camp/pom.xml>
to org.apache.brooklyn.camp/camp-parent/0.9.0-SNAPSHOT/camp-parent-0.9.0-SNAPSHOT.pom
[JENKINS] Archiving <https://builds.apache.org/job/brooklyn-master-build/ws/brooklyn-dist/all/pom.xml>
to org.apache.brooklyn/brooklyn-all/0.9.0-SNAPSHOT/brooklyn-all-0.9.0-SNAPSHOT.pom
[JENKINS] Archiving <https://builds.apache.org/job/brooklyn-master-build/ws/brooklyn-server/api/pom.xml>
to org.apache.brooklyn/brooklyn-api/0.9.0-SNAPSHOT/brooklyn-api-0.9.0-SNAPSHOT.pom
[JENKINS] Archiving <https://builds.apache.org/job/brooklyn-master-build/ws/brooklyn-server/api/target/brooklyn-api-0.9.0-SNAPSHOT.jar>
to org.apache.brooklyn/brooklyn-api/0.9.0-SNAPSHOT/brooklyn-api-0.9.0-SNAPSHOT.jar
[JENKINS] Archiving <https://builds.apache.org/job/brooklyn-master-build/ws/brooklyn-server/api/target/brooklyn-api-0.9.0-SNAPSHOT-sources.jar>
to org.apache.brooklyn/brooklyn-api/0.9.0-SNAPSHOT/brooklyn-api-0.9.0-SNAPSHOT-sources.jar
[JENKINS] Archiving <https://builds.apache.org/job/brooklyn-master-build/ws/brooklyn-server/api/target/brooklyn-api-0.9.0-SNAPSHOT-test-sources.jar>
to org.apache.brooklyn/brooklyn-api/0.9.0-SNAPSHOT/brooklyn-api-0.9.0-SNAPSHOT-test-sources.jar
channel stopped

Mime
View raw message